{"text_format":"1","workbook":"xlsx","n_sheets":30,"sheets":["0 START","1 Preferences","2 Specification","2a Site and stand","2b Environment","2ca Felling and processing","2cb Extracting","2cc Bundling","2cd Chipping","2ce Transporting","3 Report","3a Supply chain comparison","Productivity calculation","Supply chains","Values","Emissions","Contribution margin","Employment","Accidents","3b Details A","3b Details B","3b Details C","3b Details D","3b Details F","Specifications","Energy content","Energy efficiency","3c Costs","-","Damage"],"not_rendered":{"charts":11,"images":116,"macros":1,"external_links":1,"defined_names":82,"comments":0,"pivot_tables":0},"unopened":[],"bounds":{"document_bytes":16777216,"sheet_cells":100000,"rows_first":2000,"rows_last":500,"rows_between":2000,"halvings":0,"cell_chars":16384,"cell_head_chars":4096},"cells_cut":0,"cells_raw":0,"read":"whole","date_system":"1900"}

{"sheet":"0 START","index":0,"n_rows":34,"n_cols":2,"rows_kept":34,"cut":false,"hidden":false,"merged":[]}
[]
[]
[]
[]
[]
[null,"A multi-criteria analysis estimates the best suitable energy-wood supply system and their impacts on evaluation criteria. The developed tool is made up of three stages. After inserting user preferences by criteria weighting, input data for site, stand, environment and machine conditions will be selected. Finally, a report shows the results on screen."]
[]
[]
[]
[]
[]
[]
[]
[]
[]
[]
[]
[]
[]
[]
[]
[]
[]
[]
[null," (It is recommended to activate Macros for successfully running the analysis tool!)"]
[]
[null,"© Institut of Forest Engineering, Department of Forest- and Soil Sciences, University of Natural Resources and"]
[null,"   Life Sciences"]
[null,"   Peter-Jordan-Strasse 82/3, 1190 Vienna"]
[null,"   www.boku.ac.at/forstt"]
[null,"   Further questions: martin.kuehmaier@boku.ac.at"]
[null,"   Version 2.6 (June 2013)"]
[]
[null,"Developed within the research project \"Development of a model for eco-efficient supply of woody biomass\", first call of the research program \"Neue Energien 2020\", funded by FFG and Klima- und Energiefonds"]

{"sheet":"1 Preferences","index":1,"n_rows":22,"n_cols":7,"rows_kept":22,"cut":false,"hidden":true,"merged":[[18,3,18,4],[20,3,20,4],[21,3,21,4],[14,3,14,4],[4,1,4,6],[12,3,12,4],[13,3,13,4],[15,3,15,4],[17,3,17,4]]}
[]
[null,"(1) Weighting of evaluation criteria"]
[]
[]
[null,"Weighting of evaluation criteria follows the user's preferences according to ecological, economic and social aspects. Absolute values will be transferred into percentage values."]
[]
[]
[null,"Ecology",null,null,null,{"$f":"G8/(G8+G9+G10)","v":0.33333333333333331},1]
[null,"Economy",null,null,null,{"$f":"G9/(G8+G9+G10)","v":0.33333333333333331},1]
[null,"Social sustainability",null,null,null,{"$f":"G10/(G8+G9+G10)","v":0.33333333333333331},1]
[]
[]
[null,"   Nutrient balance","↓","[Nutrient loss in kg/ha-1]",null,{"$f":"$F$8*G13/($G$13+$G$14+$G$15+$G$16)","v":8.3333333333333329E-2},1]
[null,"   Soil stability","↓","[Bearing pressure in kPa]",null,{"$f":"$F$8*G14/($G$13+$G$14+$G$15+$G$16)","v":8.3333333333333329E-2},1]
[null,"   Energy efficiency","↓","[MWh/MWh]",null,{"$f":"$F$8*G15/($G$13+$G$14+$G$15+$G$16)","v":8.3333333333333329E-2},1]
[null,"   Stand vitality","↓","[Damage in %]",null,{"$f":"$F$8*G16/($G$13+$G$14+$G$15+$G$16)","v":8.3333333333333329E-2},1]
[]
[null,"   Contribution margin","↑","[€/MWh]",null,{"$f":"F9*G18/(G18+G19)","v":0.16666666666666666},1]
[null,"   Supply guarantee","↑","[-]",null,{"$f":"F9*G19/(G18+G19)","v":0.16666666666666666},1]
[]
[null,"   Employment","↑","[Operating time in h/MWh]",null,{"$f":"$F$10*G21/($G$21+$G$22)","v":0.16666666666666666},1]
[null,"   Working safety","↑","[-]",null,{"$f":"$F$10*G22/($G$21+$G$22)","v":0.16666666666666666},1]

{"sheet":"2 Specification","index":2,"n_rows":5,"n_cols":2,"rows_kept":5,"cut":false,"hidden":true,"merged":[]}
[]
[null,"(2) Specification"]
[]
[]
[null,"Specification defines the technological limits and provides input data for the evaluation of supply chains. Therefore site, stand and environmental conditions will be used as well as machine data. The value of the specification influences the performance of the supply chains."]

{"sheet":"2a Site and stand","index":3,"n_rows":23,"n_cols":4,"rows_kept":23,"cut":false,"hidden":true,"merged":[[3,1,3,3]]}
[]
[null,"(2a) Specification - Site & Stand"]
[]
[null,"Site and stand data determine the technical applicability and allows a pre-selection of potential supply chains. For further calculations only feasible systems will be considered. "]
[]
[]
[null,"Accessibility",null,"no restrictions"]
[]
[null,"Bearing capacity",null,"no restrictions"]
[]
[null,"Slope [%]",null,"no restrictions"]
[]
[null,"Extraction distance",null,"no restrictions"]
[]
[null,"DBH [cm]",null,15]
[]
[null,"Soil type",null,"no restrictions"]
[]
[null,"Tree species"]
[null,null,"Percentage"]
[null,"Tree species 1",75,"Norway Spruce"]
[null,"Tree species 2",20,"Beech"]
[null,"Tree species 3",5,"Ash"]

{"sheet":"2b Environment","index":4,"n_rows":29,"n_cols":4,"rows_kept":29,"cut":false,"hidden":true,"merged":[[3,1,3,3]]}
[]
[null,"(2b) Specification - Environment"]
[]
[null,"Additional information about supply chains which is not related to site, stand and machine data is described as environmental specification. This input data is used to characterize a supply chain more precisely."]
[]
[]
[null,"Utilization amount [m³]",null,280]
[]
[null,"Distance - Direct transport [km]",null,38]
[null,"Distance - Forest-Terminal [km]",null,12]
[null,"Distance - Terminal-Plant [km]",null,30]
[]
[null,"Water content - fresh [%]",null,55]
[null,"Water content - dry [%]",null,30]
[]
[null,"Chipping on forest road",null,"no restrictions"]
[null,"Chipping at terminal",null,"no restrictions"]
[null,"Chipping at plant",null,"no restrictions"]
[]
[null,"Storage costs - Terminal [€/m³]",null,3]
[null,"Storage costs - Plant [€/m³]",null,1]
[]
[null,"Relevance of by-production [%]",null,0.1]
[]
[null,"Purchase price [€/m³]",null,1.5]
[]
[null,"Administration costs [%]",null,0.04]
[]
[null,"Revenues [€/MWh]",null,20]

{"sheet":"2ca Felling and processing","index":5,"n_rows":50,"n_cols":6,"rows_kept":50,"cut":false,"hidden":true,"merged":[[48,1,49,1],[22,1,23,1],[28,4,29,4],[28,5,29,5],[28,1,29,1],[38,5,39,5],[15,5,16,5],[18,1,19,1],[18,4,19,4],[38,1,39,1],[18,5,19,5],[3,1,3,5],[63,6,63,7],[64,6,64,7],[48,4,49,4],[48,5,49,5],[6,1,7,1],[42,1,43,1],[32,1,33,1],[15,1,16,1],[12,1,13,1],[12,4,13,4],[12,5,13,5],[9,4,9,5],[10,4,10,5],[38,4,39,4],[15,4,16,4]]}
[]
[null,"(2c) Specification: Felling & Processing"]
[]
[null,"To describe efficiency of felling/delimbing/crosscutting processes data about fuel consumption, system costs and productivity may be inserted. Productivity can be calculated on an additional work sheet. The calculation of costs is presented only for plausibility check."]
[]
[]
[null,"Chain Saw",0.53]
[null,null,"Fuel consumption l/h"]
[]
[null,null,35.5]
[null,null,"System costs €/h"]
[]
[null,"a) Felling",3,null,"EURO/m³",{"$f":"C10/C13*(1+GKZ)","v":12.306666666666668}]
[null,null,"Productivity m³/h"]
[]
[null,"b) Felling & delimbing",2,null,"EURO/m³",{"$f":"C10/C16*(1+GKZ)","v":18.46}]
[null,null,"Productivity m³/h"]
[]
[null,"c) Felling, delimbing & crosscutting",1.5,null,"EURO/m³",{"$f":"C10/C19*(1+GKZ)","v":24.613333333333337}]
[null,null,"Productivity m³/h"]
[]
[]
[null,"Feller buncher",6.5]
[null,null,"Fuel consumption l/h"]
[]
[null,null,130]
[null,null,"System costs €/h"]
[]
[null,"Felling",5.8,null,"EURO/m³",{"$f":"C26/C29*(1+GKZ)","v":23.31034482758621}]
[null,null,"Productivity m³/h"]
[]
[]
[null,"Harvester",15.6]
[null,null,"Fuel consumption l/h"]
[]
[null,null,102]
[null,null,"System costs €/h"]
[]
[null,"Felling, delimbing & crosscutting",8.6999999999999993,null,"EURO/m³",{"$f":"C36/C39*(1+GKZ)","v":12.193103448275863}]
[null,null,"Productivity m³/h"]
[]
[]
[null,"Processor",8]
[null,null,"Fuel consumption l/h"]
[]
[null,null,110]
[null,null,"System costs €/h"]
[]
[null,"Delimbing & crosscutting",10,null,"EURO/m³",{"$f":"C46/C49*(1+GKZ)","v":11.440000000000001}]
[null,null,"Productivity m³/h"]

{"sheet":"2cb Extracting","index":6,"n_rows":60,"n_cols":6,"rows_kept":60,"cut":false,"hidden":true,"merged":[[58,5,59,5],[29,5,30,5],[42,4,42,5],[36,1,37,1],[45,1,46,1],[29,1,30,1],[52,1,53,1],[58,1,59,1],[58,4,59,4],[3,1,3,5],[43,4,43,5],[45,4,46,4],[45,5,46,5],[19,1,20,1],[19,4,20,4],[19,5,20,5],[32,1,33,1],[32,4,33,4],[32,5,33,5],[29,4,30,4],[13,5,14,5],[7,1,8,1],[23,1,24,1],[13,1,14,1],[16,1,17,1],[4,1,4,5],[16,5,17,5],[48,1,49,1],[48,4,49,4],[48,5,49,5],[16,4,17,4],[13,4,14,4]]}
[]
[null,"(2c) Specification: Extracting"]
[]
[null,"To describe efficiency of extracting processes data about fuel consumption, system costs and productivity may be inserted. Productivity can be calculated on an additional work sheet. The calculation of costs is presented only for plausibility check."]
[null,"For the extraction process a differentiation between logs/stems (=biomass as round wood without branches and top), harvesting residues (=branches and top), trees/logs & residues (=stem, branches and top) and chips (=chipped biomass) has been made."]
[]
[]
[null,"Forwarder",11.1]
[null,null,"Fuel consumption l/h"]
[]
[null,null,77]
[null,null,"System costs €/h"]
[]
[null,"a) Logs",10.7,null,"EURO/m³",{"$f":"C11/C14*(1+GKZ)","v":7.4841121495327103}]
[null,null,"Productivity m³/h"]
[]
[null,"b) Harvesting residues",3,null,"EURO/m³",{"$f":"C11/C17*(1+GKZ)","v":26.693333333333335}]
[null,null,"Productivity m³/h"]
[]
[null,"c) Logs & residues",5.5,null,"EURO/m³",{"$f":"C11/C20*(1+GKZ)","v":14.56}]
[null,null,"Productivity m³/h"]
[]
[]
[null,"Skidder",7.32]
[null,null,"Fuel consumption l/h"]
[]
[null,null,78]
[null,null,"System costs €/h"]
[]
[null,"a) Stems",9,null,"EURO/m³",{"$f":"C27/C30*(1+GKZ)","v":9.0133333333333336}]
[null,null,"Productivity m³/h"]
[]
[null,"b) Trees",10,null,"EURO/m³",{"$f":"C27/C33*(1+GKZ)","v":8.1120000000000001}]
[null,null,"Productivity m³/h"]
[]
[]
[null,"Tower Yarder",16]
[null,null,"Fuel consumption l/h"]
[]
[null,null,145]
[null,null,"System costs €/h"]
[]
[null,null,16]
[null,null,"Installation h"]
[]
[null,"a) Stems",6,null,"EURO/m³",{"$f":"(C40/C46+(C43*32+C43*0.25*C40)/'2b Environment'!D7)*(1+GKZ)","v":29.189333333333334}]
[null,null,"Productivity m³/h"]
[]
[null,"b) Trees",6,null,"EURO/m³",{"$f":"(C40/C49+(C43*32+C43*0.25*C40)/'2b Environment'!D7)*(1+GKZ)","v":29.189333333333334}]
[null,null,"Productivity m³/h"]
[]
[]
[null,"Shuttle for wood chips",10]
[null,null,"Fuel consumption l/h"]
[]
[null,null,88]
[null,null,"System costs €/h"]
[]
[null,"Chips",17.100000000000001,null,"EURO/m³",{"$f":"C56/C59*(1+GKZ)","v":5.3520467836257311}]
[null,null,"Productivity m³/h"]

{"sheet":"2cc Bundling","index":7,"n_rows":14,"n_cols":6,"rows_kept":14,"cut":false,"hidden":true,"merged":[[3,1,3,5],[6,1,7,1],[17,6,17,7],[12,4,13,4],[12,5,13,5],[12,1,13,1]]}
[]
[null,"(2c) Specification: Bundling"]
[]
[null,"To describe efficiency of bundling processes data about fuel consumption, system costs and productivity may be inserted. Productivity can be calculated on an additional work sheet. The calculation of costs is presented only for plausibility check."]
[]
[]
[null,"Bundler",11.5]
[null,null,"Fuel consumption l/h"]
[]
[null,null,120]
[null,null,"System costs €/h"]
[]
[null,"Harvesting residues",4.9000000000000004,null,"EURO/m³",{"$f":"C10/C13*(1+GKZ)","v":25.469387755102041}]
[null,null,"Productivity m³/h"]

{"sheet":"2cd Chipping","index":8,"n_rows":53,"n_cols":6,"rows_kept":53,"cut":false,"hidden":true,"merged":[[35,5,36,5],[38,4,39,4],[38,5,39,5],[35,1,36,1],[51,4,52,4],[51,5,52,5],[41,1,42,1],[41,4,42,4],[41,5,42,5],[7,1,8,1],[19,4,20,4],[13,4,14,4],[51,1,52,1],[45,1,46,1],[38,1,39,1],[35,4,36,4],[4,1,4,5],[13,5,14,5],[32,4,33,4],[3,1,3,5],[32,5,33,5],[22,1,23,1],[22,4,23,4],[22,5,23,5],[19,5,20,5],[19,1,20,1],[16,1,17,1],[16,4,17,4],[16,5,17,5],[26,1,27,1],[32,1,33,1],[13,1,14,1]]}
[]
[null,"(2c) Specification: Chipping"]
[]
[null,"To describe efficiency of chipping processes data about fuel consumption, system costs and productivity may be inserted. Productivity can be calculated on an additional work sheet. The calculation of costs is presented only for plausibility check."]
[null,"For the chipping process a differentiation between logs (=biomass as round wood without branches and top), harvesting residues (=branches and top), trees/logs & residues (=stem, branches and top) and bundles (=compacted branches and tops) has been made."]
[]
[]
[null,"Tractor & chipper",34.799999999999997]
[null,null,"Fuel consumption l/h"]
[]
[null,null,140]
[null,null,"System costs €/h"]
[]
[null,"a) Logs",67,null,"EURO/m³ loose",{"$f":"C11/C14*(1+GKZ)","v":2.1731343283582087}]
[null,null,"Productivity m³ loose/h"]
[]
[null,"b) Harvesting residues",26,null,"EURO/m³ loose",{"$f":"C11/C17*(1+GKZ)","v":5.6000000000000005}]
[null,null,"Productivity m³ loose/h"]
[]
[null,"c) Bundles",54,null,"EURO/m³ loose",{"$f":"C11/C20*(1+GKZ)","v":2.6962962962962962}]
[null,null,"Productivity m³ loose/h"]
[]
[null,"d) Trees or logs & residues",29,null,"EURO/m³ loose",{"$f":"C11/C23*(1+GKZ)","v":5.0206896551724141}]
[null,null,"Productivity m³ loose/h"]
[]
[]
[null,"Chippertruck",40.479999999999997]
[null,null,"Fuel consumption l/h"]
[]
[null,null,220]
[null,null,"System costs €/h"]
[]
[null,"a) Logs",134,null,"EURO/m³ loose",{"$f":"C30/C33*(1+GKZ)","v":1.7074626865671643}]
[null,null,"Productivity m³ loose/h"]
[]
[null,"b) Harvesting residues",52,null,"EURO/m³ loose",{"$f":"C30/C36*(1+GKZ)","v":4.4000000000000004}]
[null,null,"Productivity m³ loose/h"]
[]
[null,"c) Bundles",108,null,"EURO/m³ loose",{"$f":"C30/C39*(1+GKZ)","v":2.1185185185185187}]
[null,null,"Productivity m³ loose/h"]
[]
[null,"d) Trees or logs & residues",85,null,"EURO/m³ loose",{"$f":"C30/C42*(1+GKZ)","v":2.6917647058823531}]
[null,null,"Productivity m³ loose/h"]
[]
[]
[null,"Mobile chipper",28]
[null,null,"Fuel consumption l/h"]
[]
[null,null,155]
[null,null,"System costs €/h"]
[]
[null,"Trees (stand)",17,null,"EURO/m³ loose",{"$f":"C49/C52*(1+GKZ)","v":9.4823529411764707}]
[null,null,"Productivity m³ loose/h"]

{"sheet":"2ce Transporting","index":9,"n_rows":88,"n_cols":5,"rows_kept":88,"cut":false,"hidden":true,"merged":[[46,3,46,4],[56,3,56,4],[53,3,53,4],[54,3,54,4],[66,1,67,2],[63,1,64,2],[63,4,64,4],[66,3,67,3],[66,4,67,4],[63,3,64,3],[57,3,57,4],[3,1,3,4],[9,3,9,4],[10,3,10,4],[20,3,20,4],[21,3,21,4],[4,1,4,4],[12,3,12,4],[13,3,13,4],[69,1,70,2],[78,4,79,4],[72,1,73,2],[72,3,73,3],[69,4,70,4],[75,3,76,3],[69,3,70,3],[72,4,73,4],[23,3,23,4],[24,3,24,4],[34,3,34,4],[35,3,35,4],[45,3,45,4],[43,3,43,4],[42,3,42,4],[31,3,31,4],[32,3,32,4],[87,1,88,1],[81,1,82,1],[75,4,76,4],[78,3,79,3],[87,3,88,3],[87,4,88,4],[84,1,85,1],[84,3,85,3],[84,4,85,4],[81,3,82,3],[81,4,82,4],[75,1,76,2],[78,1,79,2]]}
[]
[null,"(2c) Specification: Transport"]
[]
[null,"To describe efficiency of transport processes data about fuel consumption, system costs, loading and unloading time, stacked volume and maximum payload may be inserted. The calculation of costs is presented only for plausibility check."]
[null,"For the transport process a differentation between logs (=biomass as round wood without branches and top), harvesting residues (=branches and top), logs & residues (=stem, branches and top), bundles (=compacted branches and tops) and chips (=chipped biomass) has been made."]
[]
[]
[null,"Transportation of logs"]
[]
[null,40,null,50]
[null,"Fuel consumption l/100 km",null,"Stacked volume m³"]
[]
[null,80,null,18]
[null,"System costs €/h",null,"Max. payload t"]
[]
[null,1.5]
[null,"Loading and unloading time h"]
[]
[null,"Transportation of harvesting residues"]
[]
[null,25,null,25]
[null,"Fuel consumption l/100 km",null,"Stacked volume m³"]
[]
[null,65,null,10]
[null,"System costs €/h",null,"Max. payload t"]
[]
[null,0.7]
[null,"Loading and unloading time h"]
[]
[null,"Transportation of bundles"]
[]
[null,40,null,50]
[null,"Fuel consumption l/100 km",null,"Stacked volume m³"]
[]
[null,80,null,18]
[null,"System costs €/h",null,"Max. payload t"]
[]
[null,1.5]
[null,"Loading and unloading time h"]
[]
[null,"Transportation of logs & residues"]
[]
[null,25,null,25]
[null,"Fuel consumption l/100 km",null,"Stacked volume m³"]
[]
[null,65,null,10]
[null,"System costs €/h",null,"Max. payload t"]
[]
[null,0.7]
[null,"Loading and unloading time h"]
[]
[null,"Transportation of chips"]
[]
[null,50,null,90]
[null,"Fuel consumption l/100 km",null,"Stacked volume m³"]
[]
[null,67,null,20]
[null,"System costs €/h",null,"Max. payload t"]
[]
[null,0.9]
[null,"Loading and unloading time h"]
[]
[]
[null,"a) Logs - (via terminal) - chips",null,"EURO/MWh",{"$f":"('Contribution margin'!E119+'Contribution margin'!F121)*(1+GKZ)","v":5.5354864780069164}]
[]
[]
[null,"b) Harvesting residues - (via terminal) - chips",null,"EURO/MWh",{"$f":"('Contribution margin'!E120+'Contribution margin'!F121)*(1+GKZ)","v":6.4319682098183808}]
[]
[]
[null,"c) Bundles - (via terminal) - chips",null,"EURO/MWh",{"$f":"('Contribution margin'!E123+'Contribution margin'!F121)*(1+GKZ)","v":6.101296734821533}]
[]
[]
[null,"d) Logs & residues - (via terminal) - chips",null,"EURO/MWh",{"$f":"('Contribution margin'!E122+'Contribution margin'!F121)*(1+GKZ)","v":6.3962774518549592}]
[]
[]
[null,"e) Logs (direct transport)",null,"EURO/MWh",{"$f":"'Contribution margin'!G119*(1+GKZ)","v":4.7078071624458993}]
[]
[]
[null,"f) Harvesting residues (direct transport)",null,"EURO/MWh",{"$f":"'Contribution margin'!G120*(1+GKZ)","v":7.8490143135597128}]
[]
[]
[null,"g) Bundles (direct transport)",null,"EURO/MWh",{"$f":"'Contribution margin'!G123*(1+GKZ)","v":5.3777620681018146}]
[]
[]
[null,"h) Logs & residues (direct transport)",null,"EURO/MWh",{"$f":"'Contribution margin'!G122*(1+GKZ)","v":6.3306102375175906}]
[]
[]
[null,"i) Chips (direct transport)",null,"EURO/MWh",{"$f":"'Contribution margin'!G121*(1+GKZ)","v":1.813651270855581}]

{"sheet":"3 Report","index":10,"n_rows":5,"n_cols":2,"rows_kept":5,"cut":false,"hidden":true,"merged":[]}
[]
[null,"(3) Report"]
[]
[]
[null,"The report shows the performance of supply chains with regard to their utility value, which is calculated from specification data and considering criteria weights. Additionally, the costs of individually compiled supply chains and a cost comparison with other energy sources will be delivered."]

{"sheet":"3a Supply chain comparison","index":11,"n_rows":70,"n_cols":10,"rows_kept":70,"cut":false,"hidden":true,"merged":[[49,2,49,7],[51,7,52,7],[51,2,52,2],[51,3,52,3],[51,4,52,4],[51,5,52,5],[51,6,52,6],[4,7,5,7],[3,1,3,7],[26,2,26,4],[26,5,26,7],[4,2,5,2],[4,3,5,3],[4,4,5,4],[4,5,5,5],[4,6,5,6]]}
[]
[null,"(3a) Comparison of supply chains"]
[]
[null,"This comparison shows a ranking of six energy wood supply chain categories by kind of utility values. Graphs and tables give a better understanding of the calculation and show the composition of utility values ​​and the impacts on the evaluation criteria."]
[null,null,"Category A","Category B","Category C","Category D","Category E","Category F"]
[]
[null,"    Harvesting system","Felling, (delimbing and crosscutting) with chain saw, extracting with forwarder","Felling, delimbing and crosscutting with harvester, extracting with forwarder","Felling (and delimbing) with chain saw, extracting with tower yarder, (delimbing and crosscutting with processor)","Felling (and delimbing) with chain saw, extracting with skidder, (delimbing and crosscutting with processor)","Felling with feller-buncher, chipping with mobile chipper, extracting with shuttle","Felling with feller-buncher, extracting with forwarder"]
[null,"    Working method",{"$f":"HLOOKUP(1,'3b Details A'!$C$8:$M$22,2,FALSE)","v":"Cut-to-length"},{"$f":"HLOOKUP(1,'3b Details B'!$C$8:$M$22,2,FALSE)","v":"Cut-to-length"},{"$f":"HLOOKUP(1,'3b Details C'!$C$8:$M$22,2,FALSE)","v":"Tree-length"},{"$f":"HLOOKUP(1,'3b Details D'!$C$8:$M$22,2,FALSE)","v":"Tree-length"},"Wood chips",{"$f":"HLOOKUP(1,'3b Details F'!$C$8:$E$22,2,FALSE)","v":"Whole-tree"}]
[null,"    Bundling",{"$f":"HLOOKUP(1,'3b Details A'!$C$8:$M$22,3,FALSE)","v":"no"},{"$f":"HLOOKUP(1,'3b Details B'!$C$8:$M$22,3,FALSE)","v":"no"},{"$f":"HLOOKUP(1,'3b Details C'!$C$8:$M$22,3,FALSE)","v":"no"},{"$f":"HLOOKUP(1,'3b Details D'!$C$8:$M$22,3,FALSE)","v":"no"},"no",{"$f":"HLOOKUP(1,'3b Details F'!$C$8:$E$22,3,FALSE)","v":"no"}]
[null,"    Kind of energy wood",{"$f":"HLOOKUP(1,'3b Details A'!$C$8:$M$22,4,FALSE)","v":"Logs"},{"$f":"HLOOKUP(1,'3b Details B'!$C$8:$M$22,4,FALSE)","v":"Logs"},{"$f":"HLOOKUP(1,'3b Details C'!$C$8:$M$22,4,FALSE)","v":"Logs"},{"$f":"HLOOKUP(1,'3b Details D'!$C$8:$M$22,4,FALSE)","v":"Logs"},"Trees",{"$f":"HLOOKUP(1,'3b Details F'!$C$8:$E$22,4,FALSE)","v":"Logs & residues"}]
[null,"    Chipping location",{"$f":"HLOOKUP(1,'3b Details A'!$C$8:$M$22,5,FALSE)","v":"Plant"},{"$f":"HLOOKUP(1,'3b Details B'!$C$8:$M$22,5,FALSE)","v":"Plant"},{"$f":"HLOOKUP(1,'3b Details C'!$C$8:$M$22,5,FALSE)","v":"Plant"},{"$f":"HLOOKUP(1,'3b Details D'!$C$8:$M$22,5,FALSE)","v":"Plant"},"Stand",{"$f":"HLOOKUP(1,'3b Details F'!$C$8:$E$22,5,FALSE)","v":"Plant"}]
[null,"    Nutrient loss",{"$f":"HLOOKUP(1,'3b Details A'!$C$8:$M$22,6,FALSE)","v":4.2499999999999996E-2},{"$f":"HLOOKUP(1,'3b Details B'!$C$8:$M$22,6,FALSE)","v":4.2499999999999996E-2},{"$f":"HLOOKUP(1,'3b Details C'!$C$8:$M$22,6,FALSE)","v":4.2499999999999996E-2},{"$f":"HLOOKUP(1,'3b Details D'!$C$8:$M$22,6,FALSE)","v":4.2499999999999996E-2},{"$f":"IF(Specifications!$I$2=TRUE,'Supply chains'!$AO$48,'Supply chains'!$AE$48)","v":2.1666666666666667E-2},{"$f":"HLOOKUP(1,'3b Details F'!$C$8:$E$22,6,FALSE)","v":2.1666666666666667E-2},{"$f":"RANK(C23,$C$23:$H$23,0)","v":2},"Category A"]
[null,"    Bearing pressure",{"$f":"HLOOKUP(1,'3b Details A'!$C$8:$M$22,7,FALSE)","v":3.3333333333333333E-2},{"$f":"HLOOKUP(1,'3b Details B'!$C$8:$M$22,7,FALSE)","v":3.3333333333333333E-2},{"$f":"HLOOKUP(1,'3b Details C'!$C$8:$M$22,7,FALSE)","v":8.1666666666666665E-2},{"$f":"HLOOKUP(1,'3b Details D'!$C$8:$M$22,7,FALSE)","v":4.4999999999999998E-2},{"$f":"IF(Specifications!$I$2=TRUE,'Supply chains'!$AP$48,'Supply chains'!$AF$48)","v":0.03},{"$f":"HLOOKUP(1,'3b Details F'!$C$8:$E$22,7,FALSE)","v":3.3333333333333333E-2},{"$f":"RANK(D23,$C$23:$H$23,0)","v":1},"Category B"]
[null,"    Energy efficiency",{"$f":"HLOOKUP(1,'3b Details A'!$C$8:$M$22,8,FALSE)","v":8.3333333333333329E-2},{"$f":"HLOOKUP(1,'3b Details B'!$C$8:$M$22,8,FALSE)","v":7.3297278899032897E-2},{"$f":"HLOOKUP(1,'3b Details C'!$C$8:$M$22,8,FALSE)","v":7.0882622694484781E-2},{"$f":"HLOOKUP(1,'3b Details D'!$C$8:$M$22,8,FALSE)","v":8.3333333333333329E-2},{"$f":"IF(Specifications!$I$2=TRUE,'Supply chains'!$AW$48,'Supply chains'!$AM$48)","v":4.1390655223250583E-2},{"$f":"HLOOKUP(1,'3b Details F'!$C$8:$E$22,8,FALSE)","v":5.5847599197249444E-2},{"$f":"RANK(E23,$C$23:$H$23,0)","v":4},"Category C"]
[null,"    Damage on remaining stand",{"$f":"HLOOKUP(1,'3b Details A'!$C$8:$M$22,9,FALSE)","v":6.5833333333333327E-2},{"$f":"HLOOKUP(1,'3b Details B'!$C$8:$M$22,9,FALSE)","v":8.1833333333333313E-2},{"$f":"HLOOKUP(1,'3b Details C'!$C$8:$M$22,9,FALSE)","v":4.2812500000000003E-2},{"$f":"HLOOKUP(1,'3b Details D'!$C$8:$M$22,9,FALSE)","v":4.2812500000000003E-2},{"$f":"IF(Specifications!$I$2=TRUE,'Supply chains'!$AR$48,'Supply chains'!$AH$48)","v":5.2808333333333332E-2},{"$f":"HLOOKUP(1,'3b Details F'!$C$8:$E$22,9,FALSE)","v":7.5833333333333322E-2},{"$f":"RANK(F23,$C$23:$H$23,0)","v":3},"Category D"]
[null," SUM ECOLOGY",{"$f":"SUM(C12:C15)","v":0.22500000000000001},{"$f":"SUM(D12:D15)","v":0.23096394556569955},{"$f":"SUM(E12:E15)","v":0.23786178936115146},0.21364583333333334,0.14586565522325057,0.18668093253058277]
[null,"    Contribution margin",{"$f":"HLOOKUP(1,'3b Details A'!$C$8:$M$22,11,FALSE)","v":4.1966251879936675E-2},{"$f":"HLOOKUP(1,'3b Details B'!$C$8:$M$22,11,FALSE)","v":9.6914445186212977E-2},{"$f":"HLOOKUP(1,'3b Details C'!$C$8:$M$22,11,FALSE)","v":0},{"$f":"HLOOKUP(1,'3b Details D'!$C$8:$M$22,11,FALSE)","v":6.2423732185362485E-2},{"$f":"IF(Specifications!$I$2=TRUE,'Supply chains'!$AS$48,'Supply chains'!$AI$48)","v":0},{"$f":"HLOOKUP(1,'3b Details F'!$C$8:$E$22,11,FALSE)","v":0},{"$f":"RANK(G23,$C$23:$H$23,0)","v":6},"Category E"]
[null,"    Supply guarantee",{"$f":"HLOOKUP(1,'3b Details A'!$C$8:$M$22,12,FALSE)","v":0.16666666666666666},{"$f":"HLOOKUP(1,'3b Details B'!$C$8:$M$22,12,FALSE)","v":0.16666666666666666},{"$f":"HLOOKUP(1,'3b Details C'!$C$8:$M$22,12,FALSE)","v":0.16666666666666666},{"$f":"HLOOKUP(1,'3b Details D'!$C$8:$M$22,12,FALSE)","v":0.16666666666666666},{"$f":"IF(Specifications!$I$2=TRUE,'Supply chains'!$AT$48,'Supply chains'!$AJ$48)","v":0},{"$f":"HLOOKUP(1,'3b Details F'!$C$8:$E$22,12,FALSE)","v":0.13333333333333333},{"$f":"RANK(H23,$C$23:$H$23,0)","v":5},"Category F"]
[null," SUM ECONOMY",{"$f":"SUM(C17:C18)","v":0.20863291854660332},{"$f":"SUM(D17:D18)","v":0.26358111185287963},{"$f":"SUM(E17:E18)","v":0.16666666666666666},0.22909039885202914,0,0.13333333333333333]
[null,"    Employment",{"$f":"HLOOKUP(1,'3b Details A'!$C$8:$M$22,14,FALSE)","v":0.15667730015200035},{"$f":"HLOOKUP(1,'3b Details B'!$C$8:$M$22,14,FALSE)","v":5.9042248745275541E-2},{"$f":"HLOOKUP(1,'3b Details C'!$C$8:$M$22,14,FALSE)","v":0.16666666666666666},{"$f":"HLOOKUP(1,'3b Details D'!$C$8:$M$22,14,FALSE)","v":0.14013865242539392},{"$f":"IF(Specifications!$I$2=TRUE,'Supply chains'!$AU$48,'Supply chains'!$AK$48)","v":7.5559843456961734E-2},{"$f":"HLOOKUP(1,'3b Details F'!$C$8:$E$22,14,FALSE)","v":0.10518744793315844}]
[null,"    Working safety",{"$f":"HLOOKUP(1,'3b Details A'!$C$8:$M$22,15,FALSE)","v":8.6761039886039892E-2},{"$f":"HLOOKUP(1,'3b Details B'!$C$8:$M$22,15,FALSE)","v":0.16666666666666666},{"$f":"HLOOKUP(1,'3b Details C'!$C$8:$M$22,15,FALSE)","v":1.6014194139194138E-2},{"$f":"HLOOKUP(1,'3b Details D'!$C$8:$M$22,15,FALSE)","v":1.6014194139194138E-2},{"$f":"IF(Specifications!$I$2=TRUE,'Supply chains'!$AV$48,'Supply chains'!$AL$48)","v":0.15224358974358973},{"$f":"HLOOKUP(1,'3b Details F'!$C$8:$E$22,15,FALSE)","v":0.15224358974358973}]
[null," SUM SOCIAL",{"$f":"SUM(C20:C21)","v":0.24343834003804024},0.22570891541194221,0.1826808608058608,0.15615284656458805,0.22780343320055146,0.25743103767674819]
[null,"    UTILITY VALUE",{"$f":"C16+C19+C22","v":0.67707125858464356},0.72025397283052139,0.58720931683367894,0.59888907874995057,0.37366908842380203,0.57744530354066437]
[null,"    RANK",{"$f":"RANK(C23,$C$23:$H$23,0)","v":2},1,4,3,6,5]
[]
[]
[null,null,"Best suitable supply chain:",null,null,{"$f":"VLOOKUP(1,I12:J18,2,FALSE)","v":"Category B"}]
[]
[]
[]
[]
[]
[]
[]
[]
[]
[]
[]
[]
[]
[]
[]
[]
[]
[]
[]
[]
[]
[]
[null,null,"A utility value of 0 indicates that the system is technically not applicable. These restrictions are determined by the entered site & stand specification data."]
[]
[null,null,"Category A","Category B","Category C","Category D","Category E","Category F"]
[null,"Trade-offs"]
[]
[null,"   Nutrient loss [kg/ha]",{"$f":"HLOOKUP(1,'3b Details A'!$C$51:$M$68,3,FALSE)","v":640},{"$f":"HLOOKUP(1,'3b Details B'!$C$51:$M$68,3,FALSE)","v":640},{"$f":"HLOOKUP(1,'3b Details C'!$C$51:$M$68,3,FALSE)","v":640},{"$f":"HLOOKUP(1,'3b Details D'!$C$51:$M$68,3,FALSE)","v":640},{"$f":"Values!$K$47","v":960},{"$f":"HLOOKUP(1,'3b Details F'!$C$50:$E$67,3,FALSE)","v":960}]
[null,"   Bearing pressure [kPa]",{"$f":"HLOOKUP(1,'3b Details A'!$C$51:$M$68,4,FALSE)","v":300},{"$f":"HLOOKUP(1,'3b Details B'!$C$51:$M$68,4,FALSE)","v":300},{"$f":"HLOOKUP(1,'3b Details C'!$C$51:$M$68,4,FALSE)","v":10},{"$f":"HLOOKUP(1,'3b Details D'!$C$51:$M$68,4,FALSE)","v":230},{"$f":"Values!L47","v":320},{"$f":"HLOOKUP(1,'3b Details F'!$C$50:$E$67,4,FALSE)","v":300}]
[null,"   Emissions [kg CO2/m³ loose]",{"$f":"HLOOKUP(1,'3b Details A'!$C$51:$M$68,5,FALSE)","v":2.9520224431133464},{"$f":"HLOOKUP(1,'3b Details B'!$C$51:$M$68,5,FALSE)","v":4.5162330178259902},{"$f":"HLOOKUP(1,'3b Details C'!$C$51:$M$68,5,FALSE)","v":4.5902191409326614},{"$f":"HLOOKUP(1,'3b Details D'!$C$51:$M$68,5,FALSE)","v":2.6330991409326607},{"$f":"Values!M47","v":6.7131259947509641},{"$f":"HLOOKUP(1,'3b Details F'!$C$50:$E$67,5,FALSE)","v":5.378924330067349}]
[null,"   Energy demand [KWh/m³ loose]",{"$f":"HLOOKUP(1,'3b Details A'!$C$51:$M$68,6,FALSE)","v":12.113841301153586},{"$f":"HLOOKUP(1,'3b Details B'!$C$51:$M$68,6,FALSE)","v":17.791220979314506},{"$f":"HLOOKUP(1,'3b Details C'!$C$51:$M$68,6,FALSE)","v":18.446177949128664},{"$f":"HLOOKUP(1,'3b Details D'!$C$51:$M$68,6,FALSE)","v":10.736311282461996},{"$f":"Values!$X$47","v":26.445647858109851},{"$f":"HLOOKUP(1,'3b Details F'!$C$50:$E$67,6,FALSE)","v":21.189701906325919}]
[null,"   Energy efficiency [%]",{"$f":"HLOOKUP(1,'3b Details A'!$C$51:$M$68,7,FALSE)","v":0.98392218904986251},{"$f":"HLOOKUP(1,'3b Details B'!$C$51:$M$68,7,FALSE)","v":0.97638702040365188},{"$f":"HLOOKUP(1,'3b Details C'!$C$51:$M$68,7,FALSE)","v":0.97551774417001447},{"$f":"HLOOKUP(1,'3b Details D'!$C$51:$M$68,7,FALSE)","v":0.98575048336774773},{"$f":"1-Values!$Y$47","v":0.96490063588037023},{"$f":"HLOOKUP(1,'3b Details F'!$C$50:$E$67,7,FALSE)","v":0.97187646652534287}]
[null,"   Damage on remaining stand [%]",{"$f":"HLOOKUP(1,'3b Details A'!$C$51:$M$68,8,FALSE)","v":0.184},{"$f":"HLOOKUP(1,'3b Details B'!$C$51:$M$68,8,FALSE)","v":0.1072},{"$f":"HLOOKUP(1,'3b Details C'!$C$51:$M$68,8,FALSE)","v":0.29449999999999998},{"$f":"HLOOKUP(1,'3b Details D'!$C$51:$M$68,8,FALSE)","v":0.29449999999999998},{"$f":"Values!N47","v":0.24651999999999999},{"$f":"HLOOKUP(1,'3b Details F'!$C$50:$E$67,8,FALSE)","v":0.13600000000000001}]
[null,"      Purchase [€/m³ loose]",{"$f":"HLOOKUP(1,'3b Details A'!$C$51:$M$68,9,FALSE)","v":0.45207054637186034},{"$f":"HLOOKUP(1,'3b Details B'!$C$51:$M$68,9,FALSE)","v":0.45207054637186034},{"$f":"HLOOKUP(1,'3b Details C'!$C$51:$M$68,9,FALSE)","v":0.45207054637186034},{"$f":"HLOOKUP(1,'3b Details D'!$C$51:$M$68,9,FALSE)","v":0.45207054637186034},{"$f":"Values!$O$47","v":0.45207054637186034},{"$f":"HLOOKUP(1,'3b Details F'!$C$50:$E$67,9,FALSE)","v":0.45207054637186034}]
[null,"      Felling and delimbing [€/m³ loose]",{"$f":"HLOOKUP(1,'3b Details A'!$C$51:$M$68,10,FALSE)","v":9.8453333333333362},{"$f":"HLOOKUP(1,'3b Details B'!$C$51:$M$68,10,FALSE)","v":4.8772413793103455},{"$f":"HLOOKUP(1,'3b Details C'!$C$51:$M$68,10,FALSE)","v":7.3840000000000012},{"$f":"HLOOKUP(1,'3b Details D'!$C$51:$M$68,10,FALSE)","v":7.3840000000000012},{"$f":"Values!$P$47","v":9.3241379310344854},{"$f":"HLOOKUP(1,'3b Details F'!$C$50:$E$67,10,FALSE)","v":9.3241379310344854}]
[null,"      Extracting [€/m³ loose]",{"$f":"HLOOKUP(1,'3b Details A'!$C$51:$M$68,11,FALSE)","v":2.9936448598130845},{"$f":"HLOOKUP(1,'3b Details B'!$C$51:$M$68,11,FALSE)","v":2.9936448598130845},{"$f":"HLOOKUP(1,'3b Details C'!$C$51:$M$68,11,FALSE)","v":11.675733333333334},{"$f":"HLOOKUP(1,'3b Details D'!$C$51:$M$68,11,FALSE)","v":3.6053333333333337},{"$f":"Values!$Q$47","v":2.140818713450293},{"$f":"HLOOKUP(1,'3b Details F'!$C$50:$E$67,11,FALSE)","v":5.8240000000000007}]
[null,"      Bundling [€/m³ loose]",{"$f":"HLOOKUP(1,'3b Details A'!$C$51:$M$68,12,FALSE)","v":0},{"$f":"HLOOKUP(1,'3b Details B'!$C$51:$M$68,12,FALSE)","v":0},{"$f":"HLOOKUP(1,'3b Details C'!$C$51:$M$68,12,FALSE)","v":0},{"$f":"HLOOKUP(1,'3b Details D'!$C$51:$M$68,12,FALSE)","v":0},{"$f":"Values!$R$47","v":0},{"$f":"HLOOKUP(1,'3b Details F'!$C$50:$E$67,12,FALSE)","v":0}]
[null,"      Chipping [€/m³ loose]",{"$f":"HLOOKUP(1,'3b Details A'!$C$51:$M$68,13,FALSE)","v":1.7074626865671643},{"$f":"HLOOKUP(1,'3b Details B'!$C$51:$M$68,13,FALSE)","v":1.7074626865671643},{"$f":"HLOOKUP(1,'3b Details C'!$C$51:$M$68,13,FALSE)","v":1.7074626865671643},{"$f":"HLOOKUP(1,'3b Details D'!$C$51:$M$68,13,FALSE)","v":1.7074626865671643},{"$f":"Values!$S$47","v":9.4823529411764707},{"$f":"HLOOKUP(1,'3b Details F'!$C$50:$E$67,13,FALSE)","v":2.6917647058823531}]
[null,"      Transporting [€/m³ loose]",{"$f":"HLOOKUP(1,'3b Details A'!$C$51:$M$68,14,FALSE)","v":3.4106746091991589},{"$f":"HLOOKUP(1,'3b Details B'!$C$51:$M$68,14,FALSE)","v":3.4106746091991589},{"$f":"HLOOKUP(1,'3b Details C'!$C$51:$M$68,14,FALSE)","v":3.4106746091991589},{"$f":"HLOOKUP(1,'3b Details D'!$C$51:$M$68,14,FALSE)","v":3.4106746091991589},{"$f":"Values!$T$47","v":1.3139396168969573},{"$f":"HLOOKUP(1,'3b Details F'!$C$50:$E$67,14,FALSE)","v":4.633924106420003}]
[null,"      Storing [€/m³ loose]",{"$f":"HLOOKUP(1,'3b Details A'!$C$51:$M$68,15,FALSE)","v":0.4},{"$f":"HLOOKUP(1,'3b Details B'!$C$51:$M$68,15,FALSE)","v":0.4},{"$f":"HLOOKUP(1,'3b Details C'!$C$51:$M$68,15,FALSE)","v":0.4},{"$f":"HLOOKUP(1,'3b Details D'!$C$51:$M$68,15,FALSE)","v":0.4},{"$f":"Values!$U$47","v":0.4},{"$f":"HLOOKUP(1,'3b Details F'!$C$50:$E$67,15,FALSE)","v":1.6}]
[null,"   Supply costs [€/m³ loose]",{"$f":"HLOOKUP(1,'3b Details A'!$C$51:$M$68,16,FALSE)","v":18.809186035284604},{"$f":"HLOOKUP(1,'3b Details B'!$C$51:$M$68,16,FALSE)","v":13.841094081261613},{"$f":"HLOOKUP(1,'3b Details C'!$C$51:$M$68,16,FALSE)","v":25.029941175471517},{"$f":"HLOOKUP(1,'3b Details D'!$C$51:$M$68,16,FALSE)","v":16.959541175471514},{"$f":"SUM(G61:G67)","v":23.113319748930063},{"$f":"HLOOKUP(1,'3b Details F'!$C$50:$E$67,16,FALSE)","v":24.525897289708706}]
[null,"   Contribution margin [€/m³ loose]",{"$f":"HLOOKUP(1,'3b Details A'!$C$51:$M$68,17,FALSE)","v":-3.7401678228892554},{"$f":"HLOOKUP(1,'3b Details B'!$C$51:$M$68,17,FALSE)","v":1.2279241311337314},{"$f":"HLOOKUP(1,'3b Details C'!$C$51:$M$68,17,FALSE)","v":-9.96092296307617},{"$f":"HLOOKUP(1,'3b Details D'!$C$51:$M$68,17,FALSE)","v":-1.8905229630761717},{"$f":"Values!$V$47","v":-8.0443015365347197},{"$f":"HLOOKUP(1,'3b Details F'!$C$50:$E$67,17,FALSE)","v":-9.4568790773133582}]
[null,"   Working hours [h/m³ loose]",{"$f":"HLOOKUP(1,'3b Details A'!$C$51:$M$68,18,FALSE)","v":0.3541459634189138},{"$f":"HLOOKUP(1,'3b Details B'!$C$51:$M$68,18,FALSE)","v":0.13345630824650001},{"$f":"HLOOKUP(1,'3b Details C'!$C$51:$M$68,18,FALSE)","v":0.38342945251548699},{"$f":"HLOOKUP(1,'3b Details D'!$C$51:$M$68,18,FALSE)","v":0.31676278584882034},{"$f":"Values!$W$47","v":0.17079189857680463},{"$f":"HLOOKUP(1,'3b Details F'!$C$50:$E$67,18,FALSE)","v":0.22422977455382093}]

{"sheet":"Productivity calculation","index":12,"n_rows":182,"n_cols":10,"rows_kept":182,"cut":false,"hidden":true,"merged":[]}
[]
[null,"Auxiliary sheet for calculating productivity"]
[]
[]
[null,"Chain Saw (Felling)",{"$f":"IF(C8=\"Softwood\",60/(J17*J22*2*EXP(2.4291*C7^(-0.1596)-0.9108)),60/(J17*J22*0.00236*EXP(6.9216*C7^(-0.0634)+1)))","v":3.0731135826660205},"[m³/h]"]
[null,"according to Erni et al. (2003)"]
[null,"Stem volume",0.2,"[m³]"]
[null,"Tree species","Softwood"]
[null,"M5 (Slope)","0-30","[%]"]
[null,"M6 (Barriers)","low"]
[]
[null,"Chain Saw (Felling & Delimbing)",{"$f":"60/(1.35/C14*(3.3229+5.6851*C14^0.7+0.1087*C14^0.7*C15+3.2479*C14^0.7*D16-1.7506*C14^0.7*D17))","v":2.7335955333392468},"[m³/h]"]
[null,"according to Stampfer (2002)",null,null,null,null,"Hardwood","M5","0-30",{"$f":"IF($C$9=I13,1,0)","v":1}]
[null,"Tree volume",1.2,"[m³]",null,null,"Softwood",null,"31-50",{"$f":"IF($C$9=I14,1.05,0)","v":0}]
[null,"Branch percentage",65,"[%]",null,null,null,null,"51-70",{"$f":"IF($C$9=I15,1.1,0)","v":0}]
[null,"Harvesting method","CTL",{"$f":"IF(C16=\"TL\",0,1)","v":1},null,null,null,null,">70",{"$f":"IF($C$9=I16,1.25,0)","v":0}]
[null,"Manipulation of branches","no",{"$f":"IF(C17=\"yes\",0,1)","v":1},null,null,null,null,null,{"$f":"SUM(J13:J16)","v":1}]
[null,null,null,null,null,null,null,"M6","no",{"$f":"IF($C$10=I18,1,0)","v":0}]
[null,"Wheeled harvester",{"$f":"(-3.87+11.43*C21^0.25-3.5*(0.44*(C24-111.75)/29.07+0.34*(C25-9.43)/0.98+0.45*(C26-126.6)/40.31+0.39*(C27-30.69)/6.63+0.41*(C28-51.06)/8.74+0.39*(C29-20.69)/2.91+4.1)^0.4+10.06*C21^0.25*(0.44*(C24-111.75)/29.07+0.34*(C25-9.43)/0.98+0.45*(C26-126.6)/40.31+0.39*(C27-30.69)/6.63+0.41*(C28-51.06)/8.74+0.39*(C29-20.69)/2.91+4.1)^0.4+0.52*(0.27*(C24-111.75)/29.07-0.65*(C25-9.43)/0.98+0.02*(C26-126.6)/40.31-0.49*(C27-30.69)/6.63+0.34*(C28-51.06)/8.74+0.38*(C29-20.69)/2.91)+1.01*D22)*1/(1-C23)","v":12.331217535210756},"[m³/h]",null,null,null,null,"low",{"$f":"IF($C$10=I19,1.05,0)","v":1.05}]
[null,"according to Heinimann (1998)",null,null,null,null,null,null,"moderate",{"$f":"IF($C$10=I20,1.1,0)","v":0}]
[null,"Stem volume",0.3,"[m³]",null,null,null,null,"heavy",{"$f":"IF($C$10=I21,1.2,0)","v":0}]
[null,"Tree species","Spruce",{"$f":"IF(C22=\"Spruce\",0,1)","v":0},null,null,null,null,null,{"$f":"SUM(J18:J21)","v":1.05}]
[null,"Bark percentage",0.1,"[%]",null,null,null,"M1","0-33"]
[null,"Engine power",114,"[kW]",null,null,null,null,"34-50"]
[null,"Crane range",10.3,"[m]",null,null,null,null,"50-66"]
[null,"Lift moment (HM)",147,"[kNm]",null,null,null,null,"66-90"]
[null,"Swing torque",31,"[kNm]",null,null,null,null,">90"]
[null,"Maximum felling diameter",40,"[cm]"]
[null,"Fedding power",21,"[kN]",null,null,null,"M3","4-6"]
[]
[null,"Wheeled harvester Ponsse Buffalo Dual",{"$f":"60/(1.3*(2.2344*C33^-0.563+2.1128*EXP(-0.35*C34-0.01*C35)))","v":9.0881426975501007},"[m³/h]",null,null,null,null,"6-10"]
[null,"according to Affenzeller (2005)",null,null,null,"CTL",null,null,">10"]
[null,"Tree volume",0.31,"[m³]",null,"TL"]
[null,"Processed stems per stop",2.1,"[n]",null,null,null,"M4","yes"]
[null,"Removal percentage",29,"[%]",null,null,null,null,"no"]
[]
[null,"Tracked harvester"]
[null,"IMPEX Königstiger",{"$f":"60/1.35/(EXP(-2.7743+0.0014*C44-0.2685*C42+0.0353*C43)+0.4179+0.9973*C45^(-0.75))","v":16.979870588840523},"[m³/h]",null,null,null,null,"Spruce"]
[null,"MHT Robin",{"$f":"60/1.35/(EXP(1.1004-0.2782*C42+0.0109*C43-0.1366*C46)+3.9553+0.6606*C45^(-0.8)-0.0279*C47)","v":8.5248019391042149},"[m³/h]",null,null,null,null,"Pine"]
[null,"Neuson 11002 HV",{"$f":"60/1.35/(EXP(0.2934-0.3874*C42+0.0001*C44*C42)+1.9747+0.7938*C45^(-0.9)-0.034*C47)","v":15.008668209182749},"[m³/h]",null,null,null,null,"Larch"]
[null,"according to Stampfer (2001)"]
[null,"Processed stems per stop",4.5199999999999996,"[n]"]
[null,"Slope",30,"[%]"]
[null,"Stand density",1000,"[n/ha]"]
[null,"Tree volume",0.4,"[m³]"]
[null,"Bearing capacity",2.35,"% CBR"]
[null,"Removal percentage",35,"[%]"]
[]
[null,"Feller buncher",{"$f":"60/1.3/(0.511*C51^-0.9+1.88+2.1)","v":5.1291746468200516},"[m³/h]"]
[null,"according to Rottensteiner & Stampfer (2010)"]
[null,"Tree volume",7.9000000000000001E-2,"[m³]"]
[]
[null,"Forwarder and Feller buncher",{"$f":"60/1.3/((2.249+C55^-0.9*0.362+1.8073)*C59/C60+(6.774+C55^-0.9*0.267)*C58/C60+1.1238+0.028*C56/C57+1.1401+1.4951)","v":3.3024754012208999},"[m³/h]"]
[null,"according to Affenzeller & Stampfer (2008)"]
[null,"Tree volume",5.7000000000000002E-2,"[m³]"]
[null,"Extraction distance",89,"[m]"]
[null,"Loading volume",3.71,"[m³]"]
[null,"Removed volume without trail wood",80,"[m³]"]
[null,"Removed volume of trail wood",83,"[m³]"]
[null,"Total removed wood",163,"[m³]"]
[]
[null,"Tractor and timber trailer with guillotine blade aggregate",{"$f":"60/1.2/(-9.699+C64^-0.8*1.554+C67*1.262+4.953+C64^-0.9*0.488+C65*0.0778/C66+2.3045+2.9344)","v":1.3486220544993506},"[m³/h]"]
[null,"according to Affenzeller & Stampfer (2007)"]
[null,"Tree volume",4.5999999999999999E-2,"[m³]"]
[null,"Extraction distance",109.5,"[m]"]
[null,"Loading volume",2.37,"[m³]"]
[null,"Crane range",5.5,"[m]"]
[]
[null,"Forwarder Ponsse Buffalo Dual",{"$f":"60/(1.23*(0.511*C71^(-0.7)+(0.023*C72+0.24*C73)/C73+0.8145))","v":11.92988370958135},"[m³/h]"]
[null,"according to Affenzeller (2005)"]
[null,"Piece volume",0.1,"[m³]"]
[null,"Extraction distance",170,"[m]"]
[null,"Loading volume",8.26,"[m³]"]
[]
[null,"Skidder",{"$f":"(5.47+5.45*C77^0.8-0.17*C78+1.6*C79*C77^0.8-0.005*C80)/1.27","v":8.0147508376352992},"[m³/h]"]
[null,"according to Daxner et al. (1997)"]
[null,"Piece volume",0.52,"[m³]"]
[null,"Lateral yarding distance",8.24,"[m]"]
[null,"Loading volume",3.68,"[m³]"]
[null,"Extraction distance",122,"[m]"]
[]
[null,"Timber trailer Patu MD",{"$f":"60/(1.2*(4.953+C84^-0.9*0.488+C86*0.0778/C85+2.9344+2.3045))","v":2.505672831556832},"[m³/h]"]
[null,"according to Affenzeller (2007)"]
[null,"Tree volume",0.06,"[m³]"]
[null,"Loading volume",2.34,"[m³]"]
[null,"Extraction distance",109,"[m]"]
[]
[null,"Tower yarder"]
[null,"CUT-TO-LENGTH",{"$f":"60/(1.25*(-0.7548+0.0122*C92+0.7782*C93^-1.05+0.0377*C94))","v":8.7794169877963899},"[m³/h]"]
[null,"TREE-LENGTH",{"$f":"60/(1.25*(0.3735+0.0093*C92+3.7204*C93^-1.05+1.5296*D95))","v":3.1265794306913257},"[m³/h]"]
[null,"according to Stampfer et al. (2003)"]
[null,"Extraction distance",88,"[m]"]
[null,"Piece volume",0.28000000000000003,"[m³]"]
[null,"Slope",58,"[%]"]
[null,"Silviculture","Final cut",{"$f":"IF(C95=\"Final cut\",0,1)","v":0}]
[]
[null,"Tower yarder"]
[null,"MOUNTING",{"$f":"EXP(1.42+0.00229*C101+0.0297*C102+0.256*D103-0.65*D104+0.111*D105+0.491*D104*D105)","v":13.112946177155655},"[h]"]
[null,"DISMOUNTING",{"$f":"EXP(0.957+0.00233*C101-0.301*D104-0.312*D106+0.328*D105)","v":6.6127526209434224},"[h]"]
[null,"according to Stampfer et al. (2003)"]
[null,"Length of skyline trail",400,"[m]"]
[null,"Height of first support tree",8,"[m]"]
[null,"Kind of skyline trail","First trail",{"$f":"IF(C103=\"First trail\",0,1)","v":0}]
[null,"Extraction direction","Downhill",{"$f":"IF(C104=\"Downhill\",0,1)","v":0}]
[null,"Pulling force","≤ 35 kN",{"$f":"IF(C105=\"≤ 35 kN\",0,1)","v":0}]
[null,"Support tree","yes",{"$f":"IF(C106=\"yes\",0,1)","v":0}]
[]
[null,"Tower yarder & processor"]
[null,"Tower Yarder Wanderfalke & processor Woody 50",{"$f":"0.8*(-8.881+27.545*C113^0.2-0.0000545*C112^2-0.0539*C115-0.0677*C114)","v":6.2836906109939896},"[m³/h]"]
[null,"Tower Yarder Syncrofalke & processor Wolf 50 B",{"$f":"0.8*(-22.7713+41.8961*C113^0.15-0.0046*C112-0.0897*C114)","v":4.98795389495581},"[m³/h]"]
[null,"according to Stampfer et al. (2003)"]
[null,"Extraction distance",88,"[m]"]
[null,"Piece volume",0.28000000000000003,"[m³]"]
[null,"Slope",58,"[%]"]
[null,"Lateral yarding distance",5,"[m]"]
[]
[null,"Chipper",{"$f":"-30.85+165.48*C119-74.33*C119^2+48.8*D120-10.48*D121","v":98.61999999999999},"[m³ loose/h]"]
[null,"according to Stampfer et al. (1997)"]
[null,"Amount of processed timber per cycle",1,"[m³]"]
[null,"Size of chipper","medium",{"$f":"IF(C120=\"small\",0,1)","v":1}]
[null,"Kind of chipping material","Logs",{"$f":"IF(C121=\"Sortimente\",0,1)","v":1}]
[]
[]
[]
[]
[]
[]
[]
[]
[]
[]
[]
[]
[]
[]
[]
[]
[]
[]
[]
[]
[]
[]
[null,null,null,null,null,"Final cut"]
[null,null,null,null,null,"Increment"]
[]
[]
[]
[]
[]
[null,null,null,null,null,"First trail"]
[null,null,null,null,null,"Subsequent trail"]
[null,null,null,null,null,"Uphill"]
[null,null,null,null,null,"Downhill"]
[]
[]
[null,null,null,null,null,"≤ 35 kN"]
[null,null,null,null,null,"> 35 kN"]
[]
[]
[]
[]
[null,null,null,null,null,"Femelschlag"]
[null,null,null,null,null,"Kahlschlag"]
[]
[null,null,null,null,null,"unerfahren"]
[null,null,null,null,null,"erfahren"]
[]
[]
[]
[]
[]
[]
[]
[]
[]
[]
[null,null,null,null,null,"Logs"]
[null,null,null,null,null,"Trees"]
[]
[null,null,null,null,null,"small"]
[null,null,null,null,null,"medium"]

{"sheet":"Supply chains","index":13,"n_rows":51,"n_cols":49,"rows_kept":51,"cut":false,"hidden":true,"merged":[[4,3,4,4],[5,3,5,4],[8,3,8,4],[1,28,2,28],[1,24,2,24],[1,25,2,25],[1,26,2,26],[1,27,2,27],[1,20,2,20],[1,21,2,21],[1,22,2,22],[3,3,3,4],[1,23,2,23],[1,3,2,6],[1,9,2,9],[6,3,6,4],[15,3,15,4],[16,3,16,4],[36,3,36,4],[14,3,14,4],[25,3,25,4],[26,3,26,4],[27,3,27,4],[50,3,50,4],[48,3,48,4],[24,3,24,4],[20,3,20,4],[21,3,21,4],[22,3,22,4],[23,3,23,4],[37,3,37,4],[38,3,38,4],[1,29,2,29],[0,30,0,38],[0,40,0,48],[1,0,2,0],[49,3,49,4],[12,3,12,4],[13,3,13,4],[17,3,17,4],[18,3,18,4],[7,3,7,4],[9,3,9,4],[10,3,10,4],[19,3,19,4],[1,7,2,7],[1,8,2,8],[11,3,11,4]]}
[null,null,null,null,null,null,null,null,null,null,null,null,null,null,null,null,null,null,null,null,null,null,null,null,null,null,null,null,null,null,"Weighting without decision tree",null,null,null,null,null,null,null,null,null,"Weighting with decision tree"]
["ID",null,null,"Machines",null,null,null,"Method","Type of wood","Chipping place","Nutrient loss","Bearing pressure","Emissions","Damage stand","Contribution margin","Supply guarantee","Employ-ment","Accidents","Energy efficiency",null,"Mor-phology","Bearing capacity","Soil","Slope","Extraction distance","DBH","Chipping road","Chipping terminal","Chipping plant","Sum","Nutrient loss","Bearing pressure","Emissions","Damage stand","Contribution margin","Supply guarantee","Employment","Accidents","Energy efficiency",null,"Nutrient loss","Bearing pressure","Emissions","Damage stand","Contribution margin","Supply guarantee","Employment","Accidents","Energy efficiency"]
[null,null,null,null,null,null,null,null,null,null,{"$f":"'1 Preferences'!F13","v":8.3333333333333329E-2},{"$f":"'1 Preferences'!F14","v":8.3333333333333329E-2},0,{"$f":"'1 Preferences'!F16","v":8.3333333333333329E-2},{"$f":"'1 Preferences'!F18","v":0.16666666666666666},{"$f":"'1 Preferences'!F19","v":0.16666666666666666},{"$f":"'1 Preferences'!F21","v":0.16666666666666666},{"$f":"'1 Preferences'!F22","v":0.16666666666666666},{"$f":"'1 Preferences'!F15","v":8.3333333333333329E-2},null,null,null,null,null,null,null,null,null,null,null,{"$f":"K3","v":8.3333333333333329E-2},{"$f":"L3","v":8.3333333333333329E-2},0,8.3333333333333329E-2,0.16666666666666666,0.16666666666666666,0.16666666666666666,0.16666666666666666,8.3333333333333329E-2,null,{"$f":"K3","v":8.3333333333333329E-2},{"$f":"L3","v":8.3333333333333329E-2},0,8.3333333333333329E-2,0.16666666666666666,0.16666666666666666,0.16666666666666666,0.16666666666666666,8.3333333333333329E-2]
[1,"B",4,"Chain saw",null,"Forwarder",null,"CTL","logs","forest road",0.51,0.4,{"$f":"IF(Emissions!X41>12,0,IF(Emissions!X41<5,1,(Emissions!X41-12)/(-7)))","v":1},{"$f":"IF(Damage!Y28>0.5,0,IF(Damage!Y28<0.1,1,(Damage!Y28-0.5)/(-0.4)))","v":0.78999999999999992},{"$f":"IF('Contribution margin'!AB41<-10,0,IF('Contribution margin'!AB41>10,1,('Contribution margin'!AB41+10)/20))","v":0.39093962145223154},0.3,{"$f":"IF(Employment!X41>0.5,1,Employment!X41*2)","v":0.87895194018603029},{"$f":"Accidents!P25","v":0.52056623931623935},{"$f":"IF('Energy efficiency'!Y41>0.05,0,IF('Energy efficiency'!Y41<0.02,1,('Energy efficiency'!Y41-0.05)/(-0.03)))","v":1},{"$f":"K4*$K$3+L4*$L$3+M4*$M$3+N4*$N$3+O4*$O$3+P4*$P$3+Q4*$Q$3+R4*$R$3+S4*$S$3","v":0.57340963349241691},{"$f":"IF('2a Site and stand'!$D$7=\"non-uniform\",0,1)","v":1},{"$f":"IF('2a Site and stand'!$D$9=\"low\",0,1)","v":1},1,{"$f":"IF('2a Site and stand'!$D$11=\"0 to 35 %\",1,IF('2a Site and stand'!$D$11=\"no restrictions\",1,0))","v":1},1,1,{"$f":"IF('2b Environment'!$D$16=\"not possible\",0,1)","v":1},1,1,{"$f":"T4*U4*V4*W4*X4*Y4*Z4*AA4*AB4*AC4","v":0.57340963349241691},{"$f":"K4*K$3","v":4.2499999999999996E-2},{"$f":"L4*L$3","v":3.3333333333333333E-2},0,6.5833333333333327E-2,6.5156603575371924E-2,4.9999999999999996E-2,0.14649199003100505,8.6761039886039892E-2,8.3333333333333329E-2,null,{"$f":"AE4*$U4*$V4*$W4*$X4*$Y4*$Z4*$AA4*$AB4*$AC4","v":4.2499999999999996E-2},{"$f":"AF4*$U4*$V4*$W4*$X4*$Y4*$Z4*$AA4*$AB4*$AC4","v":3.3333333333333333E-2},0,6.5833333333333327E-2,6.5156603575371924E-2,4.9999999999999996E-2,0.14649199003100505,8.6761039886039892E-2,8.3333333333333329E-2]
[2,"B",5,"Chain saw",null,"Forwarder",null,"CTL","logs","terminal",0.51,0.4,{"$f":"IF(Emissions!X42>12,0,IF(Emissions!X42<5,1,(Emissions!X42-12)/(-7)))","v":1},{"$f":"IF(Damage!Y29>0.5,0,IF(Damage!Y29<0.1,1,(Damage!Y29-0.5)/(-0.4)))","v":0.78999999999999992},{"$f":"IF('Contribution margin'!AB42<-10,0,IF('Contribution margin'!AB42>10,1,('Contribution margin'!AB42+10)/20))","v":0.13237164768942283},0.6,{"$f":"IF(Employment!X42>0.5,1,Employment!X42*2)","v":0.96723376785080584},{"$f":"Accidents!P26","v":0.52056623931623935},{"$f":"IF('Energy efficiency'!Y42>0.05,0,IF('Energy efficiency'!Y42<0.02,1,('Energy efficiency'!Y42-0.05)/(-0.03)))","v":1},{"$f":"K5*$K$3+L5*$L$3+M5*$M$3+N5*$N$3+O5*$O$3+P5*$P$3+Q5*$Q$3+R5*$R$3+S5*$S$3","v":0.59502860914274469},{"$f":"IF('2a Site and stand'!$D$7=\"non-uniform\",0,1)","v":1},{"$f":"IF('2a Site and stand'!$D$9=\"low\",0,1)","v":1},1,{"$f":"IF('2a Site and stand'!$D$11=\"0 to 35 %\",1,IF('2a Site and stand'!$D$11=\"no restrictions\",1,0))","v":1},1,1,1,{"$f":"IF('2b Environment'!$D$17=\"not possible\",0,1)","v":1},1,{"$f":"T5*U5*V5*W5*X5*Y5*Z5*AA5*AB5*AC5","v":0.59502860914274469},{"$f":"K5*K$3","v":4.2499999999999996E-2},{"$f":"L5*L$3","v":3.3333333333333333E-2},{"$f":"M5*M$3","v":0},{"$f":"N5*N$3","v":6.5833333333333327E-2},{"$f":"O5*O$3","v":2.206194128157047E-2},{"$f":"P5*P$3","v":9.9999999999999992E-2},{"$f":"Q5*Q$3","v":0.1612056279751343},{"$f":"R5*R$3","v":8.6761039886039892E-2},{"$f":"S5*S$3","v":8.3333333333333329E-2},null,{"$f":"AE5*$U5*$V5*$W5*$X5*$Y5*$Z5*$AA5*$AB5*$AC5","v":4.2499999999999996E-2},{"$f":"AF5*$U5*$V5*$W5*$X5*$Y5*$Z5*$AA5*$AB5*$AC5","v":3.3333333333333333E-2},{"$f":"AG5*$U5*$V5*$W5*$X5*$Y5*$Z5*$AA5*$AB5*$AC5","v":0},{"$f":"AH5*$U5*$V5*$W5*$X5*$Y5*$Z5*$AA5*$AB5*$AC5","v":6.5833333333333327E-2},{"$f":"AI5*$U5*$V5*$W5*$X5*$Y5*$Z5*$AA5*$AB5*$AC5","v":2.206194128157047E-2},{"$f":"AJ5*$U5*$V5*$W5*$X5*$Y5*$Z5*$AA5*$AB5*$AC5","v":9.9999999999999992E-2},{"$f":"AK5*$U5*$V5*$W5*$X5*$Y5*$Z5*$AA5*$AB5*$AC5","v":0.1612056279751343},{"$f":"AL5*$U5*$V5*$W5*$X5*$Y5*$Z5*$AA5*$AB5*$AC5","v":8.6761039886039892E-2},{"$f":"AM5*$U5*$V5*$W5*$X5*$Y5*$Z5*$AA5*$AB5*$AC5","v":8.3333333333333329E-2}]
[3,"B",6,"Chain saw",null,"Forwarder",null,"CTL","logs","plant",0.51,0.4,{"$f":"IF(Emissions!X43>12,0,IF(Emissions!X43<5,1,(Emissions!X43-12)/(-7)))","v":1},{"$f":"IF(Damage!Y30>0.5,0,IF(Damage!Y30<0.1,1,(Damage!Y30-0.5)/(-0.4)))","v":0.78999999999999992},{"$f":"IF('Contribution margin'!AB43<-10,0,IF('Contribution margin'!AB43>10,1,('Contribution margin'!AB43+10)/20))","v":0.25179751127962008},1,{"$f":"IF(Employment!X43>0.5,1,Employment!X43*2)","v":0.94006380091200215},{"$f":"Accidents!P27","v":0.52056623931623935},{"$f":"IF('Energy efficiency'!Y43>0.05,0,IF('Energy efficiency'!Y43<0.02,1,('Energy efficiency'!Y43-0.05)/(-0.03)))","v":1},0.67707125858464356,{"$f":"IF('2a Site and stand'!$D$7=\"non-uniform\",0,1)","v":1},{"$f":"IF('2a Site and stand'!$D$9=\"low\",0,1)","v":1},1,{"$f":"IF('2a Site and stand'!$D$11=\"0 to 35 %\",1,IF('2a Site and stand'!$D$11=\"no restrictions\",1,0))","v":1},1,1,1,1,{"$f":"IF('2b Environment'!$D$18=\"not possible\",0,1)","v":1},0.67707125858464356,{"$f":"K6*K$3","v":4.2499999999999996E-2},{"$f":"L6*L$3","v":3.3333333333333333E-2},{"$f":"M6*M$3","v":0},{"$f":"N6*N$3","v":6.5833333333333327E-2},{"$f":"O6*O$3","v":4.1966251879936675E-2},{"$f":"P6*P$3","v":0.16666666666666666},{"$f":"Q6*Q$3","v":0.15667730015200035},{"$f":"R6*R$3","v":8.6761039886039892E-2},{"$f":"S6*S$3","v":8.3333333333333329E-2},null,4.2499999999999996E-2,3.3333333333333333E-2,0,6.5833333333333327E-2,4.1966251879936675E-2,0.16666666666666666,0.15667730015200035,8.6761039886039892E-2,8.3333333333333329E-2]
[4,"G",17,"Chain saw",null,"Forwarder",null,"CTL","residues","forest road",0.26,0.4,{"$f":"IF(Emissions!X44>12,0,IF(Emissions!X44<5,1,(Emissions!X44-12)/(-7)))","v":0.47064270718013085},{"$f":"IF(Damage!Y31>0.5,0,IF(Damage!Y31<0.1,1,(Damage!Y31-0.5)/(-0.4)))","v":1},{"$f":"IF('Contribution margin'!AB44<-10,0,IF('Contribution margin'!AB44>10,1,('Contribution margin'!AB44+10)/20))","v":0.29037395980172392},0.1,{"$f":"IF(Employment!X44>0.5,1,Employment!X44*2)","v":0.52781622660823702},{"$f":"Accidents!P28","v":0.52056623931623935},{"$f":"IF('Energy efficiency'!Y44>0.05,0,IF('Energy efficiency'!Y44<0.02,1,('Energy efficiency'!Y44-0.05)/(-0.03)))","v":0.52137587679745512},0.42157406068748793,{"$f":"IF('2a Site and stand'!$D$7=\"non-uniform\",0,1)","v":1},{"$f":"IF('2a Site and stand'!$D$9=\"low\",0,1)","v":1},{"$f":"IF('2a Site and stand'!$D$17=\"no restrictions\",1,IF('2a Site and stand'!$D$17=\"other soil types\",1,0))","v":1},{"$f":"IF('2a Site and stand'!$D$11=\"0 to 35 %\",1,IF('2a Site and stand'!$D$11=\"no restrictions\",1,0))","v":1},1,1,{"$f":"IF('2b Environment'!$D$16=\"not possible\",0,1)","v":1},1,1,0.42157406068748793,2.1666666666666667E-2,3.3333333333333333E-2,0,8.3333333333333329E-2,4.8395659966953983E-2,1.6666666666666666E-2,8.7969371101372831E-2,8.6761039886039892E-2,4.3447989733121258E-2,null,2.1666666666666667E-2,3.3333333333333333E-2,0,8.3333333333333329E-2,4.8395659966953983E-2,1.6666666666666666E-2,8.7969371101372831E-2,8.6761039886039892E-2,4.3447989733121258E-2]
[5,"G",18,"Chain saw",null,"Forwarder",null,"CTL","residues","terminal",0.26,0.4,{"$f":"IF(Emissions!X45>12,0,IF(Emissions!X45<5,1,(Emissions!X45-12)/(-7)))","v":0.42404069725282084},{"$f":"IF(Damage!Y32>0.5,0,IF(Damage!Y32<0.1,1,(Damage!Y32-0.5)/(-0.4)))","v":1},{"$f":"IF('Contribution margin'!AB45<-10,0,IF('Contribution margin'!AB45>10,1,('Contribution margin'!AB45+10)/20))","v":0},0.4,{"$f":"IF(Employment!X45>0.5,1,Employment!X45*2)","v":0.66467727021112666},{"$f":"Accidents!P29","v":0.52056623931623935},{"$f":"IF('Energy efficiency'!Y45>0.05,0,IF('Energy efficiency'!Y45<0.02,1,('Energy efficiency'!Y45-0.05)/(-0.03)))","v":0.47853968585417028},0.44241889207574187,{"$f":"IF('2a Site and stand'!$D$7=\"non-uniform\",0,1)","v":1},{"$f":"IF('2a Site and stand'!$D$9=\"low\",0,1)","v":1},{"$f":"IF('2a Site and stand'!$D$17=\"no restrictions\",1,IF('2a Site and stand'!$D$17=\"other soil types\",1,0))","v":1},{"$f":"IF('2a Site and stand'!$D$11=\"0 to 35 %\",1,IF('2a Site and stand'!$D$11=\"no restrictions\",1,0))","v":1},1,1,1,{"$f":"IF('2b Environment'!$D$17=\"not possible\",0,1)","v":1},1,0.44241889207574187,2.1666666666666667E-2,3.3333333333333333E-2,0,8.3333333333333329E-2,0,6.6666666666666666E-2,0.11077954503518778,8.6761039886039892E-2,3.9878307154514188E-2,null,2.1666666666666667E-2,3.3333333333333333E-2,0,8.3333333333333329E-2,0,6.6666666666666666E-2,0.11077954503518778,8.6761039886039892E-2,3.9878307154514188E-2]
[6,"G",19,"Chain saw",null,"Forwarder","Bundler","CTL","residues","terminal",0.26,0.4,{"$f":"IF(Emissions!X46>12,0,IF(Emissions!X46<5,1,(Emissions!X46-12)/(-7)))","v":0.17538101040233453},{"$f":"IF(Damage!Y33>0.5,0,IF(Damage!Y33<0.1,1,(Damage!Y33-0.5)/(-0.4)))","v":1},{"$f":"IF('Contribution margin'!AB46<-10,0,IF('Contribution margin'!AB46>10,1,('Contribution margin'!AB46+10)/20))","v":0},0.5,{"$f":"IF(Employment!X46>0.5,1,Employment!X46*2)","v":0.81992039576961695},{"$f":"Accidents!P30","v":0.52056623931623935},{"$f":"IF('Energy efficiency'!Y46>0.05,0,IF('Energy efficiency'!Y46<0.02,1,('Energy efficiency'!Y46-0.05)/(-0.03)))","v":0.24997371107241009},0.46591224843701023,{"$f":"IF('2a Site and stand'!$D$7=\"non-uniform\",0,1)","v":1},{"$f":"IF('2a Site and stand'!$D$9=\"low\",0,1)","v":1},{"$f":"IF('2a Site and stand'!$D$17=\"no restrictions\",1,IF('2a Site and stand'!$D$17=\"other soil types\",1,0))","v":1},{"$f":"IF('2a Site and stand'!$D$11=\"0 to 35 %\",1,IF('2a Site and stand'!$D$11=\"no restrictions\",1,0))","v":1},1,1,1,{"$f":"IF('2b Environment'!$D$17=\"not possible\",0,1)","v":1},1,0.46591224843701023,2.1666666666666667E-2,3.3333333333333333E-2,0,8.3333333333333329E-2,0,8.3333333333333329E-2,0.13665339929493614,8.6761039886039892E-2,2.0831142589367507E-2,null,2.1666666666666667E-2,3.3333333333333333E-2,0,8.3333333333333329E-2,0,8.3333333333333329E-2,0.13665339929493614,8.6761039886039892E-2,2.0831142589367507E-2]
[7,"G",19,"Chain saw",null,"Forwarder",null,"CTL","residues","plant",0.26,0.4,{"$f":"IF(Emissions!X47>12,0,IF(Emissions!X47<5,1,(Emissions!X47-12)/(-7)))","v":0.35870877611022195},{"$f":"IF(Damage!Y34>0.5,0,IF(Damage!Y34<0.1,1,(Damage!Y34-0.5)/(-0.4)))","v":1},{"$f":"IF('Contribution margin'!AB47<-10,0,IF('Contribution margin'!AB47>10,1,('Contribution margin'!AB47+10)/20))","v":2.1227505633305554E-4},0.7,{"$f":"IF(Employment!X47>0.5,1,Employment!X47*2)","v":0.66443787462059856},{"$f":"Accidents!P31","v":0.52056623931623935},{"$f":"IF('Energy efficiency'!Y47>0.05,0,IF('Energy efficiency'!Y47<0.02,1,('Energy efficiency'!Y47-0.05)/(-0.03)))","v":0.41848711187460941},0.48740999082174596,{"$f":"IF('2a Site and stand'!$D$7=\"non-uniform\",0,1)","v":1},{"$f":"IF('2a Site and stand'!$D$9=\"low\",0,1)","v":1},{"$f":"IF('2a Site and stand'!$D$17=\"no restrictions\",1,IF('2a Site and stand'!$D$17=\"other soil types\",1,0))","v":1},{"$f":"IF('2a Site and stand'!$D$11=\"0 to 35 %\",1,IF('2a Site and stand'!$D$11=\"no restrictions\",1,0))","v":1},1,1,1,1,{"$f":"IF('2b Environment'!$D$18=\"not possible\",0,1)","v":1},0.48740999082174596,2.1666666666666667E-2,3.3333333333333333E-2,0,8.3333333333333329E-2,3.5379176055509257E-5,0.11666666666666665,0.11073964577009976,8.6761039886039892E-2,3.4873925989550782E-2,null,2.1666666666666667E-2,3.3333333333333333E-2,0,8.3333333333333329E-2,3.5379176055509257E-5,0.11666666666666665,0.11073964577009976,8.6761039886039892E-2,3.4873925989550782E-2]
[8,"G",20,"Chain saw",null,"Forwarder","Bundler","CTL","residues","plant",0.26,0.4,{"$f":"IF(Emissions!X48>12,0,IF(Emissions!X48<5,1,(Emissions!X48-12)/(-7)))","v":0.15165160409632175},{"$f":"IF(Damage!Y35>0.5,0,IF(Damage!Y35<0.1,1,(Damage!Y35-0.5)/(-0.4)))","v":1},{"$f":"IF('Contribution margin'!AB48<-10,0,IF('Contribution margin'!AB48>10,1,('Contribution margin'!AB48+10)/20))","v":0},0.9,{"$f":"IF(Employment!X48>0.5,1,Employment!X48*2)","v":0.79525390596642143},{"$f":"Accidents!P32","v":0.52056623931623935},{"$f":"IF('Energy efficiency'!Y48>0.05,0,IF('Energy efficiency'!Y48<0.02,1,('Energy efficiency'!Y48-0.05)/(-0.03)))","v":0.2281618325487014},0.52665017692616867,{"$f":"IF('2a Site and stand'!$D$7=\"non-uniform\",0,1)","v":1},{"$f":"IF('2a Site and stand'!$D$9=\"low\",0,1)","v":1},{"$f":"IF('2a Site and stand'!$D$17=\"no restrictions\",1,IF('2a Site and stand'!$D$17=\"other soil types\",1,0))","v":1},{"$f":"IF('2a Site and stand'!$D$11=\"0 to 35 %\",1,IF('2a Site and stand'!$D$11=\"no restrictions\",1,0))","v":1},1,1,1,1,{"$f":"IF('2b Environment'!$D$18=\"not possible\",0,1)","v":1},0.52665017692616867,2.1666666666666667E-2,3.3333333333333333E-2,0,8.3333333333333329E-2,0,0.15,0.13254231766107022,8.6761039886039892E-2,1.9013486045725114E-2,null,2.1666666666666667E-2,3.3333333333333333E-2,0,8.3333333333333329E-2,0,0.15,0.13254231766107022,8.6761039886039892E-2,1.9013486045725114E-2]
[9,"H",21,"Chain saw",null,"Forwarder",null,"WT","trees","forest road",0.26,0.4,{"$f":"IF(Emissions!X49>12,0,IF(Emissions!X49<5,1,(Emissions!X49-12)/(-7)))","v":0.93368446117203241},{"$f":"IF(Damage!Y36>0.5,0,IF(Damage!Y36<0.1,1,(Damage!Y36-0.5)/(-0.4)))","v":0.78999999999999992},{"$f":"IF('Contribution margin'!AB49<-10,0,IF('Contribution margin'!AB49>10,1,('Contribution margin'!AB49+10)/20))","v":0.46446859935559248},0.2,{"$f":"IF(Employment!X49>0.5,1,Employment!X49*2)","v":0.63026362475509967},{"$f":"Accidents!P33","v":0.60210622710622708},{"$f":"IF('Energy efficiency'!Y49>0.05,0,IF('Energy efficiency'!Y49<0.02,1,('Energy efficiency'!Y49-0.05)/(-0.03)))","v":0.89900627302852565},0.5118902646218636,{"$f":"IF('2a Site and stand'!$D$7=\"non-uniform\",0,1)","v":1},{"$f":"IF('2a Site and stand'!$D$9=\"low\",0,1)","v":1},{"$f":"IF('2a Site and stand'!$D$17=\"no restrictions\",1,IF('2a Site and stand'!$D$17=\"other soil types\",1,0))","v":1},{"$f":"IF('2a Site and stand'!$D$11=\"0 to 35 %\",1,IF('2a Site and stand'!$D$11=\"no restrictions\",1,0))","v":1},1,1,{"$f":"IF('2b Environment'!$D$16=\"not possible\",0,1)","v":1},1,1,0.5118902646218636,2.1666666666666667E-2,3.3333333333333333E-2,0,6.5833333333333327E-2,7.741143322593208E-2,3.3333333333333333E-2,0.10504393745918328,0.10035103785103784,7.4917189419043795E-2,null,2.1666666666666667E-2,3.3333333333333333E-2,0,6.5833333333333327E-2,7.741143322593208E-2,3.3333333333333333E-2,0.10504393745918328,0.10035103785103784,7.4917189419043795E-2]
[10,"H",22,"Chain saw",null,"Forwarder",null,"WT","trees","terminal",0.26,0.4,{"$f":"IF(Emissions!X50>12,0,IF(Emissions!X50<5,1,(Emissions!X50-12)/(-7)))","v":0.88758868862432039},{"$f":"IF(Damage!Y37>0.5,0,IF(Damage!Y37<0.1,1,(Damage!Y37-0.5)/(-0.4)))","v":0.78999999999999992},{"$f":"IF('Contribution margin'!AB50<-10,0,IF('Contribution margin'!AB50>10,1,('Contribution margin'!AB50+10)/20))","v":0.16451644415778155},0.5,{"$f":"IF(Employment!X50>0.5,1,Employment!X50*2)","v":0.7660687287732727},{"$f":"Accidents!P34","v":0.60210622710622708},{"$f":"IF('Energy efficiency'!Y50>0.05,0,IF('Energy efficiency'!Y50<0.02,1,('Energy efficiency'!Y50-0.05)/(-0.03)))","v":0.85663541139375998},0.53100151762236014,{"$f":"IF('2a Site and stand'!$D$7=\"non-uniform\",0,1)","v":1},{"$f":"IF('2a Site and stand'!$D$9=\"low\",0,1)","v":1},{"$f":"IF('2a Site and stand'!$D$17=\"no restrictions\",1,IF('2a Site and stand'!$D$17=\"other soil types\",1,0))","v":1},{"$f":"IF('2a Site and stand'!$D$11=\"0 to 35 %\",1,IF('2a Site and stand'!$D$11=\"no restrictions\",1,0))","v":1},1,1,1,{"$f":"IF('2b Environment'!$D$17=\"not possible\",0,1)","v":1},1,0.53100151762236014,2.1666666666666667E-2,3.3333333333333333E-2,0,6.5833333333333327E-2,2.7419407359630256E-2,8.3333333333333329E-2,0.12767812146221211,0.10035103785103784,7.1386284282813323E-2,null,2.1666666666666667E-2,3.3333333333333333E-2,0,6.5833333333333327E-2,2.7419407359630256E-2,8.3333333333333329E-2,0.12767812146221211,0.10035103785103784,7.1386284282813323E-2]
[11,"H",23,"Chain saw",null,"Forwarder",null,"WT","trees","plant",0.26,0.4,{"$f":"IF(Emissions!X51>12,0,IF(Emissions!X51<5,1,(Emissions!X51-12)/(-7)))","v":0.82335361513751637},{"$f":"IF(Damage!Y38>0.5,0,IF(Damage!Y38<0.1,1,(Damage!Y38-0.5)/(-0.4)))","v":0.78999999999999992},{"$f":"IF('Contribution margin'!AB51<-10,0,IF('Contribution margin'!AB51>10,1,('Contribution margin'!AB51+10)/20))","v":0.24730711057376506},0.8,{"$f":"IF(Employment!X51>0.5,1,Employment!X51*2)","v":0.80198602756071902},{"$f":"Accidents!P35","v":0.60210622710622708},{"$f":"IF('Energy efficiency'!Y51>0.05,0,IF('Energy efficiency'!Y51<0.02,1,('Energy efficiency'!Y51-0.05)/(-0.03)))","v":0.7975910509159907},0.59586581511645109,{"$f":"IF('2a Site and stand'!$D$7=\"non-uniform\",0,1)","v":1},{"$f":"IF('2a Site and stand'!$D$9=\"low\",0,1)","v":1},{"$f":"IF('2a Site and stand'!$D$17=\"no restrictions\",1,IF('2a Site and stand'!$D$17=\"other soil types\",1,0))","v":1},{"$f":"IF('2a Site and stand'!$D$11=\"0 to 35 %\",1,IF('2a Site and stand'!$D$11=\"no restrictions\",1,0))","v":1},1,1,1,1,{"$f":"IF('2b Environment'!$D$18=\"not possible\",0,1)","v":1},0.59586581511645109,2.1666666666666667E-2,3.3333333333333333E-2,0,6.5833333333333327E-2,4.1217851762294172E-2,0.13333333333333333,0.1336643379267865,0.10035103785103784,6.6465920909665882E-2,null,2.1666666666666667E-2,3.3333333333333333E-2,0,6.5833333333333327E-2,4.1217851762294172E-2,0.13333333333333333,0.1336643379267865,0.10035103785103784,6.6465920909665882E-2]
[12,"D",10,"Harvester",null,"Forwarder",null,"CTL","logs","forest road",0.51,0.4,{"$f":"IF(Emissions!X52>12,0,IF(Emissions!X52<5,1,(Emissions!X52-12)/(-7)))","v":0.88943173743114123},{"$f":"IF(Damage!Y39>0.5,0,IF(Damage!Y39<0.1,1,(Damage!Y39-0.5)/(-0.4)))","v":0.98199999999999987},{"$f":"IF('Contribution margin'!AB52<-10,0,IF('Contribution margin'!AB52>10,1,('Contribution margin'!AB52+10)/20))","v":0.7206287812898895},0.3,{"$f":"IF(Employment!X52>0.5,1,Employment!X52*2)","v":0.29314163174568142},{"$f":"Accidents!P36","v":1},{"$f":"IF('Energy efficiency'!Y52>0.05,0,IF('Energy efficiency'!Y52<0.02,1,('Energy efficiency'!Y52-0.05)/(-0.03)))","v":0.90846755662862488},0.61900069855831386,{"$f":"IF('2a Site and stand'!$D$7=\"non-uniform\",0,1)","v":1},{"$f":"IF('2a Site and stand'!$D$9=\"low\",0,1)","v":1},1,{"$f":"IF('2a Site and stand'!$D$11=\"0 to 35 %\",1,IF('2a Site and stand'!$D$11=\"no restrictions\",1,0))","v":1},1,{"$f":"IF('2a Site and stand'!$D$15<40,1,0)","v":1},{"$f":"IF('2b Environment'!$D$16=\"not possible\",0,1)","v":1},1,1,0.61900069855831386,4.2499999999999996E-2,3.3333333333333333E-2,0,8.1833333333333313E-2,0.12010479688164824,4.9999999999999996E-2,4.8856938624280234E-2,0.16666666666666666,7.5705629719052064E-2,null,4.2499999999999996E-2,3.3333333333333333E-2,0,8.1833333333333313E-2,0.12010479688164824,4.9999999999999996E-2,4.8856938624280234E-2,0.16666666666666666,7.5705629719052064E-2]
[13,"D",11,"Harvester",null,"Forwarder",null,"CTL","logs","terminal",0.51,0.4,{"$f":"IF(Emissions!X53>12,0,IF(Emissions!X53<5,1,(Emissions!X53-12)/(-7)))","v":0.86824858332747146},{"$f":"IF(Damage!Y40>0.5,0,IF(Damage!Y40<0.1,1,(Damage!Y40-0.5)/(-0.4)))","v":0.98199999999999987},{"$f":"IF('Contribution margin'!AB53<-10,0,IF('Contribution margin'!AB53>10,1,('Contribution margin'!AB53+10)/20))","v":0.46206080752708073},0.6,{"$f":"IF(Employment!X53>0.5,1,Employment!X53*2)","v":0.38142345941045697},{"$f":"Accidents!P37","v":1},{"$f":"IF('Energy efficiency'!Y53>0.05,0,IF('Energy efficiency'!Y53<0.02,1,('Energy efficiency'!Y53-0.05)/(-0.03)))","v":0.88899617255353447},0.63899705886905078,{"$f":"IF('2a Site and stand'!$D$7=\"non-uniform\",0,1)","v":1},{"$f":"IF('2a Site and stand'!$D$9=\"low\",0,1)","v":1},1,{"$f":"IF('2a Site and stand'!$D$11=\"0 to 35 %\",1,IF('2a Site and stand'!$D$11=\"no restrictions\",1,0))","v":1},1,{"$f":"IF('2a Site and stand'!$D$15<40,1,0)","v":1},1,{"$f":"IF('2b Environment'!$D$17=\"not possible\",0,1)","v":1},1,0.63899705886905078,4.2499999999999996E-2,3.3333333333333333E-2,0,8.1833333333333313E-2,7.7010134587846779E-2,9.9999999999999992E-2,6.357057656840949E-2,0.16666666666666666,7.4083014379461201E-2,null,4.2499999999999996E-2,3.3333333333333333E-2,0,8.1833333333333313E-2,7.7010134587846779E-2,9.9999999999999992E-2,6.357057656840949E-2,0.16666666666666666,7.4083014379461201E-2]
[14,"D",12,"Harvester",null,"Forwarder",null,"CTL","logs","plant",0.51,0.4,{"$f":"IF(Emissions!X54>12,0,IF(Emissions!X54<5,1,(Emissions!X54-12)/(-7)))","v":0.85799084980275897},{"$f":"IF(Damage!Y41>0.5,0,IF(Damage!Y41<0.1,1,(Damage!Y41-0.5)/(-0.4)))","v":0.98199999999999987},{"$f":"IF('Contribution margin'!AB54<-10,0,IF('Contribution margin'!AB54>10,1,('Contribution margin'!AB54+10)/20))","v":0.58148667111727792},1,{"$f":"IF(Employment!X54>0.5,1,Employment!X54*2)","v":0.35425349247165328},{"$f":"Accidents!P38","v":1},{"$f":"IF('Energy efficiency'!Y54>0.05,0,IF('Energy efficiency'!Y54<0.02,1,('Energy efficiency'!Y54-0.05)/(-0.03)))","v":0.87956734678839477},0.72025397283052139,{"$f":"IF('2a Site and stand'!$D$7=\"non-uniform\",0,1)","v":1},{"$f":"IF('2a Site and stand'!$D$9=\"low\",0,1)","v":1},1,{"$f":"IF('2a Site and stand'!$D$11=\"0 to 35 %\",1,IF('2a Site and stand'!$D$11=\"no restrictions\",1,0))","v":1},1,{"$f":"IF('2a Site and stand'!$D$15<40,1,0)","v":1},1,1,{"$f":"IF('2b Environment'!$D$18=\"not possible\",0,1)","v":1},0.72025397283052139,4.2499999999999996E-2,3.3333333333333333E-2,0,8.1833333333333313E-2,9.6914445186212977E-2,0.16666666666666666,5.9042248745275541E-2,0.16666666666666666,7.3297278899032897E-2,null,4.2499999999999996E-2,3.3333333333333333E-2,0,8.1833333333333313E-2,9.6914445186212977E-2,0.16666666666666666,5.9042248745275541E-2,0.16666666666666666,7.3297278899032897E-2]
[15,"K",31,"Harvester",null,"Forwarder",null,"CTL","residues","forest road",0.26,0.4,{"$f":"IF(Emissions!X55>12,0,IF(Emissions!X55<5,1,(Emissions!X55-12)/(-7)))","v":0.44098468296372012},{"$f":"IF(Damage!Y42>0.5,0,IF(Damage!Y42<0.1,1,(Damage!Y42-0.5)/(-0.4)))","v":1},{"$f":"IF('Contribution margin'!AB55<-10,0,IF('Contribution margin'!AB55>10,1,('Contribution margin'!AB55+10)/20))","v":0.3233428757854897},0.1,{"$f":"IF(Employment!X55>0.5,1,Employment!X55*2)","v":0.46923519576420208},{"$f":"Accidents!P39","v":1},{"$f":"IF('Energy efficiency'!Y55>0.05,0,IF('Energy efficiency'!Y55<0.02,1,('Energy efficiency'!Y55-0.05)/(-0.03)))","v":0.49625864797675318},0.4951178992563447,{"$f":"IF('2a Site and stand'!$D$7=\"non-uniform\",0,1)","v":1},{"$f":"IF('2a Site and stand'!$D$9=\"low\",0,1)","v":1},{"$f":"IF('2a Site and stand'!$D$17=\"no restrictions\",1,IF('2a Site and stand'!$D$17=\"other soil types\",1,0))","v":1},{"$f":"IF('2a Site and stand'!$D$11=\"0 to 35 %\",1,IF('2a Site and stand'!$D$11=\"no restrictions\",1,0))","v":1},1,{"$f":"IF('2a Site and stand'!$D$15<40,1,0)","v":1},{"$f":"IF('2b Environment'!$D$16=\"not possible\",0,1)","v":1},1,1,0.4951178992563447,2.1666666666666667E-2,3.3333333333333333E-2,0,8.3333333333333329E-2,5.3890479297581617E-2,1.6666666666666666E-2,7.8205865960700338E-2,0.16666666666666666,4.1354887331396098E-2,null,2.1666666666666667E-2,3.3333333333333333E-2,0,8.3333333333333329E-2,5.3890479297581617E-2,1.6666666666666666E-2,7.8205865960700338E-2,0.16666666666666666,4.1354887331396098E-2]
[16,"K",32,"Harvester",null,"Forwarder",null,"CTL","residues","terminal",0.26,0.4,{"$f":"IF(Emissions!X56>12,0,IF(Emissions!X56<5,1,(Emissions!X56-12)/(-7)))","v":0.39438267303641006},{"$f":"IF(Damage!Y43>0.5,0,IF(Damage!Y43<0.1,1,(Damage!Y43-0.5)/(-0.4)))","v":1},{"$f":"IF('Contribution margin'!AB56<-10,0,IF('Contribution margin'!AB56>10,1,('Contribution margin'!AB56+10)/20))","v":2.1674818762514293E-2},0.4,{"$f":"IF(Employment!X56>0.5,1,Employment!X56*2)","v":0.60609623936709178},{"$f":"Accidents!P40","v":1},{"$f":"IF('Energy efficiency'!Y56>0.05,0,IF('Energy efficiency'!Y56<0.02,1,('Energy efficiency'!Y56-0.05)/(-0.03)))","v":0.45342245703346834},0.51408038110772336,{"$f":"IF('2a Site and stand'!$D$7=\"non-uniform\",0,1)","v":1},{"$f":"IF('2a Site and stand'!$D$9=\"low\",0,1)","v":1},{"$f":"IF('2a Site and stand'!$D$17=\"no restrictions\",1,IF('2a Site and stand'!$D$17=\"other soil types\",1,0))","v":1},{"$f":"IF('2a Site and stand'!$D$11=\"0 to 35 %\",1,IF('2a Site and stand'!$D$11=\"no restrictions\",1,0))","v":1},1,{"$f":"IF('2a Site and stand'!$D$15<40,1,0)","v":1},1,{"$f":"IF('2b Environment'!$D$17=\"not possible\",0,1)","v":1},1,0.51408038110772336,2.1666666666666667E-2,3.3333333333333333E-2,0,8.3333333333333329E-2,3.6124697937523821E-3,6.6666666666666666E-2,0.1010160398945153,0.16666666666666666,3.7785204752789028E-2,null,2.1666666666666667E-2,3.3333333333333333E-2,0,8.3333333333333329E-2,3.6124697937523821E-3,6.6666666666666666E-2,0.1010160398945153,0.16666666666666666,3.7785204752789028E-2]
[17,"K",32,"Harvester",null,"Forwarder","Bundler","CTL","residues","terminal",0.26,0.4,{"$f":"IF(Emissions!X57>12,0,IF(Emissions!X57<5,1,(Emissions!X57-12)/(-7)))","v":0.14572298618592378},{"$f":"IF(Damage!Y44>0.5,0,IF(Damage!Y44<0.1,1,(Damage!Y44-0.5)/(-0.4)))","v":1},{"$f":"IF('Contribution margin'!AB57<-10,0,IF('Contribution margin'!AB57>10,1,('Contribution margin'!AB57+10)/20))","v":0},0.5,{"$f":"IF(Employment!X57>0.5,1,Employment!X57*2)","v":0.76133936492558207},{"$f":"Accidents!P41","v":1},{"$f":"IF('Energy efficiency'!Y57>0.05,0,IF('Energy efficiency'!Y57<0.02,1,('Energy efficiency'!Y57-0.05)/(-0.03)))","v":0.22485648225170793},0.53396126767523933,{"$f":"IF('2a Site and stand'!$D$7=\"non-uniform\",0,1)","v":1},{"$f":"IF('2a Site and stand'!$D$9=\"low\",0,1)","v":1},{"$f":"IF('2a Site and stand'!$D$17=\"no restrictions\",1,IF('2a Site and stand'!$D$17=\"other soil types\",1,0))","v":1},{"$f":"IF('2a Site and stand'!$D$11=\"0 to 35 %\",1,IF('2a Site and stand'!$D$11=\"no restrictions\",1,0))","v":1},1,{"$f":"IF('2a Site and stand'!$D$15<40,1,0)","v":1},1,{"$f":"IF('2b Environment'!$D$17=\"not possible\",0,1)","v":1},1,0.53396126767523933,2.1666666666666667E-2,3.3333333333333333E-2,0,8.3333333333333329E-2,0,8.3333333333333329E-2,0.12688989415426366,0.16666666666666666,1.8738040187642326E-2,null,2.1666666666666667E-2,3.3333333333333333E-2,0,8.3333333333333329E-2,0,8.3333333333333329E-2,0.12688989415426366,0.16666666666666666,1.8738040187642326E-2]
[18,"K",33,"Harvester",null,"Forwarder",null,"CTL","residues","plant",0.26,0.4,{"$f":"IF(Emissions!X58>12,0,IF(Emissions!X58<5,1,(Emissions!X58-12)/(-7)))","v":0.32905075189381122},{"$f":"IF(Damage!Y45>0.5,0,IF(Damage!Y45<0.1,1,(Damage!Y45-0.5)/(-0.4)))","v":1},{"$f":"IF('Contribution margin'!AB58<-10,0,IF('Contribution margin'!AB58>10,1,('Contribution margin'!AB58+10)/20))","v":3.3181191040098666E-2},0.7,{"$f":"IF(Employment!X58>0.5,1,Employment!X58*2)","v":0.60585684377656368},{"$f":"Accidents!P42","v":1},{"$f":"IF('Energy efficiency'!Y58>0.05,0,IF('Energy efficiency'!Y58<0.02,1,('Energy efficiency'!Y58-0.05)/(-0.03)))","v":0.39336988305390747},0.56095382939060268,{"$f":"IF('2a Site and stand'!$D$7=\"non-uniform\",0,1)","v":1},{"$f":"IF('2a Site and stand'!$D$9=\"low\",0,1)","v":1},{"$f":"IF('2a Site and stand'!$D$17=\"no restrictions\",1,IF('2a Site and stand'!$D$17=\"other soil types\",1,0))","v":1},{"$f":"IF('2a Site and stand'!$D$11=\"0 to 35 %\",1,IF('2a Site and stand'!$D$11=\"no restrictions\",1,0))","v":1},1,{"$f":"IF('2a Site and stand'!$D$15<40,1,0)","v":1},1,1,{"$f":"IF('2b Environment'!$D$18=\"not possible\",0,1)","v":1},0.56095382939060268,2.1666666666666667E-2,3.3333333333333333E-2,0,8.3333333333333329E-2,5.5301985066831105E-3,0.11666666666666665,0.10097614062942728,0.16666666666666666,3.2780823587825622E-2,null,2.1666666666666667E-2,3.3333333333333333E-2,0,8.3333333333333329E-2,5.5301985066831105E-3,0.11666666666666665,0.10097614062942728,0.16666666666666666,3.2780823587825622E-2]
[19,"K",34,"Harvester",null,"Forwarder","Bundler","CTL","residues","plant",0.26,0.4,{"$f":"IF(Emissions!X59>12,0,IF(Emissions!X59<5,1,(Emissions!X59-12)/(-7)))","v":0.121993579879911},{"$f":"IF(Damage!Y46>0.5,0,IF(Damage!Y46<0.1,1,(Damage!Y46-0.5)/(-0.4)))","v":1},{"$f":"IF('Contribution margin'!AB59<-10,0,IF('Contribution margin'!AB59>10,1,('Contribution margin'!AB59+10)/20))","v":0},0.9,{"$f":"IF(Employment!X59>0.5,1,Employment!X59*2)","v":0.73667287512238655},{"$f":"Accidents!P43","v":1},{"$f":"IF('Energy efficiency'!Y59>0.05,0,IF('Energy efficiency'!Y59<0.02,1,('Energy efficiency'!Y59-0.05)/(-0.03)))","v":0.20304460372799923},0.5946991961643977,{"$f":"IF('2a Site and stand'!$D$7=\"non-uniform\",0,1)","v":1},{"$f":"IF('2a Site and stand'!$D$9=\"low\",0,1)","v":1},{"$f":"IF('2a Site and stand'!$D$17=\"no restrictions\",1,IF('2a Site and stand'!$D$17=\"other soil types\",1,0))","v":1},{"$f":"IF('2a Site and stand'!$D$11=\"0 to 35 %\",1,IF('2a Site and stand'!$D$11=\"no restrictions\",1,0))","v":1},1,{"$f":"IF('2a Site and stand'!$D$15<40,1,0)","v":1},1,1,{"$f":"IF('2b Environment'!$D$18=\"not possible\",0,1)","v":1},0.5946991961643977,2.1666666666666667E-2,3.3333333333333333E-2,0,8.3333333333333329E-2,0,0.15,0.12277881252039775,0.16666666666666666,1.6920383643999934E-2,null,2.1666666666666667E-2,3.3333333333333333E-2,0,8.3333333333333329E-2,0,0.15,0.12277881252039775,0.16666666666666666,1.6920383643999934E-2]
[20,"L",35,"Harvester",null,"Forwarder",null,"CTL","trees","forest road",0.26,0.4,{"$f":"IF(Emissions!X60>12,0,IF(Emissions!X60<5,1,(Emissions!X60-12)/(-7)))","v":0.60588532414647156},{"$f":"IF(Damage!Y47>0.5,0,IF(Damage!Y47<0.1,1,(Damage!Y47-0.5)/(-0.4)))","v":0.98199999999999987},{"$f":"IF('Contribution margin'!AB60<-10,0,IF('Contribution margin'!AB60>10,1,('Contribution margin'!AB60+10)/20))","v":0.46748308156777513},0.2,{"$f":"IF(Employment!X60>0.5,1,Employment!X60*2)","v":0.3983803776641282},{"$f":"Accidents!P44","v":1},{"$f":"IF('Energy efficiency'!Y60>0.05,0,IF('Energy efficiency'!Y60<0.02,1,('Energy efficiency'!Y60-0.05)/(-0.03)))","v":0.64783398482150445},0.53513007527377587,{"$f":"IF('2a Site and stand'!$D$7=\"non-uniform\",0,1)","v":1},{"$f":"IF('2a Site and stand'!$D$9=\"low\",0,1)","v":1},{"$f":"IF('2a Site and stand'!$D$17=\"no restrictions\",1,IF('2a Site and stand'!$D$17=\"other soil types\",1,0))","v":1},{"$f":"IF('2a Site and stand'!$D$11=\"0 to 35 %\",1,IF('2a Site and stand'!$D$11=\"no restrictions\",1,0))","v":1},1,{"$f":"IF('2a Site and stand'!$D$15<40,1,0)","v":1},{"$f":"IF('2b Environment'!$D$16=\"not possible\",0,1)","v":1},1,1,0.53513007527377587,2.1666666666666667E-2,3.3333333333333333E-2,0,8.1833333333333313E-2,7.7913846927962521E-2,3.3333333333333333E-2,6.6396729610688029E-2,0.16666666666666666,5.3986165401792033E-2,null,2.1666666666666667E-2,3.3333333333333333E-2,0,8.1833333333333313E-2,7.7913846927962521E-2,3.3333333333333333E-2,6.6396729610688029E-2,0.16666666666666666,5.3986165401792033E-2]
[21,"L",36,"Harvester",null,"Forwarder",null,"CTL","trees","terminal",0.26,0.4,{"$f":"IF(Emissions!X61>12,0,IF(Emissions!X61<5,1,(Emissions!X61-12)/(-7)))","v":0.55978955159875965},{"$f":"IF(Damage!Y48>0.5,0,IF(Damage!Y48<0.1,1,(Damage!Y48-0.5)/(-0.4)))","v":0.98199999999999987},{"$f":"IF('Contribution margin'!AB61<-10,0,IF('Contribution margin'!AB61>10,1,('Contribution margin'!AB61+10)/20))","v":0.16753092636996419},0.5,{"$f":"IF(Employment!X61>0.5,1,Employment!X61*2)","v":0.53418548168230129},{"$f":"Accidents!P45","v":1},{"$f":"IF('Energy efficiency'!Y61>0.05,0,IF('Energy efficiency'!Y61<0.02,1,('Energy efficiency'!Y61-0.05)/(-0.03)))","v":0.60546312318673867},0.55424132827427242,{"$f":"IF('2a Site and stand'!$D$7=\"non-uniform\",0,1)","v":1},{"$f":"IF('2a Site and stand'!$D$9=\"low\",0,1)","v":1},{"$f":"IF('2a Site and stand'!$D$17=\"no restrictions\",1,IF('2a Site and stand'!$D$17=\"other soil types\",1,0))","v":1},{"$f":"IF('2a Site and stand'!$D$11=\"0 to 35 %\",1,IF('2a Site and stand'!$D$11=\"no restrictions\",1,0))","v":1},1,{"$f":"IF('2a Site and stand'!$D$15<40,1,0)","v":1},1,{"$f":"IF('2b Environment'!$D$17=\"not possible\",0,1)","v":1},1,0.55424132827427242,2.1666666666666667E-2,3.3333333333333333E-2,0,8.1833333333333313E-2,2.7921821061660697E-2,8.3333333333333329E-2,8.9030913613716872E-2,0.16666666666666666,5.0455260265561554E-2,null,2.1666666666666667E-2,3.3333333333333333E-2,0,8.1833333333333313E-2,2.7921821061660697E-2,8.3333333333333329E-2,8.9030913613716872E-2,0.16666666666666666,5.0455260265561554E-2]
[22,"L",37,"Harvester",null,"Forwarder",null,"CTL","trees","plant",0.26,0.4,{"$f":"IF(Emissions!X62>12,0,IF(Emissions!X62<5,1,(Emissions!X62-12)/(-7)))","v":0.49555447811195563},{"$f":"IF(Damage!Y49>0.5,0,IF(Damage!Y49<0.1,1,(Damage!Y49-0.5)/(-0.4)))","v":0.98199999999999987},{"$f":"IF('Contribution margin'!AB62<-10,0,IF('Contribution margin'!AB62>10,1,('Contribution margin'!AB62+10)/20))","v":0.25032159278594773},0.8,{"$f":"IF(Employment!X62>0.5,1,Employment!X62*2)","v":0.57010278046974761},{"$f":"Accidents!P46","v":1},{"$f":"IF('Energy efficiency'!Y62>0.05,0,IF('Energy efficiency'!Y62<0.02,1,('Energy efficiency'!Y62-0.05)/(-0.03)))","v":0.5464187627089695},0.61910562576836325,{"$f":"IF('2a Site and stand'!$D$7=\"non-uniform\",0,1)","v":1},{"$f":"IF('2a Site and stand'!$D$9=\"low\",0,1)","v":1},{"$f":"IF('2a Site and stand'!$D$17=\"no restrictions\",1,IF('2a Site and stand'!$D$17=\"other soil types\",1,0))","v":1},{"$f":"IF('2a Site and stand'!$D$11=\"0 to 35 %\",1,IF('2a Site and stand'!$D$11=\"no restrictions\",1,0))","v":1},1,{"$f":"IF('2a Site and stand'!$D$15<40,1,0)","v":1},1,1,{"$f":"IF('2b Environment'!$D$18=\"not possible\",0,1)","v":1},0.61910562576836325,2.1666666666666667E-2,3.3333333333333333E-2,0,8.1833333333333313E-2,4.172026546432462E-2,0.13333333333333333,9.5017130078291268E-2,0.16666666666666666,4.553489689241412E-2,null,2.1666666666666667E-2,3.3333333333333333E-2,0,8.1833333333333313E-2,4.172026546432462E-2,0.13333333333333333,9.5017130078291268E-2,0.16666666666666666,4.553489689241412E-2]
[23,null,null,"Chain saw",null,"Tower yarder",null,"TL","logs","forest road",0.51,0.98,{"$f":"IF(Emissions!X63>12,0,IF(Emissions!X63<5,1,(Emissions!X63-12)/(-7)))","v":0.87540368861054618},{"$f":"IF(Damage!Y50>0.5,0,IF(Damage!Y50<0.1,1,(Damage!Y50-0.5)/(-0.4)))","v":0.51375000000000004},{"$f":"IF('Contribution margin'!AB63<-10,0,IF('Contribution margin'!AB63>10,1,('Contribution margin'!AB63+10)/20))","v":0},0.3,{"$f":"IF(Employment!X63>0.5,1,Employment!X63*2)","v":0.95668358450108049},{"$f":"Accidents!P47","v":9.6085164835164827E-2},{"$f":"IF('Energy efficiency'!Y63>0.05,0,IF('Energy efficiency'!Y63<0.02,1,('Energy efficiency'!Y63-0.05)/(-0.03)))","v":0.87949168217404772},0.46573159840387818,1,1,1,1,{"$f":"IF('2a Site and stand'!$D$13=\"80 to 800 m\",1,IF('2a Site and stand'!$D$13=\"< 80 m\",1,IF('2a Site and stand'!$D$13=\"no restrictions\",1,0)))","v":1},1,{"$f":"IF('2b Environment'!$D$16=\"not possible\",0,1)","v":1},1,1,0.46573159840387818,4.2499999999999996E-2,8.1666666666666665E-2,0,4.2812500000000003E-2,0,4.9999999999999996E-2,0.1594472640835134,1.6014194139194138E-2,7.3290973514503976E-2,null,4.2499999999999996E-2,8.1666666666666665E-2,0,4.2812500000000003E-2,0,4.9999999999999996E-2,0.1594472640835134,1.6014194139194138E-2,7.3290973514503976E-2]
[24,null,null,"Chain saw",null,"Tower yarder",null,"TL","logs","terminal",0.51,0.98,{"$f":"IF(Emissions!X64>12,0,IF(Emissions!X64<5,1,(Emissions!X64-12)/(-7)))","v":0.85422053450687652},{"$f":"IF(Damage!Y51>0.5,0,IF(Damage!Y51<0.1,1,(Damage!Y51-0.5)/(-0.4)))","v":0.51375000000000004},{"$f":"IF('Contribution margin'!AB64<-10,0,IF('Contribution margin'!AB64>10,1,('Contribution margin'!AB64+10)/20))","v":0},0.6,{"$f":"IF(Employment!X64>0.5,1,Employment!X64*2)","v":1},{"$f":"Accidents!P48","v":9.6085164835164827E-2},{"$f":"IF('Energy efficiency'!Y64>0.05,0,IF('Energy efficiency'!Y64<0.02,1,('Energy efficiency'!Y64-0.05)/(-0.03)))","v":0.86002029809895719},0.52132838564744055,1,1,1,1,{"$f":"IF('2a Site and stand'!$D$13=\"80 to 800 m\",1,IF('2a Site and stand'!$D$13=\"< 80 m\",1,IF('2a Site and stand'!$D$13=\"no restrictions\",1,0)))","v":1},1,1,{"$f":"IF('2b Environment'!$D$17=\"not possible\",0,1)","v":1},1,0.52132838564744055,4.2499999999999996E-2,8.1666666666666665E-2,0,4.2812500000000003E-2,0,9.9999999999999992E-2,0.16666666666666666,1.6014194139194138E-2,7.1668358174913099E-2,null,4.2499999999999996E-2,8.1666666666666665E-2,0,4.2812500000000003E-2,0,9.9999999999999992E-2,0.16666666666666666,1.6014194139194138E-2,7.1668358174913099E-2]
[25,null,null,"Chain saw",null,"Tower yarder",null,"TL","logs","plant",0.51,0.98,{"$f":"IF(Emissions!X65>12,0,IF(Emissions!X65<5,1,(Emissions!X65-12)/(-7)))","v":0.84396280098216392},{"$f":"IF(Damage!Y52>0.5,0,IF(Damage!Y52<0.1,1,(Damage!Y52-0.5)/(-0.4)))","v":0.51375000000000004},{"$f":"IF('Contribution margin'!AB65<-10,0,IF('Contribution margin'!AB65>10,1,('Contribution margin'!AB65+10)/20))","v":0},1,{"$f":"IF(Employment!X65>0.5,1,Employment!X65*2)","v":1},{"$f":"Accidents!P49","v":9.6085164835164827E-2},{"$f":"IF('Energy efficiency'!Y65>0.05,0,IF('Energy efficiency'!Y65<0.02,1,('Energy efficiency'!Y65-0.05)/(-0.03)))","v":0.85059147233381749},0.58720931683367883,1,1,1,1,{"$f":"IF('2a Site and stand'!$D$13=\"80 to 800 m\",1,IF('2a Site and stand'!$D$13=\"< 80 m\",1,IF('2a Site and stand'!$D$13=\"no restrictions\",1,0)))","v":1},1,1,1,{"$f":"IF('2b Environment'!$D$18=\"not possible\",0,1)","v":1},0.58720931683367883,4.2499999999999996E-2,8.1666666666666665E-2,0,4.2812500000000003E-2,0,0.16666666666666666,0.16666666666666666,1.6014194139194138E-2,7.0882622694484781E-2,null,4.2499999999999996E-2,8.1666666666666665E-2,0,4.2812500000000003E-2,0,0.16666666666666666,0.16666666666666666,1.6014194139194138E-2,7.0882622694484781E-2]
[26,"F",13,"Chain saw","Processor","Tower yarder",null,"WT","residues","forest road",0.26,0.98,{"$f":"IF(Emissions!X66>12,0,IF(Emissions!X66<5,1,(Emissions!X66-12)/(-7)))","v":1},{"$f":"IF(Damage!Y53>0.5,0,IF(Damage!Y53<0.1,1,(Damage!Y53-0.5)/(-0.4)))","v":1},{"$f":"IF('Contribution margin'!AB66<-10,0,IF('Contribution margin'!AB66>10,1,('Contribution margin'!AB66+10)/20))","v":0.9237547502513429},0.1,{"$f":"IF(Employment!X66>0.5,1,Employment!X66*2)","v":0.1845069770993408},{"$f":"Accidents!P50","v":0.14496336996336998},{"$f":"IF('Energy efficiency'!Y66>0.05,0,IF('Energy efficiency'!Y66<0.02,1,('Energy efficiency'!Y66-0.05)/(-0.03)))","v":1},0.49553751621900893,1,1,{"$f":"IF('2a Site and stand'!$D$17=\"no restrictions\",1,IF('2a Site and stand'!$D$17=\"other soil types\",1,0))","v":1},1,{"$f":"IF('2a Site and stand'!$D$13=\"80 to 800 m\",1,IF('2a Site and stand'!$D$13=\"< 80 m\",1,IF('2a Site and stand'!$D$13=\"no restrictions\",1,0)))","v":1},1,{"$f":"IF('2b Environment'!$D$16=\"not possible\",0,1)","v":1},1,1,0.49553751621900893,2.1666666666666667E-2,8.1666666666666665E-2,0,8.3333333333333329E-2,0.15395912504189047,1.6666666666666666E-2,3.0751162849890133E-2,2.4160561660561661E-2,8.3333333333333329E-2,null,2.1666666666666667E-2,8.1666666666666665E-2,0,8.3333333333333329E-2,0.15395912504189047,1.6666666666666666E-2,3.0751162849890133E-2,2.4160561660561661E-2,8.3333333333333329E-2]
[27,"F",14,"Chain saw","Processor","Tower yarder",null,"WT","residues","terminal",0.26,0.98,{"$f":"IF(Emissions!X67>12,0,IF(Emissions!X67<5,1,(Emissions!X67-12)/(-7)))","v":1},{"$f":"IF(Damage!Y54>0.5,0,IF(Damage!Y54<0.1,1,(Damage!Y54-0.5)/(-0.4)))","v":1},{"$f":"IF('Contribution margin'!AB67<-10,0,IF('Contribution margin'!AB67>10,1,('Contribution margin'!AB67+10)/20))","v":0.62208669322836752},0.4,{"$f":"IF(Employment!X67>0.5,1,Employment!X67*2)","v":0.32136802070223047},{"$f":"Accidents!P51","v":0.14496336996336998},{"$f":"IF('Energy efficiency'!Y67>0.05,0,IF('Energy efficiency'!Y67<0.02,1,('Energy efficiency'!Y67-0.05)/(-0.03)))","v":1},0.51806968064899461,1,1,{"$f":"IF('2a Site and stand'!$D$17=\"no restrictions\",1,IF('2a Site and stand'!$D$17=\"other soil types\",1,0))","v":1},1,{"$f":"IF('2a Site and stand'!$D$13=\"80 to 800 m\",1,IF('2a Site and stand'!$D$13=\"< 80 m\",1,IF('2a Site and stand'!$D$13=\"no restrictions\",1,0)))","v":1},1,1,{"$f":"IF('2b Environment'!$D$17=\"not possible\",0,1)","v":1},1,0.51806968064899461,2.1666666666666667E-2,8.1666666666666665E-2,0,8.3333333333333329E-2,0.10368111553806125,6.6666666666666666E-2,5.3561336783705074E-2,2.4160561660561661E-2,8.3333333333333329E-2,null,2.1666666666666667E-2,8.1666666666666665E-2,0,8.3333333333333329E-2,0.10368111553806125,6.6666666666666666E-2,5.3561336783705074E-2,2.4160561660561661E-2,8.3333333333333329E-2]
[28,"F",14,"Chain saw","Processor","Tower yarder","Bundler","WT","residues","terminal",0.26,0.98,{"$f":"IF(Emissions!X68>12,0,IF(Emissions!X68<5,1,(Emissions!X68-12)/(-7)))","v":0.84991264747000173},{"$f":"IF(Damage!Y55>0.5,0,IF(Damage!Y55<0.1,1,(Damage!Y55-0.5)/(-0.4)))","v":1},{"$f":"IF('Contribution margin'!AB68<-10,0,IF('Contribution margin'!AB68>10,1,('Contribution margin'!AB68+10)/20))","v":0.11331357490514833},0.5,{"$f":"IF(Employment!X68>0.5,1,Employment!X68*2)","v":0.47661114626072076},{"$f":"Accidents!P52","v":0.14496336996336998},{"$f":"IF('Energy efficiency'!Y68>0.05,0,IF('Energy efficiency'!Y68<0.02,1,('Energy efficiency'!Y68-0.05)/(-0.03)))","v":0.87106983479341649},0.46507050142099116,1,1,{"$f":"IF('2a Site and stand'!$D$17=\"no restrictions\",1,IF('2a Site and stand'!$D$17=\"other soil types\",1,0))","v":1},1,{"$f":"IF('2a Site and stand'!$D$13=\"80 to 800 m\",1,IF('2a Site and stand'!$D$13=\"< 80 m\",1,IF('2a Site and stand'!$D$13=\"no restrictions\",1,0)))","v":1},1,1,{"$f":"IF('2b Environment'!$D$17=\"not possible\",0,1)","v":1},1,0.46507050142099116,2.1666666666666667E-2,8.1666666666666665E-2,0,8.3333333333333329E-2,1.888559581752472E-2,8.3333333333333329E-2,7.9435191043453451E-2,2.4160561660561661E-2,7.2589152899451365E-2,null,2.1666666666666667E-2,8.1666666666666665E-2,0,8.3333333333333329E-2,1.888559581752472E-2,8.3333333333333329E-2,7.9435191043453451E-2,2.4160561660561661E-2,7.2589152899451365E-2]
[29,"F",15,"Chain saw","Processor","Tower yarder",null,"WT","residues","plant",0.26,0.98,{"$f":"IF(Emissions!X69>12,0,IF(Emissions!X69<5,1,(Emissions!X69-12)/(-7)))","v":1},{"$f":"IF(Damage!Y56>0.5,0,IF(Damage!Y56<0.1,1,(Damage!Y56-0.5)/(-0.4)))","v":1},{"$f":"IF('Contribution margin'!AB69<-10,0,IF('Contribution margin'!AB69>10,1,('Contribution margin'!AB69+10)/20))","v":0.63359306550595207},0.7,{"$f":"IF(Employment!X69>0.5,1,Employment!X69*2)","v":0.32112862511170237},{"$f":"Accidents!P53","v":0.14496336996336998},{"$f":"IF('Energy efficiency'!Y69>0.05,0,IF('Energy efficiency'!Y69<0.02,1,('Energy efficiency'!Y69-0.05)/(-0.03)))","v":1},0.56994751009683731,1,1,{"$f":"IF('2a Site and stand'!$D$17=\"no restrictions\",1,IF('2a Site and stand'!$D$17=\"other soil types\",1,0))","v":1},1,{"$f":"IF('2a Site and stand'!$D$13=\"80 to 800 m\",1,IF('2a Site and stand'!$D$13=\"< 80 m\",1,IF('2a Site and stand'!$D$13=\"no restrictions\",1,0)))","v":1},1,1,1,{"$f":"IF('2b Environment'!$D$18=\"not possible\",0,1)","v":1},0.56994751009683731,2.1666666666666667E-2,8.1666666666666665E-2,0,8.3333333333333329E-2,0.105598844250992,0.11666666666666665,5.3521437518617057E-2,2.4160561660561661E-2,8.3333333333333329E-2,null,2.1666666666666667E-2,8.1666666666666665E-2,0,8.3333333333333329E-2,0.105598844250992,0.11666666666666665,5.3521437518617057E-2,2.4160561660561661E-2,8.3333333333333329E-2]
[30,"F",16,"Chain saw","Processor","Tower yarder","Bundler","WT","residues","plant",0.26,0.98,{"$f":"IF(Emissions!X70>12,0,IF(Emissions!X70<5,1,(Emissions!X70-12)/(-7)))","v":0.82618324116398889},{"$f":"IF(Damage!Y57>0.5,0,IF(Damage!Y57<0.1,1,(Damage!Y57-0.5)/(-0.4)))","v":1},{"$f":"IF('Contribution margin'!AB70<-10,0,IF('Contribution margin'!AB70>10,1,('Contribution margin'!AB70+10)/20))","v":0.22773248422412937},0.9,{"$f":"IF(Employment!X70>0.5,1,Employment!X70*2)","v":0.45194465645752524},{"$f":"Accidents!P54","v":0.14496336996336998},{"$f":"IF('Energy efficiency'!Y70>0.05,0,IF('Energy efficiency'!Y70<0.02,1,('Energy efficiency'!Y70-0.05)/(-0.03)))","v":0.84925795626970768},0.54487824812997965,1,1,{"$f":"IF('2a Site and stand'!$D$17=\"no restrictions\",1,IF('2a Site and stand'!$D$17=\"other soil types\",1,0))","v":1},1,{"$f":"IF('2a Site and stand'!$D$13=\"80 to 800 m\",1,IF('2a Site and stand'!$D$13=\"< 80 m\",1,IF('2a Site and stand'!$D$13=\"no restrictions\",1,0)))","v":1},1,1,1,{"$f":"IF('2b Environment'!$D$18=\"not possible\",0,1)","v":1},0.54487824812997965,2.1666666666666667E-2,8.1666666666666665E-2,0,8.3333333333333329E-2,3.795541403735489E-2,0.15,7.5324109409587531E-2,2.4160561660561661E-2,7.0771496355808969E-2,null,2.1666666666666667E-2,8.1666666666666665E-2,0,8.3333333333333329E-2,3.795541403735489E-2,0.15,7.5324109409587531E-2,2.4160561660561661E-2,7.0771496355808969E-2]
[31,null,null,"Chain saw","Processor","Tower yarder",null,"WT","trees","forest road",0.26,0.98,{"$f":"IF(Emissions!X71>12,0,IF(Emissions!X71<5,1,(Emissions!X71-12)/(-7)))","v":0.64366651490059945},{"$f":"IF(Damage!Y58>0.5,0,IF(Damage!Y58<0.1,1,(Damage!Y58-0.5)/(-0.4)))","v":0.51375000000000004},{"$f":"IF('Contribution margin'!AB71<-10,0,IF('Contribution margin'!AB71>10,1,('Contribution margin'!AB71+10)/20))","v":0},0.2,{"$f":"IF(Employment!X71>0.5,1,Employment!X71*2)","v":0.89731768013690261},{"$f":"Accidents!P55","v":0.14496336996336998},{"$f":"IF('Energy efficiency'!Y71>0.05,0,IF('Energy efficiency'!Y71<0.02,1,('Energy efficiency'!Y71-0.05)/(-0.03)))","v":0.67184121316904288},0.40917944278079904,1,1,{"$f":"IF('2a Site and stand'!$D$17=\"no restrictions\",1,IF('2a Site and stand'!$D$17=\"other soil types\",1,0))","v":1},1,{"$f":"IF('2a Site and stand'!$D$13=\"80 to 800 m\",1,IF('2a Site and stand'!$D$13=\"< 80 m\",1,IF('2a Site and stand'!$D$13=\"no restrictions\",1,0)))","v":1},1,{"$f":"IF('2b Environment'!$D$16=\"not possible\",0,1)","v":1},1,1,0.40917944278079904,2.1666666666666667E-2,8.1666666666666665E-2,0,4.2812500000000003E-2,0,3.3333333333333333E-2,0.14955294668948377,2.4160561660561661E-2,5.5986767764086905E-2,null,2.1666666666666667E-2,8.1666666666666665E-2,0,4.2812500000000003E-2,0,3.3333333333333333E-2,0.14955294668948377,2.4160561660561661E-2,5.5986767764086905E-2]
[32,null,null,"Chain saw","Processor","Tower yarder",null,"WT","trees","terminal",0.26,0.98,{"$f":"IF(Emissions!X72>12,0,IF(Emissions!X72<5,1,(Emissions!X72-12)/(-7)))","v":0.59757074235288754},{"$f":"IF(Damage!Y59>0.5,0,IF(Damage!Y59<0.1,1,(Damage!Y59-0.5)/(-0.4)))","v":0.51375000000000004},{"$f":"IF('Contribution margin'!AB72<-10,0,IF('Contribution margin'!AB72>10,1,('Contribution margin'!AB72+10)/20))","v":0},0.5,{"$f":"IF(Employment!X72>0.5,1,Employment!X72*2)","v":1},{"$f":"Accidents!P56","v":0.14496336996336998},{"$f":"IF('Energy efficiency'!Y72>0.05,0,IF('Energy efficiency'!Y72<0.02,1,('Energy efficiency'!Y72-0.05)/(-0.03)))","v":0.62947035153427722},0.47276225762175145,1,1,{"$f":"IF('2a Site and stand'!$D$17=\"no restrictions\",1,IF('2a Site and stand'!$D$17=\"other soil types\",1,0))","v":1},1,{"$f":"IF('2a Site and stand'!$D$13=\"80 to 800 m\",1,IF('2a Site and stand'!$D$13=\"< 80 m\",1,IF('2a Site and stand'!$D$13=\"no restrictions\",1,0)))","v":1},1,1,{"$f":"IF('2b Environment'!$D$17=\"not possible\",0,1)","v":1},1,0.47276225762175145,2.1666666666666667E-2,8.1666666666666665E-2,0,4.2812500000000003E-2,0,8.3333333333333329E-2,0.16666666666666666,2.4160561660561661E-2,5.2455862627856432E-2,null,2.1666666666666667E-2,8.1666666666666665E-2,0,4.2812500000000003E-2,0,8.3333333333333329E-2,0.16666666666666666,2.4160561660561661E-2,5.2455862627856432E-2]
[33,null,null,"Chain saw","Processor","Tower yarder",null,"WT","trees","plant",0.26,0.98,{"$f":"IF(Emissions!X73>12,0,IF(Emissions!X73<5,1,(Emissions!X73-12)/(-7)))","v":0.53333566886608352},{"$f":"IF(Damage!Y60>0.5,0,IF(Damage!Y60<0.1,1,(Damage!Y60-0.5)/(-0.4)))","v":0.51375000000000004},{"$f":"IF('Contribution margin'!AB73<-10,0,IF('Contribution margin'!AB73>10,1,('Contribution margin'!AB73+10)/20))","v":0},0.8,{"$f":"IF(Employment!X73>0.5,1,Employment!X73*2)","v":1},{"$f":"Accidents!P57","v":0.14496336996336998},{"$f":"IF('Energy efficiency'!Y73>0.05,0,IF('Energy efficiency'!Y73<0.02,1,('Energy efficiency'!Y73-0.05)/(-0.03)))","v":0.57042599105650804},0.51784189424860405,1,1,{"$f":"IF('2a Site and stand'!$D$17=\"no restrictions\",1,IF('2a Site and stand'!$D$17=\"other soil types\",1,0))","v":1},1,{"$f":"IF('2a Site and stand'!$D$13=\"80 to 800 m\",1,IF('2a Site and stand'!$D$13=\"< 80 m\",1,IF('2a Site and stand'!$D$13=\"no restrictions\",1,0)))","v":1},1,1,1,{"$f":"IF('2b Environment'!$D$18=\"not possible\",0,1)","v":1},0.51784189424860405,2.1666666666666667E-2,8.1666666666666665E-2,0,4.2812500000000003E-2,0,0.13333333333333333,0.16666666666666666,2.4160561660561661E-2,4.7535499254708999E-2,null,2.1666666666666667E-2,8.1666666666666665E-2,0,4.2812500000000003E-2,0,0.13333333333333333,0.16666666666666666,2.4160561660561661E-2,4.7535499254708999E-2]
[34,null,null,"Chain saw",null,"Skidder",null,"TL","logs","forest road",0.51,0.54,{"$f":"IF(Emissions!X74>12,0,IF(Emissions!X74<5,1,(Emissions!X74-12)/(-7)))","v":1},{"$f":"IF(Damage!Y61>0.5,0,IF(Damage!Y61<0.1,1,(Damage!Y61-0.5)/(-0.4)))","v":0.51375000000000004},{"$f":"IF('Contribution margin'!AB74<-10,0,IF('Contribution margin'!AB74>10,1,('Contribution margin'!AB74+10)/20))","v":0.51368450328478643},0.3,{"$f":"IF(Employment!X74>0.5,1,Employment!X74*2)","v":0.77972005382639176},{"$f":"Accidents!P58","v":9.6085164835164827E-2},{"$f":"IF('Energy efficiency'!Y74>0.05,0,IF('Energy efficiency'!Y74<0.02,1,('Energy efficiency'!Y74-0.05)/(-0.03)))","v":1},0.49522745365772375,{"$f":"IF('2a Site and stand'!$D$7=\"non-uniform\",0,1)","v":1},{"$f":"IF('2a Site and stand'!$D$9=\"low\",0,1)","v":1},1,{"$f":"IF('2a Site and stand'!$D$11=\"0 to 35 %\",1,IF('2a Site and stand'!$D$11=\"no restrictions\",1,IF('2a Site and stand'!$D$13=\"< 80 m\",1,0)))","v":1},{"$f":"IF('2a Site and stand'!$D$13=\"< 80 m\",1,IF('2a Site and stand'!$D$13=\"no restrictions\",1,IF('2a Site and stand'!$D$11=\"0 to 35 %\",1,IF('2a Site and stand'!$D$11=\"no restrictions\",1,0))))","v":1},1,{"$f":"IF('2b Environment'!$D$16=\"not possible\",0,1)","v":1},1,1,0.49522745365772375,4.2499999999999996E-2,4.4999999999999998E-2,0,4.2812500000000003E-2,8.5614083880797734E-2,4.9999999999999996E-2,0.12995334230439862,1.6014194139194138E-2,8.3333333333333329E-2,null,4.2499999999999996E-2,4.4999999999999998E-2,0,4.2812500000000003E-2,8.5614083880797734E-2,4.9999999999999996E-2,0.12995334230439862,1.6014194139194138E-2,8.3333333333333329E-2]
[35,null,null,"Chain saw",null,"Skidder",null,"TL","logs","terminal",0.51,0.54,{"$f":"IF(Emissions!X75>12,0,IF(Emissions!X75<5,1,(Emissions!X75-12)/(-7)))","v":1},{"$f":"IF(Damage!Y62>0.5,0,IF(Damage!Y62<0.1,1,(Damage!Y62-0.5)/(-0.4)))","v":0.51375000000000004},{"$f":"IF('Contribution margin'!AB75<-10,0,IF('Contribution margin'!AB75>10,1,('Contribution margin'!AB75+10)/20))","v":0.25511652952197766},0.6,{"$f":"IF(Employment!X75>0.5,1,Employment!X75*2)","v":0.86800188149116719},{"$f":"Accidents!P59","v":9.6085164835164827E-2},{"$f":"IF('Energy efficiency'!Y75>0.05,0,IF('Energy efficiency'!Y75<0.02,1,('Energy efficiency'!Y75-0.05)/(-0.03)))","v":1},0.51684642930805158,{"$f":"IF('2a Site and stand'!$D$7=\"non-uniform\",0,1)","v":1},{"$f":"IF('2a Site and stand'!$D$9=\"low\",0,1)","v":1},1,{"$f":"IF('2a Site and stand'!$D$11=\"0 to 35 %\",1,IF('2a Site and stand'!$D$11=\"no restrictions\",1,IF('2a Site and stand'!$D$13=\"< 80 m\",1,0)))","v":1},{"$f":"IF('2a Site and stand'!$D$13=\"< 80 m\",1,IF('2a Site and stand'!$D$13=\"no restrictions\",1,IF('2a Site and stand'!$D$11=\"0 to 35 %\",1,IF('2a Site and stand'!$D$11=\"no restrictions\",1,0))))","v":1},1,1,{"$f":"IF('2b Environment'!$D$17=\"not possible\",0,1)","v":1},1,0.51684642930805158,4.2499999999999996E-2,4.4999999999999998E-2,0,4.2812500000000003E-2,4.2519421586996273E-2,9.9999999999999992E-2,0.14466698024852787,1.6014194139194138E-2,8.3333333333333329E-2,null,4.2499999999999996E-2,4.4999999999999998E-2,0,4.2812500000000003E-2,4.2519421586996273E-2,9.9999999999999992E-2,0.14466698024852787,1.6014194139194138E-2,8.3333333333333329E-2]
[36,null,null,"Chain saw",null,"Skidder",null,"TL","logs","plant",0.51,0.54,{"$f":"IF(Emissions!X76>12,0,IF(Emissions!X76<5,1,(Emissions!X76-12)/(-7)))","v":1},{"$f":"IF(Damage!Y63>0.5,0,IF(Damage!Y63<0.1,1,(Damage!Y63-0.5)/(-0.4)))","v":0.51375000000000004},{"$f":"IF('Contribution margin'!AB76<-10,0,IF('Contribution margin'!AB76>10,1,('Contribution margin'!AB76+10)/20))","v":0.37454239311217491},1,{"$f":"IF(Employment!X76>0.5,1,Employment!X76*2)","v":0.84083191455236361},{"$f":"Accidents!P60","v":9.6085164835164827E-2},{"$f":"IF('Energy efficiency'!Y76>0.05,0,IF('Energy efficiency'!Y76<0.02,1,('Energy efficiency'!Y76-0.05)/(-0.03)))","v":1},0.59888907874995057,{"$f":"IF('2a Site and stand'!$D$7=\"non-uniform\",0,1)","v":1},{"$f":"IF('2a Site and stand'!$D$9=\"low\",0,1)","v":1},1,{"$f":"IF('2a Site and stand'!$D$11=\"0 to 35 %\",1,IF('2a Site and stand'!$D$11=\"no restrictions\",1,IF('2a Site and stand'!$D$13=\"< 80 m\",1,0)))","v":1},{"$f":"IF('2a Site and stand'!$D$13=\"< 80 m\",1,IF('2a Site and stand'!$D$13=\"no restrictions\",1,IF('2a Site and stand'!$D$11=\"0 to 35 %\",1,IF('2a Site and stand'!$D$11=\"no restrictions\",1,0))))","v":1},1,1,1,{"$f":"IF('2b Environment'!$D$18=\"not possible\",0,1)","v":1},0.59888907874995057,4.2499999999999996E-2,4.4999999999999998E-2,0,4.2812500000000003E-2,6.2423732185362485E-2,0.16666666666666666,0.14013865242539392,1.6014194139194138E-2,8.3333333333333329E-2,null,4.2499999999999996E-2,4.4999999999999998E-2,0,4.2812500000000003E-2,6.2423732185362485E-2,0.16666666666666666,0.14013865242539392,1.6014194139194138E-2,8.3333333333333329E-2]
[37,"I",24,"Chain saw","Skidder","Processor",null,"WT","residues","forest road",0.26,0.54,{"$f":"IF(Emissions!X77>12,0,IF(Emissions!X77<5,1,(Emissions!X77-12)/(-7)))","v":1},{"$f":"IF(Damage!Y64>0.5,0,IF(Damage!Y64<0.1,1,(Damage!Y64-0.5)/(-0.4)))","v":1},{"$f":"IF('Contribution margin'!AB77<-10,0,IF('Contribution margin'!AB77>10,1,('Contribution margin'!AB77+10)/20))","v":0.97970354010945238},0.1,{"$f":"IF(Employment!X77>0.5,1,Employment!X77*2)","v":0.16504098872512507},{"$f":"Accidents!P61","v":0.14496336996336998},{"$f":"IF('Energy efficiency'!Y77>0.05,0,IF('Energy efficiency'!Y77<0.02,1,('Energy efficiency'!Y77-0.05)/(-0.03)))","v":1},0.46495131646632459,{"$f":"IF('2a Site and stand'!$D$7=\"non-uniform\",0,1)","v":1},{"$f":"IF('2a Site and stand'!$D$9=\"low\",0,1)","v":1},{"$f":"IF('2a Site and stand'!$D$17=\"no restrictions\",1,IF('2a Site and stand'!$D$17=\"other soil types\",1,0))","v":1},{"$f":"IF('2a Site and stand'!$D$11=\"0 to 35 %\",1,IF('2a Site and stand'!$D$11=\"no restrictions\",1,IF('2a Site and stand'!$D$13=\"< 80 m\",1,0)))","v":1},{"$f":"IF('2a Site and stand'!$D$13=\"< 80 m\",1,IF('2a Site and stand'!$D$13=\"no restrictions\",1,IF('2a Site and stand'!$D$11=\"0 to 35 %\",1,IF('2a Site and stand'!$D$11=\"no restrictions\",1,0))))","v":1},1,{"$f":"IF('2b Environment'!$D$16=\"not possible\",0,1)","v":1},1,1,0.46495131646632459,2.1666666666666667E-2,4.4999999999999998E-2,0,8.3333333333333329E-2,0.16328392335157538,1.6666666666666666E-2,2.7506831454187509E-2,2.4160561660561661E-2,8.3333333333333329E-2,null,2.1666666666666667E-2,4.4999999999999998E-2,0,8.3333333333333329E-2,0.16328392335157538,1.6666666666666666E-2,2.7506831454187509E-2,2.4160561660561661E-2,8.3333333333333329E-2]
[38,"I",25,"Chain saw","Skidder","Processor",null,"WT","residues","terminal",0.26,0.54,{"$f":"IF(Emissions!X78>12,0,IF(Emissions!X78<5,1,(Emissions!X78-12)/(-7)))","v":1},{"$f":"IF(Damage!Y65>0.5,0,IF(Damage!Y65<0.1,1,(Damage!Y65-0.5)/(-0.4)))","v":1},{"$f":"IF('Contribution margin'!AB78<-10,0,IF('Contribution margin'!AB78>10,1,('Contribution margin'!AB78+10)/20))","v":0.67803548308647721},0.4,{"$f":"IF(Employment!X78>0.5,1,Employment!X78*2)","v":0.30190203232801471},{"$f":"Accidents!P62","v":0.14496336996336998},{"$f":"IF('Energy efficiency'!Y78>0.05,0,IF('Energy efficiency'!Y78<0.02,1,('Energy efficiency'!Y78-0.05)/(-0.03)))","v":1},0.48748348089631027,{"$f":"IF('2a Site and stand'!$D$7=\"non-uniform\",0,1)","v":1},{"$f":"IF('2a Site and stand'!$D$9=\"low\",0,1)","v":1},{"$f":"IF('2a Site and stand'!$D$17=\"no restrictions\",1,IF('2a Site and stand'!$D$17=\"other soil types\",1,0))","v":1},{"$f":"IF('2a Site and stand'!$D$11=\"0 to 35 %\",1,IF('2a Site and stand'!$D$11=\"no restrictions\",1,IF('2a Site and stand'!$D$13=\"< 80 m\",1,0)))","v":1},{"$f":"IF('2a Site and stand'!$D$13=\"< 80 m\",1,IF('2a Site and stand'!$D$13=\"no restrictions\",1,IF('2a Site and stand'!$D$11=\"0 to 35 %\",1,IF('2a Site and stand'!$D$11=\"no restrictions\",1,0))))","v":1},1,1,{"$f":"IF('2b Environment'!$D$17=\"not possible\",0,1)","v":1},1,0.48748348089631027,2.1666666666666667E-2,4.4999999999999998E-2,0,8.3333333333333329E-2,0.11300591384774619,6.6666666666666666E-2,5.0317005388002448E-2,2.4160561660561661E-2,8.3333333333333329E-2,null,2.1666666666666667E-2,4.4999999999999998E-2,0,8.3333333333333329E-2,0.11300591384774619,6.6666666666666666E-2,5.0317005388002448E-2,2.4160561660561661E-2,8.3333333333333329E-2]
[39,"I",25,"Chain saw","Skidder","Processor","Bundler","WT","residues","terminal",0.26,0.54,{"$f":"IF(Emissions!X79>12,0,IF(Emissions!X79<5,1,(Emissions!X79-12)/(-7)))","v":0.88864885199249832},{"$f":"IF(Damage!Y66>0.5,0,IF(Damage!Y66<0.1,1,(Damage!Y66-0.5)/(-0.4)))","v":1},{"$f":"IF('Contribution margin'!AB79<-10,0,IF('Contribution margin'!AB79>10,1,('Contribution margin'!AB79+10)/20))","v":0.16926236476325798},0.5,{"$f":"IF(Employment!X79>0.5,1,Employment!X79*2)","v":0.45714515788650512},{"$f":"Accidents!P63","v":0.14496336996336998},{"$f":"IF('Energy efficiency'!Y79>0.05,0,IF('Energy efficiency'!Y79<0.02,1,('Energy efficiency'!Y79-0.05)/(-0.03)))","v":0.90667584097066078},0.43745146884974395,{"$f":"IF('2a Site and stand'!$D$7=\"non-uniform\",0,1)","v":1},{"$f":"IF('2a Site and stand'!$D$9=\"low\",0,1)","v":1},{"$f":"IF('2a Site and stand'!$D$17=\"no restrictions\",1,IF('2a Site and stand'!$D$17=\"other soil types\",1,0))","v":1},{"$f":"IF('2a Site and stand'!$D$11=\"0 to 35 %\",1,IF('2a Site and stand'!$D$11=\"no restrictions\",1,IF('2a Site and stand'!$D$13=\"< 80 m\",1,0)))","v":1},{"$f":"IF('2a Site and stand'!$D$13=\"< 80 m\",1,IF('2a Site and stand'!$D$13=\"no restrictions\",1,IF('2a Site and stand'!$D$11=\"0 to 35 %\",1,IF('2a Site and stand'!$D$11=\"no restrictions\",1,0))))","v":1},1,1,{"$f":"IF('2b Environment'!$D$17=\"not possible\",0,1)","v":1},1,0.43745146884974395,2.1666666666666667E-2,4.4999999999999998E-2,0,8.3333333333333329E-2,2.8210394127209663E-2,8.3333333333333329E-2,7.6190859647750853E-2,2.4160561660561661E-2,7.5556320080888389E-2,null,2.1666666666666667E-2,4.4999999999999998E-2,0,8.3333333333333329E-2,2.8210394127209663E-2,8.3333333333333329E-2,7.6190859647750853E-2,2.4160561660561661E-2,7.5556320080888389E-2]
[40,"I",26,"Chain saw","Skidder","Processor",null,"WT","residues","plant",0.26,0.54,{"$f":"IF(Emissions!X80>12,0,IF(Emissions!X80<5,1,(Emissions!X80-12)/(-7)))","v":1},{"$f":"IF(Damage!Y67>0.5,0,IF(Damage!Y67<0.1,1,(Damage!Y67-0.5)/(-0.4)))","v":1},{"$f":"IF('Contribution margin'!AB80<-10,0,IF('Contribution margin'!AB80>10,1,('Contribution margin'!AB80+10)/20))","v":0.68954185536406154},0.7,{"$f":"IF(Employment!X80>0.5,1,Employment!X80*2)","v":0.30166263673748667},{"$f":"Accidents!P64","v":0.14496336996336998},{"$f":"IF('Energy efficiency'!Y80>0.05,0,IF('Energy efficiency'!Y80<0.02,1,('Energy efficiency'!Y80-0.05)/(-0.03)))","v":1},0.53936131034415302,{"$f":"IF('2a Site and stand'!$D$7=\"non-uniform\",0,1)","v":1},{"$f":"IF('2a Site and stand'!$D$9=\"low\",0,1)","v":1},{"$f":"IF('2a Site and stand'!$D$17=\"no restrictions\",1,IF('2a Site and stand'!$D$17=\"other soil types\",1,0))","v":1},{"$f":"IF('2a Site and stand'!$D$11=\"0 to 35 %\",1,IF('2a Site and stand'!$D$11=\"no restrictions\",1,IF('2a Site and stand'!$D$13=\"< 80 m\",1,0)))","v":1},{"$f":"IF('2a Site and stand'!$D$13=\"< 80 m\",1,IF('2a Site and stand'!$D$13=\"no restrictions\",1,IF('2a Site and stand'!$D$11=\"0 to 35 %\",1,IF('2a Site and stand'!$D$11=\"no restrictions\",1,0))))","v":1},1,1,1,{"$f":"IF('2b Environment'!$D$18=\"not possible\",0,1)","v":1},0.53936131034415302,2.1666666666666667E-2,4.4999999999999998E-2,0,8.3333333333333329E-2,0.11492364256067691,0.11666666666666665,5.0277106122914444E-2,2.4160561660561661E-2,8.3333333333333329E-2,null,2.1666666666666667E-2,4.4999999999999998E-2,0,8.3333333333333329E-2,0.11492364256067691,0.11666666666666665,5.0277106122914444E-2,2.4160561660561661E-2,8.3333333333333329E-2]
[41,"I",27,"Chain saw","Skidder","Processor","Bundler","WT","residues","plant",0.26,0.54,{"$f":"IF(Emissions!X81>12,0,IF(Emissions!X81<5,1,(Emissions!X81-12)/(-7)))","v":0.86491944568648549},{"$f":"IF(Damage!Y68>0.5,0,IF(Damage!Y68<0.1,1,(Damage!Y68-0.5)/(-0.4)))","v":1},{"$f":"IF('Contribution margin'!AB81<-10,0,IF('Contribution margin'!AB81>10,1,('Contribution margin'!AB81+10)/20))","v":0.28368127408223903},0.9,{"$f":"IF(Employment!X81>0.5,1,Employment!X81*2)","v":0.43247866808330959},{"$f":"Accidents!P65","v":0.14496336996336998},{"$f":"IF('Energy efficiency'!Y81>0.05,0,IF('Energy efficiency'!Y81<0.02,1,('Energy efficiency'!Y81-0.05)/(-0.03)))","v":0.88486396244695209},0.51725921555873244,{"$f":"IF('2a Site and stand'!$D$7=\"non-uniform\",0,1)","v":1},{"$f":"IF('2a Site and stand'!$D$9=\"low\",0,1)","v":1},{"$f":"IF('2a Site and stand'!$D$17=\"no restrictions\",1,IF('2a Site and stand'!$D$17=\"other soil types\",1,0))","v":1},{"$f":"IF('2a Site and stand'!$D$11=\"0 to 35 %\",1,IF('2a Site and stand'!$D$11=\"no restrictions\",1,IF('2a Site and stand'!$D$13=\"< 80 m\",1,0)))","v":1},{"$f":"IF('2a Site and stand'!$D$13=\"< 80 m\",1,IF('2a Site and stand'!$D$13=\"no restrictions\",1,IF('2a Site and stand'!$D$11=\"0 to 35 %\",1,IF('2a Site and stand'!$D$11=\"no restrictions\",1,0))))","v":1},1,1,1,{"$f":"IF('2b Environment'!$D$18=\"not possible\",0,1)","v":1},0.51725921555873244,2.1666666666666667E-2,4.4999999999999998E-2,0,8.3333333333333329E-2,4.7280212347039836E-2,0.15,7.2079778013884932E-2,2.4160561660561661E-2,7.3738663537246008E-2,null,2.1666666666666667E-2,4.4999999999999998E-2,0,8.3333333333333329E-2,4.7280212347039836E-2,0.15,7.2079778013884932E-2,2.4160561660561661E-2,7.3738663537246008E-2]
[42,"J",28,"Chain saw","Skidder","Processor",null,"WT","trees","forest road",0.26,0.54,{"$f":"IF(Emissions!X82>12,0,IF(Emissions!X82<5,1,(Emissions!X82-12)/(-7)))","v":1},{"$f":"IF(Damage!Y69>0.5,0,IF(Damage!Y69<0.1,1,(Damage!Y69-0.5)/(-0.4)))","v":0.51375000000000004},{"$f":"IF('Contribution margin'!AB82<-10,0,IF('Contribution margin'!AB82>10,1,('Contribution margin'!AB82+10)/20))","v":0.33195830758638556},0.2,{"$f":"IF(Employment!X82>0.5,1,Employment!X82*2)","v":0.70265779639474502},{"$f":"Accidents!P66","v":0.14496336996336998},{"$f":"IF('Energy efficiency'!Y82>0.05,0,IF('Energy efficiency'!Y82<0.02,1,('Energy efficiency'!Y82-0.05)/(-0.03)))","v":1},0.42274241232408344,{"$f":"IF('2a Site and stand'!$D$7=\"non-uniform\",0,1)","v":1},{"$f":"IF('2a Site and stand'!$D$9=\"low\",0,1)","v":1},{"$f":"IF('2a Site and stand'!$D$17=\"no restrictions\",1,IF('2a Site and stand'!$D$17=\"other soil types\",1,0))","v":1},{"$f":"IF('2a Site and stand'!$D$11=\"0 to 35 %\",1,IF('2a Site and stand'!$D$11=\"no restrictions\",1,IF('2a Site and stand'!$D$13=\"< 80 m\",1,0)))","v":1},{"$f":"IF('2a Site and stand'!$D$13=\"< 80 m\",1,IF('2a Site and stand'!$D$13=\"no restrictions\",1,IF('2a Site and stand'!$D$11=\"0 to 35 %\",1,IF('2a Site and stand'!$D$11=\"no restrictions\",1,0))))","v":1},1,{"$f":"IF('2b Environment'!$D$16=\"not possible\",0,1)","v":1},1,1,0.42274241232408344,2.1666666666666667E-2,4.4999999999999998E-2,0,4.2812500000000003E-2,5.5326384597730927E-2,3.3333333333333333E-2,0.1171096327324575,2.4160561660561661E-2,8.3333333333333329E-2,null,2.1666666666666667E-2,4.4999999999999998E-2,0,4.2812500000000003E-2,5.5326384597730927E-2,3.3333333333333333E-2,0.1171096327324575,2.4160561660561661E-2,8.3333333333333329E-2]
[43,"J",29,"Chain saw","Skidder","Processor",null,"WT","trees","terminal",0.26,0.54,{"$f":"IF(Emissions!X83>12,0,IF(Emissions!X83<5,1,(Emissions!X83-12)/(-7)))","v":0.98493278757785319},{"$f":"IF(Damage!Y70>0.5,0,IF(Damage!Y70<0.1,1,(Damage!Y70-0.5)/(-0.4)))","v":0.51375000000000004},{"$f":"IF('Contribution margin'!AB83<-10,0,IF('Contribution margin'!AB83>10,1,('Contribution margin'!AB83+10)/20))","v":3.2006152388574807E-2},0.5,{"$f":"IF(Employment!X83>0.5,1,Employment!X83*2)","v":0.83846290041291804},{"$f":"Accidents!P67","v":0.14496336996336998},{"$f":"IF('Energy efficiency'!Y83>0.05,0,IF('Energy efficiency'!Y83<0.02,1,('Energy efficiency'!Y83-0.05)/(-0.03)))","v":0.9855304133067202},0.44417877156970376,{"$f":"IF('2a Site and stand'!$D$7=\"non-uniform\",0,1)","v":1},{"$f":"IF('2a Site and stand'!$D$9=\"low\",0,1)","v":1},{"$f":"IF('2a Site and stand'!$D$17=\"no restrictions\",1,IF('2a Site and stand'!$D$17=\"other soil types\",1,0))","v":1},{"$f":"IF('2a Site and stand'!$D$11=\"0 to 35 %\",1,IF('2a Site and stand'!$D$11=\"no restrictions\",1,IF('2a Site and stand'!$D$13=\"< 80 m\",1,0)))","v":1},{"$f":"IF('2a Site and stand'!$D$13=\"< 80 m\",1,IF('2a Site and stand'!$D$13=\"no restrictions\",1,IF('2a Site and stand'!$D$11=\"0 to 35 %\",1,IF('2a Site and stand'!$D$11=\"no restrictions\",1,0))))","v":1},1,1,{"$f":"IF('2b Environment'!$D$17=\"not possible\",0,1)","v":1},1,0.44417877156970376,2.1666666666666667E-2,4.4999999999999998E-2,0,4.2812500000000003E-2,5.3343587314291343E-3,8.3333333333333329E-2,0.13974381673548633,2.4160561660561661E-2,8.2127534442226674E-2,null,2.1666666666666667E-2,4.4999999999999998E-2,0,4.2812500000000003E-2,5.3343587314291343E-3,8.3333333333333329E-2,0.13974381673548633,2.4160561660561661E-2,8.2127534442226674E-2]
[44,"J",30,"Chain saw","Skidder","Processor",null,"WT","trees","plant",0.26,0.54,{"$f":"IF(Emissions!X84>12,0,IF(Emissions!X84<5,1,(Emissions!X84-12)/(-7)))","v":0.92069771409104917},{"$f":"IF(Damage!Y71>0.5,0,IF(Damage!Y71<0.1,1,(Damage!Y71-0.5)/(-0.4)))","v":0.51375000000000004},{"$f":"IF('Contribution margin'!AB84<-10,0,IF('Contribution margin'!AB84>10,1,('Contribution margin'!AB84+10)/20))","v":0.11479681880455814},0.8,{"$f":"IF(Employment!X84>0.5,1,Employment!X84*2)","v":0.87438019920036436},{"$f":"Accidents!P68","v":0.14496336996336998},{"$f":"IF('Energy efficiency'!Y84>0.05,0,IF('Energy efficiency'!Y84<0.02,1,('Energy efficiency'!Y84-0.05)/(-0.03)))","v":0.92648605282895091},0.50904306906379471,{"$f":"IF('2a Site and stand'!$D$7=\"non-uniform\",0,1)","v":1},{"$f":"IF('2a Site and stand'!$D$9=\"low\",0,1)","v":1},{"$f":"IF('2a Site and stand'!$D$17=\"no restrictions\",1,IF('2a Site and stand'!$D$17=\"other soil types\",1,0))","v":1},{"$f":"IF('2a Site and stand'!$D$11=\"0 to 35 %\",1,IF('2a Site and stand'!$D$11=\"no restrictions\",1,IF('2a Site and stand'!$D$13=\"< 80 m\",1,0)))","v":1},{"$f":"IF('2a Site and stand'!$D$13=\"< 80 m\",1,IF('2a Site and stand'!$D$13=\"no restrictions\",1,IF('2a Site and stand'!$D$11=\"0 to 35 %\",1,IF('2a Site and stand'!$D$11=\"no restrictions\",1,0))))","v":1},1,1,1,{"$f":"IF('2b Environment'!$D$18=\"not possible\",0,1)","v":1},0.50904306906379471,2.1666666666666667E-2,4.4999999999999998E-2,0,4.2812500000000003E-2,1.9132803134093022E-2,0.13333333333333333,0.14573003320006073,2.4160561660561661E-2,7.7207171069079233E-2,null,2.1666666666666667E-2,4.4999999999999998E-2,0,4.2812500000000003E-2,1.9132803134093022E-2,0.13333333333333333,0.14573003320006073,2.4160561660561661E-2,7.7207171069079233E-2]
[45,null,null,"Feller-buncher","Chipper","Shuttle",null,"WT","trees","stand",0.26,0.36,{"$f":"IF(Emissions!X85>12,0,IF(Emissions!X85<5,1,(Emissions!X85-12)/(-7)))","v":0.44145163082661171},{"$f":"IF(Damage!Y72>0.5,0,IF(Damage!Y72<0.1,1,(Damage!Y72-0.5)/(-0.4)))","v":0.63370000000000004},{"$f":"IF('Contribution margin'!AB85<-10,0,IF('Contribution margin'!AB85>10,1,('Contribution margin'!AB85+10)/20))","v":0},0,{"$f":"IF(Employment!X85>0.5,1,Employment!X85*2)","v":0.4533590607417704},{"$f":"Accidents!P69","v":0.91346153846153844},{"$f":"IF('Energy efficiency'!Y85>0.05,0,IF('Energy efficiency'!Y85<0.02,1,('Energy efficiency'!Y85-0.05)/(-0.03)))","v":0.496687862679007},0.37366908842380209,{"$f":"IF('2a Site and stand'!$D$7=\"non-uniform\",0,1)","v":1},{"$f":"IF('2a Site and stand'!$D$9=\"low\",0,1)","v":1},{"$f":"IF('2a Site and stand'!$D$17=\"no restrictions\",1,IF('2a Site and stand'!$D$17=\"other soil types\",1,0))","v":1},{"$f":"IF('2a Site and stand'!$D$11=\"0 to 35 %\",1,IF('2a Site and stand'!$D$11=\"no restrictions\",1,0))","v":1},1,{"$f":"IF('2a Site and stand'!$D$15<30,1,0)","v":1},1,1,1,0.37366908842380209,2.1666666666666667E-2,0.03,0,5.2808333333333332E-2,0,0,7.5559843456961734E-2,0.15224358974358973,4.1390655223250583E-2,null,2.1666666666666667E-2,0.03,0,5.2808333333333332E-2,0,0,7.5559843456961734E-2,0.15224358974358973,4.1390655223250583E-2]
[46,null,null,"Feller-buncher",null,"Forwarder",null,"WT","trees","forest road",0.26,0.4,{"$f":"IF(Emissions!X86>12,0,IF(Emissions!X86<5,1,(Emissions!X86-12)/(-7)))","v":0.74051708610410194},{"$f":"IF(Damage!Y73>0.5,0,IF(Damage!Y73<0.1,1,(Damage!Y73-0.5)/(-0.4)))","v":0.90999999999999992},{"$f":"IF('Contribution margin'!AB86<-10,0,IF('Contribution margin'!AB86>10,1,('Contribution margin'!AB86+10)/20))","v":0.17238113869094923},0.2,{"$f":"IF(Employment!X86>0.5,1,Employment!X86*2)","v":0.45940228479333123},{"$f":"Accidents!P70","v":0.91346153846153844},{"$f":"IF('Energy efficiency'!Y86>0.05,0,IF('Energy efficiency'!Y86<0.02,1,('Energy efficiency'!Y86-0.05)/(-0.03)))","v":0.77158641247952831},0.48600636136426384,{"$f":"IF('2a Site and stand'!$D$7=\"non-uniform\",0,1)","v":1},{"$f":"IF('2a Site and stand'!$D$9=\"low\",0,1)","v":1},{"$f":"IF('2a Site and stand'!$D$17=\"no restrictions\",1,IF('2a Site and stand'!$D$17=\"other soil types\",1,0))","v":1},{"$f":"IF('2a Site and stand'!$D$11=\"0 to 35 %\",1,IF('2a Site and stand'!$D$11=\"no restrictions\",1,0))","v":1},1,{"$f":"IF('2a Site and stand'!$D$15<30,1,0)","v":1},{"$f":"IF('2b Environment'!$D$16=\"not possible\",0,1)","v":1},1,1,0.48600636136426384,2.1666666666666667E-2,3.3333333333333333E-2,0,7.5833333333333322E-2,2.8730189781824872E-2,3.3333333333333333E-2,7.6567047465555205E-2,0.15224358974358973,6.429886770662735E-2,null,2.1666666666666667E-2,3.3333333333333333E-2,0,7.5833333333333322E-2,2.8730189781824872E-2,3.3333333333333333E-2,7.6567047465555205E-2,0.15224358974358973,6.429886770662735E-2]
[47,null,null,"Feller-buncher",null,"Forwarder",null,"WT","trees","terminal",0.26,0.4,{"$f":"IF(Emissions!X87>12,0,IF(Emissions!X87<5,1,(Emissions!X87-12)/(-7)))","v":0.69442131355638992},{"$f":"IF(Damage!Y74>0.5,0,IF(Damage!Y74<0.1,1,(Damage!Y74-0.5)/(-0.4)))","v":0.90999999999999992},{"$f":"IF('Contribution margin'!AB87<-10,0,IF('Contribution margin'!AB87>10,1,('Contribution margin'!AB87+10)/20))","v":0},0.5,{"$f":"IF(Employment!X87>0.5,1,Employment!X87*2)","v":0.59520738881150437},{"$f":"Accidents!P71","v":0.91346153846153844},{"$f":"IF('Energy efficiency'!Y87>0.05,0,IF('Energy efficiency'!Y87<0.02,1,('Energy efficiency'!Y87-0.05)/(-0.03)))","v":0.72921555084476264},0.52637945044923728,{"$f":"IF('2a Site and stand'!$D$7=\"non-uniform\",0,1)","v":1},{"$f":"IF('2a Site and stand'!$D$9=\"low\",0,1)","v":1},{"$f":"IF('2a Site and stand'!$D$17=\"no restrictions\",1,IF('2a Site and stand'!$D$17=\"other soil types\",1,0))","v":1},{"$f":"IF('2a Site and stand'!$D$11=\"0 to 35 %\",1,IF('2a Site and stand'!$D$11=\"no restrictions\",1,0))","v":1},1,{"$f":"IF('2a Site and stand'!$D$15<30,1,0)","v":1},1,{"$f":"IF('2b Environment'!$D$17=\"not possible\",0,1)","v":1},1,0.52637945044923728,2.1666666666666667E-2,3.3333333333333333E-2,0,7.5833333333333322E-2,0,8.3333333333333329E-2,9.9201231468584061E-2,0.15224358974358973,6.0767962570396884E-2,null,2.1666666666666667E-2,3.3333333333333333E-2,0,7.5833333333333322E-2,0,8.3333333333333329E-2,9.9201231468584061E-2,0.15224358974358973,6.0767962570396884E-2]
[48,null,null,"Feller-buncher",null,"Forwarder",null,"WT","trees","plant",0.26,0.4,{"$f":"IF(Emissions!X88>12,0,IF(Emissions!X88<5,1,(Emissions!X88-12)/(-7)))","v":0.6301862400695859},{"$f":"IF(Damage!Y75>0.5,0,IF(Damage!Y75<0.1,1,(Damage!Y75-0.5)/(-0.4)))","v":0.90999999999999992},{"$f":"IF('Contribution margin'!AB88<-10,0,IF('Contribution margin'!AB88>10,1,('Contribution margin'!AB88+10)/20))","v":0},0.8,{"$f":"IF(Employment!X88>0.5,1,Employment!X88*2)","v":0.63112468759895068},{"$f":"Accidents!P72","v":0.91346153846153844},{"$f":"IF('Energy efficiency'!Y88>0.05,0,IF('Energy efficiency'!Y88<0.02,1,('Energy efficiency'!Y88-0.05)/(-0.03)))","v":0.67017119036699335},0.57744530354066426,{"$f":"IF('2a Site and stand'!$D$7=\"non-uniform\",0,1)","v":1},{"$f":"IF('2a Site and stand'!$D$9=\"low\",0,1)","v":1},{"$f":"IF('2a Site and stand'!$D$17=\"no restrictions\",1,IF('2a Site and stand'!$D$17=\"other soil types\",1,0))","v":1},{"$f":"IF('2a Site and stand'!$D$11=\"0 to 35 %\",1,IF('2a Site and stand'!$D$11=\"no restrictions\",1,0))","v":1},1,{"$f":"IF('2a Site and stand'!$D$15<30,1,0)","v":1},1,1,{"$f":"IF('2b Environment'!$D$18=\"not possible\",0,1)","v":1},0.57744530354066426,2.1666666666666667E-2,3.3333333333333333E-2,0,7.5833333333333322E-2,0,0.13333333333333333,0.10518744793315844,0.15224358974358973,5.5847599197249444E-2,null,2.1666666666666667E-2,3.3333333333333333E-2,0,7.5833333333333322E-2,0,0.13333333333333333,0.10518744793315844,0.15224358974358973,5.5847599197249444E-2]

{"sheet":"Values","index":14,"n_rows":50,"n_cols":25,"rows_kept":50,"cut":false,"hidden":true,"merged":[[49,3,49,4],[21,3,21,4],[22,3,22,4],[23,3,23,4],[24,3,24,4],[25,3,25,4],[26,3,26,4],[35,3,35,4],[36,3,36,4],[37,3,37,4],[47,3,47,4],[48,3,48,4],[20,3,20,4],[9,3,9,4],[10,3,10,4],[11,3,11,4],[12,3,12,4],[13,3,13,4],[14,3,14,4],[15,3,15,4],[16,3,16,4],[17,3,17,4],[18,3,18,4],[19,3,19,4],[0,9,1,9],[2,3,2,4],[8,3,8,4],[0,0,1,0],[0,3,1,6],[0,7,1,7],[0,8,1,8],[3,3,3,4],[4,3,4,4],[5,3,5,4],[6,3,6,4],[7,3,7,4]]}
["ID",null,null,"Machines",null,null,null,"Method","Type of wood","Chipping place","Nutrient loss","Bearing pressure","Emissions","Damage stand","Purchase","Felling & Processing","Extracting","Bundling","Chipping","Transporting","Storing","Contribution margin","Employment","Energy demand","Energy efficiency"]
[null,null,null,null,null,null,null,null,null,null,"kg/ha","kPa","kgCO2/m³ loose","%","€/m³ loose","€/m³ loose","€/m³ loose","€/m³ loose","€/m³ loose","€/m³ loose","€/m³ loose","€/m³ loose","h/m³ loose","kWh/m³ loose","%"]
[1,"B",4,"Chain saw",null,"Forwarder",null,"CTL","logs","forest road",640,300,{"$f":"Emissions!X41/'Energy content'!$C$122","v":2.7861982852132576},{"$f":"Damage!Y28","v":0.184},{"$f":"'Contribution margin'!I41/'Energy content'!$C$122","v":0.45207054637186034},{"$f":"SUM('Contribution margin'!J41:M41)/'Energy content'!$C$122","v":9.8453333333333362},{"$f":"SUM('Contribution margin'!N41:Q41)/'Energy content'!$C$122","v":2.9936448598130845},{"$f":"'Contribution margin'!R41/'Energy content'!$C$122","v":0},{"$f":"SUM('Contribution margin'!S41:U41)/'Energy content'!$C$122","v":1.7074626865671643},{"$f":"SUM('Contribution margin'!V41:X41)/'Energy content'!$C$122","v":1.3139396168969573},{"$f":"SUM('Contribution margin'!Y41:Z41)/'Energy content'!$C$122","v":0.4},{"$f":"'Contribution margin'!AB41/'Energy content'!$C$122","v":-1.6434328305870534},{"$f":"Employment!X41/'Energy content'!$C$122","v":0.33112356986208785},{"$f":"'Energy efficiency'!X41*1000/'Energy content'!$C$122","v":11.460594618516874},{"$f":"'Energy efficiency'!Y41","v":1.5210804654930625E-2}]
[2,"B",5,"Chain saw",null,"Forwarder",null,"CTL","logs","terminal",640,300,{"$f":"Emissions!X42/'Energy content'!$C$122","v":2.8979215524577198},{"$f":"Damage!Y29","v":0.184},{"$f":"'Contribution margin'!I42/'Energy content'!$C$122","v":0.45207054637186034},{"$f":"SUM('Contribution margin'!J42:M42)/'Energy content'!$C$122","v":9.8453333333333362},{"$f":"SUM('Contribution margin'!N42:Q42)/'Energy content'!$C$122","v":2.9936448598130845},{"$f":"'Contribution margin'!R42/'Energy content'!$C$122","v":0},{"$f":"SUM('Contribution margin'!S42:U42)/'Energy content'!$C$122","v":1.7074626865671643},{"$f":"SUM('Contribution margin'!V42:X42)/'Energy content'!$C$122","v":4.0103051226708839},{"$f":"SUM('Contribution margin'!Y42:Z42)/'Energy content'!$C$122","v":1.6},{"$f":"'Contribution margin'!AB42/'Energy content'!$C$122","v":-5.5397983363609802},{"$f":"Employment!X42/'Energy content'!$C$122","v":0.36438158158468908},{"$f":"'Energy efficiency'!X42*1000/'Energy content'!$C$122","v":11.900716580388998},{"$f":"'Energy efficiency'!Y42","v":1.5794946177183338E-2}]
[3,"B",6,"Chain saw",null,"Forwarder",null,"CTL","logs","plant",640,300,{"$f":"Emissions!X43/'Energy content'!$C$122","v":2.9520224431133464},{"$f":"Damage!Y30","v":0.184},{"$f":"'Contribution margin'!I43/'Energy content'!$C$122","v":0.45207054637186034},{"$f":"SUM('Contribution margin'!J43:M43)/'Energy content'!$C$122","v":9.8453333333333362},{"$f":"SUM('Contribution margin'!N43:Q43)/'Energy content'!$C$122","v":2.9936448598130845},{"$f":"'Contribution margin'!R43/'Energy content'!$C$122","v":0},{"$f":"SUM('Contribution margin'!S43:U43)/'Energy content'!$C$122","v":1.7074626865671643},{"$f":"SUM('Contribution margin'!V43:X43)/'Energy content'!$C$122","v":3.4106746091991589},{"$f":"SUM('Contribution margin'!Y43:Z43)/'Energy content'!$C$122","v":0.4},{"$f":"'Contribution margin'!AB43/'Energy content'!$C$122","v":-3.7401678228892554},{"$f":"Employment!X43/'Energy content'!$C$122","v":0.3541459634189138},{"$f":"'Energy efficiency'!X43*1000/'Energy content'!$C$122","v":12.113841301153586},{"$f":"'Energy efficiency'!Y43","v":1.6077810950137529E-2}]
[4,"G",17,"Chain saw",null,"Forwarder",null,"CTL","residues","forest road",960,300,{"$f":"Emissions!X44/'Energy content'!$C$122","v":6.5591676933272529},{"$f":"Damage!Y31","v":5.4399999999999997E-2},{"$f":"'Contribution margin'!I44/'Energy content'!$C$122","v":0.45207054637186034},{"$f":"SUM('Contribution margin'!J44:M44)/'Energy content'!$C$122","v":0.98453333333333359},{"$f":"SUM('Contribution margin'!N44:Q44)/'Energy content'!$C$122","v":10.677333333333335},{"$f":"'Contribution margin'!R44/'Energy content'!$C$122","v":0},{"$f":"SUM('Contribution margin'!S44:U44)/'Energy content'!$C$122","v":4.4000000000000012},{"$f":"SUM('Contribution margin'!V44:X44)/'Energy content'!$C$122","v":1.3139396168969573},{"$f":"SUM('Contribution margin'!Y44:Z44)/'Energy content'!$C$122","v":0.4},{"$f":"'Contribution margin'!AB44/'Energy content'!$C$122","v":-3.1588586175401412},{"$f":"Employment!X44/'Energy content'!$C$122","v":0.1988418082889328},{"$f":"'Energy efficiency'!X44*1000/'Energy content'!$C$122","v":25.887611656541704},{"$f":"'Energy efficiency'!Y44","v":3.435872369607635E-2}]
[5,"G",18,"Chain saw",null,"Forwarder",null,"CTL","residues","terminal",960,300,{"$f":"Emissions!X45/'Energy content'!$C$122","v":6.8049539810423552},{"$f":"Damage!Y32","v":5.4399999999999997E-2},{"$f":"'Contribution margin'!I45/'Energy content'!$C$122","v":0.45207054637186034},{"$f":"SUM('Contribution margin'!J45:M45)/'Energy content'!$C$122","v":0.98453333333333359},{"$f":"SUM('Contribution margin'!N45:Q45)/'Energy content'!$C$122","v":10.677333333333335},{"$f":"'Contribution margin'!R45/'Energy content'!$C$122","v":0},{"$f":"SUM('Contribution margin'!S45:U45)/'Energy content'!$C$122","v":4.4000000000000012},{"$f":"SUM('Contribution margin'!V45:X45)/'Energy content'!$C$122","v":4.6597810622740896},{"$f":"SUM('Contribution margin'!Y45:Z45)/'Energy content'!$C$122","v":1.6},{"$f":"'Contribution margin'!AB45/'Energy content'!$C$122","v":-7.7047000629172722},{"$f":"Employment!X45/'Energy content'!$C$122","v":0.25040084725441725},{"$f":"'Energy efficiency'!X45*1000/'Energy content'!$C$122","v":26.855860668752705},{"$f":"'Energy efficiency'!Y45","v":3.5643809424374895E-2}]
[6,"G",19,"Chain saw",null,"Forwarder","Bundler","CTL","residues","terminal",960,300,{"$f":"Emissions!X46/'Energy content'!$C$122","v":8.1164240534858312},{"$f":"Damage!Y33","v":5.4399999999999997E-2},{"$f":"'Contribution margin'!I46/'Energy content'!$C$122","v":0.45207054637186034},{"$f":"SUM('Contribution margin'!J46:M46)/'Energy content'!$C$122","v":0.98453333333333359},{"$f":"SUM('Contribution margin'!N46:Q46)/'Energy content'!$C$122","v":10.677333333333335},{"$f":"'Contribution margin'!R46/'Energy content'!$C$122","v":10.187755102040818},{"$f":"SUM('Contribution margin'!S46:U46)/'Energy content'!$C$122","v":2.1185185185185191},{"$f":"SUM('Contribution margin'!V46:X46)/'Energy content'!$C$122","v":4.4202188277045158},{"$f":"SUM('Contribution margin'!Y46:Z46)/'Energy content'!$C$122","v":1.6},{"$f":"'Contribution margin'!AB46/'Energy content'!$C$122","v":-15.371411448907031},{"$f":"Employment!X46/'Energy content'!$C$122","v":0.30888488441416895},{"$f":"'Energy efficiency'!X46*1000/'Energy content'!$C$122","v":32.022257923833067},{"$f":"'Energy efficiency'!Y46","v":4.2500788667827701E-2}]
[7,"G",19,"Chain saw",null,"Forwarder",null,"CTL","residues","plant",960,300,{"$f":"Emissions!X47/'Energy content'!$C$122","v":7.1495247493843648},{"$f":"Damage!Y34","v":5.4399999999999997E-2},{"$f":"'Contribution margin'!I47/'Energy content'!$C$122","v":0.45207054637186034},{"$f":"SUM('Contribution margin'!J47:M47)/'Energy content'!$C$122","v":0.98453333333333359},{"$f":"SUM('Contribution margin'!N47:Q47)/'Energy content'!$C$122","v":10.677333333333335},{"$f":"'Contribution margin'!R47/'Energy content'!$C$122","v":0},{"$f":"SUM('Contribution margin'!S47:U47)/'Energy content'!$C$122","v":4.4000000000000012},{"$f":"SUM('Contribution margin'!V47:X47)/'Energy content'!$C$122","v":5.6863913288645698},{"$f":"SUM('Contribution margin'!Y47:Z47)/'Energy content'!$C$122","v":0.4},{"$f":"'Contribution margin'!AB47/'Energy content'!$C$122","v":-7.5313103295077521},{"$f":"Employment!X47/'Energy content'!$C$122","v":0.25031066084157638},{"$f":"'Energy efficiency'!X47*1000/'Energy content'!$C$122","v":28.213260665251539},{"$f":"'Energy efficiency'!Y47","v":3.7445386643761722E-2}]
[8,"G",20,"Chain saw",null,"Forwarder","Bundler","CTL","residues","plant",960,300,{"$f":"Emissions!X48/'Energy content'!$C$122","v":8.2415766530139525},{"$f":"Damage!Y35","v":5.4399999999999997E-2},{"$f":"'Contribution margin'!I48/'Energy content'!$C$122","v":0.45207054637186034},{"$f":"SUM('Contribution margin'!J48:M48)/'Energy content'!$C$122","v":0.98453333333333359},{"$f":"SUM('Contribution margin'!N48:Q48)/'Energy content'!$C$122","v":10.677333333333335},{"$f":"'Contribution margin'!R48/'Energy content'!$C$122","v":10.187755102040818},{"$f":"SUM('Contribution margin'!S48:U48)/'Energy content'!$C$122","v":2.1185185185185191},{"$f":"SUM('Contribution margin'!V48:X48)/'Energy content'!$C$122","v":3.89603819933438},{"$f":"SUM('Contribution margin'!Y48:Z48)/'Energy content'!$C$122","v":0.4},{"$f":"'Contribution margin'!AB48/'Energy content'!$C$122","v":-13.647230820536898},{"$f":"Employment!X48/'Energy content'!$C$122","v":0.29959238981216352},{"$f":"'Energy efficiency'!X48*1000/'Energy content'!$C$122","v":32.51528331591355},{"$f":"'Energy efficiency'!Y48","v":4.3155145023538961E-2}]
[9,"H",21,"Chain saw",null,"Forwarder",null,"WT","trees","forest road",960,300,{"$f":"Emissions!X49/'Energy content'!$C$122","v":4.117013074926045},{"$f":"Damage!Y36","v":0.184},{"$f":"'Contribution margin'!I49/'Energy content'!$C$122","v":0.45207054637186034},{"$f":"SUM('Contribution margin'!J49:M49)/'Energy content'!$C$122","v":4.9226666666666681},{"$f":"SUM('Contribution margin'!N49:Q49)/'Energy content'!$C$122","v":5.8240000000000007},{"$f":"'Contribution margin'!R49/'Energy content'!$C$122","v":0},{"$f":"SUM('Contribution margin'!S49:U49)/'Energy content'!$C$122","v":2.6917647058823531},{"$f":"SUM('Contribution margin'!V49:X49)/'Energy content'!$C$122","v":1.3139396168969573},{"$f":"SUM('Contribution margin'!Y49:Z49)/'Energy content'!$C$122","v":0.4},{"$f":"'Contribution margin'!AB49/'Energy content'!$C$122","v":-0.53542332342249288},{"$f":"Employment!X49/'Energy content'!$C$122","v":0.23743635100112256},{"$f":"'Energy efficiency'!X49*1000/'Energy content'!$C$122","v":17.351832679001593},{"$f":"'Energy efficiency'!Y49","v":2.3029811809144235E-2}]
[10,"H",22,"Chain saw",null,"Forwarder",null,"WT","trees","terminal",960,300,{"$f":"Emissions!X50/'Energy content'!$C$122","v":4.3601293875386125},{"$f":"Damage!Y37","v":0.184},{"$f":"'Contribution margin'!I50/'Energy content'!$C$122","v":0.45207054637186034},{"$f":"SUM('Contribution margin'!J50:M50)/'Energy content'!$C$122","v":4.9226666666666681},{"$f":"SUM('Contribution margin'!N50:Q50)/'Energy content'!$C$122","v":5.8240000000000007},{"$f":"'Contribution margin'!R50/'Energy content'!$C$122","v":0},{"$f":"SUM('Contribution margin'!S50:U50)/'Energy content'!$C$122","v":2.6917647058823531},{"$f":"SUM('Contribution margin'!V50:X50)/'Energy content'!$C$122","v":4.633924106420003},{"$f":"SUM('Contribution margin'!Y50:Z50)/'Energy content'!$C$122","v":1.6},{"$f":"'Contribution margin'!AB50/'Energy content'!$C$122","v":-5.0554078129455409},{"$f":"Employment!X50/'Energy content'!$C$122","v":0.28859759064577489},{"$f":"'Energy efficiency'!X50*1000/'Energy content'!$C$122","v":18.309563607475344},{"$f":"'Energy efficiency'!Y50","v":2.4300937658187204E-2}]
[11,"H",23,"Chain saw",null,"Forwarder",null,"WT","trees","plant",960,300,{"$f":"Emissions!X51/'Energy content'!$C$122","v":4.6989152098251328},{"$f":"Damage!Y38","v":0.184},{"$f":"'Contribution margin'!I51/'Energy content'!$C$122","v":0.45207054637186034},{"$f":"SUM('Contribution margin'!J51:M51)/'Energy content'!$C$122","v":4.9226666666666681},{"$f":"SUM('Contribution margin'!N51:Q51)/'Energy content'!$C$122","v":5.8240000000000007},{"$f":"'Contribution margin'!R51/'Energy content'!$C$122","v":0},{"$f":"SUM('Contribution margin'!S51:U51)/'Energy content'!$C$122","v":2.6917647058823531},{"$f":"SUM('Contribution margin'!V51:X51)/'Energy content'!$C$122","v":4.5863500463812015},{"$f":"SUM('Contribution margin'!Y51:Z51)/'Energy content'!$C$122","v":0.4},{"$f":"'Contribution margin'!AB51/'Energy content'!$C$122","v":-3.8078337529067374},{"$f":"Employment!X51/'Energy content'!$C$122","v":0.30212855138497674},{"$f":"'Energy efficiency'!X51*1000/'Energy content'!$C$122","v":19.644174422543454},{"$f":"'Energy efficiency'!Y51","v":2.6072268472520282E-2}]
[12,"D",10,"Harvester",null,"Forwarder",null,"CTL","logs","forest road",640,300,{"$f":"Emissions!X52/'Energy content'!$C$122","v":4.350408859925901},{"$f":"Damage!Y39","v":0.1072},{"$f":"'Contribution margin'!I52/'Energy content'!$C$122","v":0.45207054637186034},{"$f":"SUM('Contribution margin'!J52:M52)/'Energy content'!$C$122","v":4.8772413793103455},{"$f":"SUM('Contribution margin'!N52:Q52)/'Energy content'!$C$122","v":2.9936448598130845},{"$f":"'Contribution margin'!R52/'Energy content'!$C$122","v":0},{"$f":"SUM('Contribution margin'!S52:U52)/'Energy content'!$C$122","v":1.7074626865671643},{"$f":"SUM('Contribution margin'!V52:X52)/'Energy content'!$C$122","v":1.3139396168969573},{"$f":"SUM('Contribution margin'!Y52:Z52)/'Energy content'!$C$122","v":0.4},{"$f":"'Contribution margin'!AB52/'Energy content'!$C$122","v":3.3246591234359335},{"$f":"Employment!X52/'Energy content'!$C$122","v":0.11043391468967408},{"$f":"'Energy efficiency'!X52*1000/'Energy content'!$C$122","v":17.137974296677793},{"$f":"'Energy efficiency'!Y52","v":2.2745973301141257E-2}]
[13,"D",11,"Harvester",null,"Forwarder",null,"CTL","logs","terminal",640,300,{"$f":"Emissions!X53/'Energy content'!$C$122","v":4.4621321271703636},{"$f":"Damage!Y40","v":0.1072},{"$f":"'Contribution margin'!I53/'Energy content'!$C$122","v":0.45207054637186034},{"$f":"SUM('Contribution margin'!J53:M53)/'Energy content'!$C$122","v":4.8772413793103455},{"$f":"SUM('Contribution margin'!N53:Q53)/'Energy content'!$C$122","v":2.9936448598130845},{"$f":"'Contribution margin'!R53/'Energy content'!$C$122","v":0},{"$f":"SUM('Contribution margin'!S53:U53)/'Energy content'!$C$122","v":1.7074626865671643},{"$f":"SUM('Contribution margin'!V53:X53)/'Energy content'!$C$122","v":4.0103051226708839},{"$f":"SUM('Contribution margin'!Y53:Z53)/'Energy content'!$C$122","v":1.6},{"$f":"'Contribution margin'!AB53/'Energy content'!$C$122","v":-0.57170638233799298},{"$f":"Employment!X53/'Energy content'!$C$122","v":0.14369192641227532},{"$f":"'Energy efficiency'!X53*1000/'Energy content'!$C$122","v":17.578096258549916},{"$f":"'Energy efficiency'!Y53","v":2.333011482339397E-2}]
[14,"D",12,"Harvester",null,"Forwarder",null,"CTL","logs","plant",640,300,{"$f":"Emissions!X54/'Energy content'!$C$122","v":4.5162330178259902},{"$f":"Damage!Y41","v":0.1072},{"$f":"'Contribution margin'!I54/'Energy content'!$C$122","v":0.45207054637186034},{"$f":"SUM('Contribution margin'!J54:M54)/'Energy content'!$C$122","v":4.8772413793103455},{"$f":"SUM('Contribution margin'!N54:Q54)/'Energy content'!$C$122","v":2.9936448598130845},{"$f":"'Contribution margin'!R54/'Energy content'!$C$122","v":0},{"$f":"SUM('Contribution margin'!S54:U54)/'Energy content'!$C$122","v":1.7074626865671643},{"$f":"SUM('Contribution margin'!V54:X54)/'Energy content'!$C$122","v":3.4106746091991589},{"$f":"SUM('Contribution margin'!Y54:Z54)/'Energy content'!$C$122","v":0.4},{"$f":"'Contribution margin'!AB54/'Energy content'!$C$122","v":1.2279241311337314},{"$f":"Employment!X54/'Energy content'!$C$122","v":0.13345630824650001},{"$f":"'Energy efficiency'!X54*1000/'Energy content'!$C$122","v":17.791220979314506},{"$f":"'Energy efficiency'!Y54","v":2.3612979596348161E-2}]
[15,"K",31,"Harvester",null,"Forwarder",null,"CTL","residues","forest road",960,300,{"$f":"Emissions!X55/'Energy content'!$C$122","v":6.715588750798517},{"$f":"Damage!Y42","v":4.6719999999999998E-2},{"$f":"'Contribution margin'!I55/'Energy content'!$C$122","v":0.45207054637186034},{"$f":"SUM('Contribution margin'!J55:M55)/'Energy content'!$C$122","v":0.48772413793103458},{"$f":"SUM('Contribution margin'!N55:Q55)/'Energy content'!$C$122","v":10.677333333333335},{"$f":"'Contribution margin'!R55/'Energy content'!$C$122","v":0},{"$f":"SUM('Contribution margin'!S55:U55)/'Energy content'!$C$122","v":4.4000000000000012},{"$f":"SUM('Contribution margin'!V55:X55)/'Energy content'!$C$122","v":1.3139396168969573},{"$f":"SUM('Contribution margin'!Y55:Z55)/'Energy content'!$C$122","v":0.4},{"$f":"'Contribution margin'!AB55/'Energy content'!$C$122","v":-2.6620494221378426},{"$f":"Employment!X55/'Energy content'!$C$122","v":0.17677284277169142},{"$f":"'Energy efficiency'!X55*1000/'Energy content'!$C$122","v":26.45534962435779},{"$f":"'Energy efficiency'!Y55","v":3.5112240560697408E-2}]
[16,"K",32,"Harvester",null,"Forwarder",null,"CTL","residues","terminal",960,300,{"$f":"Emissions!X56/'Energy content'!$C$122","v":6.9613750385136193},{"$f":"Damage!Y43","v":4.6719999999999998E-2},{"$f":"'Contribution margin'!I56/'Energy content'!$C$122","v":0.45207054637186034},{"$f":"SUM('Contribution margin'!J56:M56)/'Energy content'!$C$122","v":0.48772413793103458},{"$f":"SUM('Contribution margin'!N56:Q56)/'Energy content'!$C$122","v":10.677333333333335},{"$f":"'Contribution margin'!R56/'Energy content'!$C$122","v":0},{"$f":"SUM('Contribution margin'!S56:U56)/'Energy content'!$C$122","v":4.4000000000000012},{"$f":"SUM('Contribution margin'!V56:X56)/'Energy content'!$C$122","v":4.6597810622740896},{"$f":"SUM('Contribution margin'!Y56:Z56)/'Energy content'!$C$122","v":1.6},{"$f":"'Contribution margin'!AB56/'Energy content'!$C$122","v":-7.2078908675149762},{"$f":"Employment!X56/'Energy content'!$C$122","v":0.22833188173717586},{"$f":"'Energy efficiency'!X56*1000/'Energy content'!$C$122","v":27.423598636568798},{"$f":"'Energy efficiency'!Y56","v":3.6397326288995953E-2}]
[17,"K",32,"Harvester",null,"Forwarder","Bundler","CTL","residues","terminal",960,300,{"$f":"Emissions!X57/'Energy content'!$C$122","v":8.2728451109570944},{"$f":"Damage!Y44","v":4.6719999999999998E-2},{"$f":"'Contribution margin'!I57/'Energy content'!$C$122","v":0.45207054637186034},{"$f":"SUM('Contribution margin'!J57:M57)/'Energy content'!$C$122","v":0.48772413793103458},{"$f":"SUM('Contribution margin'!N57:Q57)/'Energy content'!$C$122","v":10.677333333333335},{"$f":"'Contribution margin'!R57/'Energy content'!$C$122","v":10.187755102040818},{"$f":"SUM('Contribution margin'!S57:U57)/'Energy content'!$C$122","v":2.1185185185185191},{"$f":"SUM('Contribution margin'!V57:X57)/'Energy content'!$C$122","v":4.4202188277045158},{"$f":"SUM('Contribution margin'!Y57:Z57)/'Energy content'!$C$122","v":1.6},{"$f":"'Contribution margin'!AB57/'Energy content'!$C$122","v":-14.874602253504735},{"$f":"Employment!X57/'Energy content'!$C$122","v":0.28681591889692754},{"$f":"'Energy efficiency'!X57*1000/'Energy content'!$C$122","v":32.58999589164916},{"$f":"'Energy efficiency'!Y57","v":4.3254305532448765E-2}]
[18,"K",33,"Harvester",null,"Forwarder",null,"CTL","residues","plant",960,300,{"$f":"Emissions!X58/'Energy content'!$C$122","v":7.3059458068556289},{"$f":"Damage!Y45","v":4.6719999999999998E-2},{"$f":"'Contribution margin'!I58/'Energy content'!$C$122","v":0.45207054637186034},{"$f":"SUM('Contribution margin'!J58:M58)/'Energy content'!$C$122","v":0.48772413793103458},{"$f":"SUM('Contribution margin'!N58:Q58)/'Energy content'!$C$122","v":10.677333333333335},{"$f":"'Contribution margin'!R58/'Energy content'!$C$122","v":0},{"$f":"SUM('Contribution margin'!S58:U58)/'Energy content'!$C$122","v":4.4000000000000012},{"$f":"SUM('Contribution margin'!V58:X58)/'Energy content'!$C$122","v":5.6863913288645698},{"$f":"SUM('Contribution margin'!Y58:Z58)/'Energy content'!$C$122","v":0.4},{"$f":"'Contribution margin'!AB58/'Energy content'!$C$122","v":-7.0345011341054562},{"$f":"Employment!X58/'Energy content'!$C$122","v":0.228241695324335},{"$f":"'Energy efficiency'!X58*1000/'Energy content'!$C$122","v":28.780998633067625},{"$f":"'Energy efficiency'!Y58","v":3.819890350838278E-2}]
[19,"K",34,"Harvester",null,"Forwarder","Bundler","CTL","residues","plant",960,300,{"$f":"Emissions!X59/'Energy content'!$C$122","v":8.3979977104852175},{"$f":"Damage!Y46","v":4.6719999999999998E-2},{"$f":"'Contribution margin'!I59/'Energy content'!$C$122","v":0.45207054637186034},{"$f":"SUM('Contribution margin'!J59:M59)/'Energy content'!$C$122","v":0.48772413793103458},{"$f":"SUM('Contribution margin'!N59:Q59)/'Energy content'!$C$122","v":10.677333333333335},{"$f":"'Contribution margin'!R59/'Energy content'!$C$122","v":10.187755102040818},{"$f":"SUM('Contribution margin'!S59:U59)/'Energy content'!$C$122","v":2.1185185185185191},{"$f":"SUM('Contribution margin'!V59:X59)/'Energy content'!$C$122","v":3.89603819933438},{"$f":"SUM('Contribution margin'!Y59:Z59)/'Energy content'!$C$122","v":0.4},{"$f":"'Contribution margin'!AB59/'Energy content'!$C$122","v":-13.150421625134602},{"$f":"Employment!X59/'Energy content'!$C$122","v":0.27752342429492211},{"$f":"'Energy efficiency'!X59*1000/'Energy content'!$C$122","v":33.083021283729643},{"$f":"'Energy efficiency'!Y59","v":4.3908661888160026E-2}]
[20,"L",35,"Harvester",null,"Forwarder",null,"CTL","trees","forest road",960,300,{"$f":"Emissions!X60/'Energy content'!$C$122","v":5.8458769829720234},{"$f":"Damage!Y47","v":0.1072},{"$f":"'Contribution margin'!I60/'Energy content'!$C$122","v":0.45207054637186034},{"$f":"SUM('Contribution margin'!J60:M60)/'Energy content'!$C$122","v":4.8772413793103455},{"$f":"SUM('Contribution margin'!N60:Q60)/'Energy content'!$C$122","v":5.8240000000000007},{"$f":"'Contribution margin'!R60/'Energy content'!$C$122","v":0},{"$f":"SUM('Contribution margin'!S60:U60)/'Energy content'!$C$122","v":2.6917647058823531},{"$f":"SUM('Contribution margin'!V60:X60)/'Energy content'!$C$122","v":1.3139396168969573},{"$f":"SUM('Contribution margin'!Y60:Z60)/'Energy content'!$C$122","v":0.4},{"$f":"'Contribution margin'!AB60/'Energy content'!$C$122","v":-0.48999803606617065},{"$f":"Employment!X60/'Energy content'!$C$122","v":0.15008002916204211},{"$f":"'Energy efficiency'!X60*1000/'Energy content'!$C$122","v":23.029212357162514},{"$f":"'Energy efficiency'!Y60","v":3.056498045535487E-2}]
[21,"L",36,"Harvester",null,"Forwarder",null,"CTL","trees","terminal",960,300,{"$f":"Emissions!X61/'Energy content'!$C$122","v":6.0889932955845909},{"$f":"Damage!Y48","v":0.1072},{"$f":"'Contribution margin'!I61/'Energy content'!$C$122","v":0.45207054637186034},{"$f":"SUM('Contribution margin'!J61:M61)/'Energy content'!$C$122","v":4.8772413793103455},{"$f":"SUM('Contribution margin'!N61:Q61)/'Energy content'!$C$122","v":5.8240000000000007},{"$f":"'Contribution margin'!R61/'Energy content'!$C$122","v":0},{"$f":"SUM('Contribution margin'!S61:U61)/'Energy content'!$C$122","v":2.6917647058823531},{"$f":"SUM('Contribution margin'!V61:X61)/'Energy content'!$C$122","v":4.633924106420003},{"$f":"SUM('Contribution margin'!Y61:Z61)/'Energy content'!$C$122","v":1.6},{"$f":"'Contribution margin'!AB61/'Energy content'!$C$122","v":-5.0099825255892183},{"$f":"Employment!X61/'Energy content'!$C$122","v":0.20124126880669446},{"$f":"'Energy efficiency'!X61*1000/'Energy content'!$C$122","v":23.986943285636269},{"$f":"'Energy efficiency'!Y61","v":3.1836106304397843E-2}]
[22,"L",37,"Harvester",null,"Forwarder",null,"CTL","trees","plant",960,300,{"$f":"Emissions!X62/'Energy content'!$C$122","v":6.4277791178711112},{"$f":"Damage!Y49","v":0.1072},{"$f":"'Contribution margin'!I62/'Energy content'!$C$122","v":0.45207054637186034},{"$f":"SUM('Contribution margin'!J62:M62)/'Energy content'!$C$122","v":4.8772413793103455},{"$f":"SUM('Contribution margin'!N62:Q62)/'Energy content'!$C$122","v":5.8240000000000007},{"$f":"'Contribution margin'!R62/'Energy content'!$C$122","v":0},{"$f":"SUM('Contribution margin'!S62:U62)/'Energy content'!$C$122","v":2.6917647058823531},{"$f":"SUM('Contribution margin'!V62:X62)/'Energy content'!$C$122","v":4.5863500463812015},{"$f":"SUM('Contribution margin'!Y62:Z62)/'Energy content'!$C$122","v":0.4},{"$f":"'Contribution margin'!AB62/'Energy content'!$C$122","v":-3.7624084655504153},{"$f":"Employment!X62/'Energy content'!$C$122","v":0.21477222954589631},{"$f":"'Energy efficiency'!X62*1000/'Energy content'!$C$122","v":25.321554100704379},{"$f":"'Energy efficiency'!Y62","v":3.3607437118730918E-2}]
[23,null,null,"Chain saw",null,"Tower yarder",null,"TL","logs","forest road",640,10,{"$f":"Emissions!X63/'Energy content'!$C$122","v":4.4243949830325722},{"$f":"Damage!Y50","v":0.29449999999999998},{"$f":"'Contribution margin'!I63/'Energy content'!$C$122","v":0.45207054637186034},{"$f":"SUM('Contribution margin'!J63:M63)/'Energy content'!$C$122","v":7.3840000000000012},{"$f":"SUM('Contribution margin'!N63:Q63)/'Energy content'!$C$122","v":11.675733333333334},{"$f":"'Contribution margin'!R63/'Energy content'!$C$122","v":0},{"$f":"SUM('Contribution margin'!S63:U63)/'Energy content'!$C$122","v":1.7074626865671643},{"$f":"SUM('Contribution margin'!V63:X63)/'Energy content'!$C$122","v":1.3139396168969573},{"$f":"SUM('Contribution margin'!Y63:Z63)/'Energy content'!$C$122","v":0.4},{"$f":"'Contribution margin'!AB63/'Energy content'!$C$122","v":-7.8641879707739673},{"$f":"Employment!X63/'Energy content'!$C$122","v":0.3604070589586611},{"$f":"'Energy efficiency'!X63*1000/'Energy content'!$C$122","v":17.792931266491951},{"$f":"'Energy efficiency'!Y63","v":2.3615249534778573E-2}]
[24,null,null,"Chain saw",null,"Tower yarder",null,"TL","logs","terminal",640,10,{"$f":"Emissions!X64/'Energy content'!$C$122","v":4.5361182502770339},{"$f":"Damage!Y51","v":0.29449999999999998},{"$f":"'Contribution margin'!I64/'Energy content'!$C$122","v":0.45207054637186034},{"$f":"SUM('Contribution margin'!J64:M64)/'Energy content'!$C$122","v":7.3840000000000012},{"$f":"SUM('Contribution margin'!N64:Q64)/'Energy content'!$C$122","v":11.675733333333334},{"$f":"'Contribution margin'!R64/'Energy content'!$C$122","v":0},{"$f":"SUM('Contribution margin'!S64:U64)/'Energy content'!$C$122","v":1.7074626865671643},{"$f":"SUM('Contribution margin'!V64:X64)/'Energy content'!$C$122","v":4.0103051226708839},{"$f":"SUM('Contribution margin'!Y64:Z64)/'Energy content'!$C$122","v":1.6},{"$f":"'Contribution margin'!AB64/'Energy content'!$C$122","v":-11.760553476547896},{"$f":"Employment!X64/'Energy content'!$C$122","v":0.39366507068126233},{"$f":"'Energy efficiency'!X64*1000/'Energy content'!$C$122","v":18.233053228364074},{"$f":"'Energy efficiency'!Y64","v":2.4199391057031287E-2}]
[25,null,null,"Chain saw",null,"Tower yarder",null,"TL","logs","plant",640,10,{"$f":"Emissions!X65/'Energy content'!$C$122","v":4.5902191409326614},{"$f":"Damage!Y52","v":0.29449999999999998},{"$f":"'Contribution margin'!I65/'Energy content'!$C$122","v":0.45207054637186034},{"$f":"SUM('Contribution margin'!J65:M65)/'Energy content'!$C$122","v":7.3840000000000012},{"$f":"SUM('Contribution margin'!N65:Q65)/'Energy content'!$C$122","v":11.675733333333334},{"$f":"'Contribution margin'!R65/'Energy content'!$C$122","v":0},{"$f":"SUM('Contribution margin'!S65:U65)/'Energy content'!$C$122","v":1.7074626865671643},{"$f":"SUM('Contribution margin'!V65:X65)/'Energy content'!$C$122","v":3.4106746091991589},{"$f":"SUM('Contribution margin'!Y65:Z65)/'Energy content'!$C$122","v":0.4},{"$f":"'Contribution margin'!AB65/'Energy content'!$C$122","v":-9.96092296307617},{"$f":"Employment!X65/'Energy content'!$C$122","v":0.38342945251548699},{"$f":"'Energy efficiency'!X65*1000/'Energy content'!$C$122","v":18.446177949128664},{"$f":"'Energy efficiency'!Y65","v":2.4482255829985478E-2}]
[26,"F",13,"Chain saw","Processor","Tower yarder",null,"WT","residues","forest road",960,10,{"$f":"Emissions!X66/'Energy content'!$C$122","v":3.0015823599939191},{"$f":"Damage!Y53","v":3.1744999999999995E-2},{"$f":"'Contribution margin'!I66/'Energy content'!$C$122","v":0.45207054637186034},{"$f":"SUM('Contribution margin'!J66:M66)/'Energy content'!$C$122","v":0.94986666666666697},{"$f":"SUM('Contribution margin'!N66:Q66)/'Energy content'!$C$122","v":1.1675733333333334},{"$f":"'Contribution margin'!R66/'Energy content'!$C$122","v":0},{"$f":"SUM('Contribution margin'!S66:U66)/'Energy content'!$C$122","v":4.4000000000000012},{"$f":"SUM('Contribution margin'!V66:X66)/'Energy content'!$C$122","v":1.3139396168969573},{"$f":"SUM('Contribution margin'!Y66:Z66)/'Energy content'!$C$122","v":0.4},{"$f":"'Contribution margin'!AB66/'Energy content'!$C$122","v":6.3855680491265261},{"$f":"Employment!X66/'Energy content'!$C$122","v":6.9508474955599434E-2},{"$f":"'Energy efficiency'!X66*1000/'Energy content'!$C$122","v":11.848648456541699},{"$f":"'Energy efficiency'!Y66","v":1.5725839984446151E-2}]
[27,"F",14,"Chain saw","Processor","Tower yarder",null,"WT","residues","terminal",960,10,{"$f":"Emissions!X67/'Energy content'!$C$122","v":3.24736864770902},{"$f":"Damage!Y54","v":3.1744999999999995E-2},{"$f":"'Contribution margin'!I67/'Energy content'!$C$122","v":0.45207054637186034},{"$f":"SUM('Contribution margin'!J67:M67)/'Energy content'!$C$122","v":0.94986666666666697},{"$f":"SUM('Contribution margin'!N67:Q67)/'Energy content'!$C$122","v":1.1675733333333334},{"$f":"'Contribution margin'!R67/'Energy content'!$C$122","v":0},{"$f":"SUM('Contribution margin'!S67:U67)/'Energy content'!$C$122","v":4.4000000000000012},{"$f":"SUM('Contribution margin'!V67:X67)/'Energy content'!$C$122","v":4.6597810622740896},{"$f":"SUM('Contribution margin'!Y67:Z67)/'Energy content'!$C$122","v":1.6},{"$f":"'Contribution margin'!AB67/'Energy content'!$C$122","v":1.8397266037493936},{"$f":"Employment!X67/'Energy content'!$C$122","v":0.12106751392108388},{"$f":"'Energy efficiency'!X67*1000/'Energy content'!$C$122","v":12.816897468752705},{"$f":"'Energy efficiency'!Y67","v":1.7010925712744696E-2}]
[28,"F",14,"Chain saw","Processor","Tower yarder","Bundler","WT","residues","terminal",960,10,{"$f":"Emissions!X68/'Energy content'!$C$122","v":4.5588387201524974},{"$f":"Damage!Y55","v":3.1744999999999995E-2},{"$f":"'Contribution margin'!I68/'Energy content'!$C$122","v":0.45207054637186034},{"$f":"SUM('Contribution margin'!J68:M68)/'Energy content'!$C$122","v":0.94986666666666697},{"$f":"SUM('Contribution margin'!N68:Q68)/'Energy content'!$C$122","v":1.1675733333333334},{"$f":"'Contribution margin'!R68/'Energy content'!$C$122","v":10.187755102040818},{"$f":"SUM('Contribution margin'!S68:U68)/'Energy content'!$C$122","v":2.1185185185185191},{"$f":"SUM('Contribution margin'!V68:X68)/'Energy content'!$C$122","v":4.4202188277045158},{"$f":"SUM('Contribution margin'!Y68:Z68)/'Energy content'!$C$122","v":1.6},{"$f":"'Contribution margin'!AB68/'Energy content'!$C$122","v":-5.826984782240368},{"$f":"Employment!X68/'Energy content'!$C$122","v":0.17955155108083556},{"$f":"'Energy efficiency'!X68*1000/'Energy content'!$C$122","v":17.983294723833069},{"$f":"'Energy efficiency'!Y68","v":2.3867904956197509E-2}]
[29,"F",15,"Chain saw","Processor","Tower yarder",null,"WT","residues","plant",960,10,{"$f":"Emissions!X69/'Energy content'!$C$122","v":3.591939416051031},{"$f":"Damage!Y56","v":3.1744999999999995E-2},{"$f":"'Contribution margin'!I69/'Energy content'!$C$122","v":0.45207054637186034},{"$f":"SUM('Contribution margin'!J69:M69)/'Energy content'!$C$122","v":0.94986666666666697},{"$f":"SUM('Contribution margin'!N69:Q69)/'Energy content'!$C$122","v":1.1675733333333334},{"$f":"'Contribution margin'!R69/'Energy content'!$C$122","v":0},{"$f":"SUM('Contribution margin'!S69:U69)/'Energy content'!$C$122","v":4.4000000000000012},{"$f":"SUM('Contribution margin'!V69:X69)/'Energy content'!$C$122","v":5.6863913288645698},{"$f":"SUM('Contribution margin'!Y69:Z69)/'Energy content'!$C$122","v":0.4},{"$f":"'Contribution margin'!AB69/'Energy content'!$C$122","v":2.013116337158916},{"$f":"Employment!X69/'Energy content'!$C$122","v":0.120977327508243},{"$f":"'Energy efficiency'!X69*1000/'Energy content'!$C$122","v":14.174297465251534},{"$f":"'Energy efficiency'!Y69","v":1.881250293213152E-2}]
[30,"F",16,"Chain saw","Processor","Tower yarder","Bundler","WT","residues","plant",960,10,{"$f":"Emissions!X70/'Energy content'!$C$122","v":4.6839913196806195},{"$f":"Damage!Y57","v":3.1744999999999995E-2},{"$f":"'Contribution margin'!I70/'Energy content'!$C$122","v":0.45207054637186034},{"$f":"SUM('Contribution margin'!J70:M70)/'Energy content'!$C$122","v":0.94986666666666697},{"$f":"SUM('Contribution margin'!N70:Q70)/'Energy content'!$C$122","v":1.1675733333333334},{"$f":"'Contribution margin'!R70/'Energy content'!$C$122","v":10.187755102040818},{"$f":"SUM('Contribution margin'!S70:U70)/'Energy content'!$C$122","v":2.1185185185185191},{"$f":"SUM('Contribution margin'!V70:X70)/'Energy content'!$C$122","v":3.89603819933438},{"$f":"SUM('Contribution margin'!Y70:Z70)/'Energy content'!$C$122","v":0.4},{"$f":"'Contribution margin'!AB70/'Energy content'!$C$122","v":-4.1028041538702311},{"$f":"Employment!X70/'Energy content'!$C$122","v":0.17025905647883013},{"$f":"'Energy efficiency'!X70*1000/'Energy content'!$C$122","v":18.476320115913555},{"$f":"'Energy efficiency'!Y70","v":2.4522261311908773E-2}]
[31,null,null,"Chain saw","Processor","Tower yarder",null,"WT","trees","forest road",960,10,{"$f":"Emissions!X71/'Energy content'!$C$122","v":5.6466130749260461},{"$f":"Damage!Y58","v":0.29449999999999998},{"$f":"'Contribution margin'!I71/'Energy content'!$C$122","v":0.45207054637186034},{"$f":"SUM('Contribution margin'!J71:M71)/'Energy content'!$C$122","v":9.4986666666666686},{"$f":"SUM('Contribution margin'!N71:Q71)/'Energy content'!$C$122","v":11.675733333333334},{"$f":"'Contribution margin'!R71/'Energy content'!$C$122","v":0},{"$f":"SUM('Contribution margin'!S71:U71)/'Energy content'!$C$122","v":2.6917647058823531},{"$f":"SUM('Contribution margin'!V71:X71)/'Energy content'!$C$122","v":1.3139396168969573},{"$f":"SUM('Contribution margin'!Y71:Z71)/'Energy content'!$C$122","v":0.4},{"$f":"'Contribution margin'!AB71/'Energy content'!$C$122","v":-10.963156656755833},{"$f":"Employment!X71/'Energy content'!$C$122","v":0.33804241160718318},{"$f":"'Energy efficiency'!X71*1000/'Energy content'!$C$122","v":22.486564315365232},{"$f":"'Energy efficiency'!Y71","v":2.9844763604928718E-2}]
[32,null,null,"Chain saw","Processor","Tower yarder",null,"WT","trees","terminal",960,10,{"$f":"Emissions!X72/'Energy content'!$C$122","v":5.8897293875386127},{"$f":"Damage!Y59","v":0.29449999999999998},{"$f":"'Contribution margin'!I72/'Energy content'!$C$122","v":0.45207054637186034},{"$f":"SUM('Contribution margin'!J72:M72)/'Energy content'!$C$122","v":9.4986666666666686},{"$f":"SUM('Contribution margin'!N72:Q72)/'Energy content'!$C$122","v":11.675733333333334},{"$f":"'Contribution margin'!R72/'Energy content'!$C$122","v":0},{"$f":"SUM('Contribution margin'!S72:U72)/'Energy content'!$C$122","v":2.6917647058823531},{"$f":"SUM('Contribution margin'!V72:X72)/'Energy content'!$C$122","v":4.633924106420003},{"$f":"SUM('Contribution margin'!Y72:Z72)/'Energy content'!$C$122","v":1.6},{"$f":"'Contribution margin'!AB72/'Energy content'!$C$122","v":-15.483141146278875},{"$f":"Employment!X72/'Energy content'!$C$122","v":0.38920365125183548},{"$f":"'Energy efficiency'!X72*1000/'Energy content'!$C$122","v":23.44429524383898},{"$f":"'Energy efficiency'!Y72","v":3.1115889453971687E-2}]
[33,null,null,"Chain saw","Processor","Tower yarder",null,"WT","trees","plant",960,10,{"$f":"Emissions!X73/'Energy content'!$C$122","v":6.228515209825134},{"$f":"Damage!Y60","v":0.29449999999999998},{"$f":"'Contribution margin'!I73/'Energy content'!$C$122","v":0.45207054637186034},{"$f":"SUM('Contribution margin'!J73:M73)/'Energy content'!$C$122","v":9.4986666666666686},{"$f":"SUM('Contribution margin'!N73:Q73)/'Energy content'!$C$122","v":11.675733333333334},{"$f":"'Contribution margin'!R73/'Energy content'!$C$122","v":0},{"$f":"SUM('Contribution margin'!S73:U73)/'Energy content'!$C$122","v":2.6917647058823531},{"$f":"SUM('Contribution margin'!V73:X73)/'Energy content'!$C$122","v":4.5863500463812015},{"$f":"SUM('Contribution margin'!Y73:Z73)/'Energy content'!$C$122","v":0.4},{"$f":"'Contribution margin'!AB73/'Energy content'!$C$122","v":-14.235567086240074},{"$f":"Employment!X73/'Energy content'!$C$122","v":0.40273461199103733},{"$f":"'Energy efficiency'!X73*1000/'Energy content'!$C$122","v":24.778906058907086},{"$f":"'Energy efficiency'!Y73","v":3.2887220268304762E-2}]
[34,null,null,"Chain saw",null,"Skidder",null,"TL","logs","forest road",640,230,{"$f":"Emissions!X74/'Energy content'!$C$122","v":2.4672749830325724},{"$f":"Damage!Y61","v":0.29449999999999998},{"$f":"'Contribution margin'!I74/'Energy content'!$C$122","v":0.45207054637186034},{"$f":"SUM('Contribution margin'!J74:M74)/'Energy content'!$C$122","v":7.3840000000000012},{"$f":"SUM('Contribution margin'!N74:Q74)/'Energy content'!$C$122","v":3.6053333333333337},{"$f":"'Contribution margin'!R74/'Energy content'!$C$122","v":0},{"$f":"SUM('Contribution margin'!S74:U74)/'Energy content'!$C$122","v":1.7074626865671643},{"$f":"SUM('Contribution margin'!V74:X74)/'Energy content'!$C$122","v":1.3139396168969573},{"$f":"SUM('Contribution margin'!Y74:Z74)/'Energy content'!$C$122","v":0.4},{"$f":"'Contribution margin'!AB74/'Energy content'!$C$122","v":0.20621202922603032},{"$f":"Employment!X74/'Energy content'!$C$122","v":0.29374039229199439},{"$f":"'Energy efficiency'!X74*1000/'Energy content'!$C$122","v":10.083064599825283},{"$f":"'Energy efficiency'!Y74","v":1.3382510337045371E-2}]
[35,null,null,"Chain saw",null,"Skidder",null,"TL","logs","terminal",640,230,{"$f":"Emissions!X75/'Energy content'!$C$122","v":2.5789982502770341},{"$f":"Damage!Y62","v":0.29449999999999998},{"$f":"'Contribution margin'!I75/'Energy content'!$C$122","v":0.45207054637186034},{"$f":"SUM('Contribution margin'!J75:M75)/'Energy content'!$C$122","v":7.3840000000000012},{"$f":"SUM('Contribution margin'!N75:Q75)/'Energy content'!$C$122","v":3.6053333333333337},{"$f":"'Contribution margin'!R75/'Energy content'!$C$122","v":0},{"$f":"SUM('Contribution margin'!S75:U75)/'Energy content'!$C$122","v":1.7074626865671643},{"$f":"SUM('Contribution margin'!V75:X75)/'Energy content'!$C$122","v":4.0103051226708839},{"$f":"SUM('Contribution margin'!Y75:Z75)/'Energy content'!$C$122","v":1.6},{"$f":"'Contribution margin'!AB75/'Energy content'!$C$122","v":-3.6901534765478963},{"$f":"Employment!X75/'Energy content'!$C$122","v":0.32699840401459562},{"$f":"'Energy efficiency'!X75*1000/'Energy content'!$C$122","v":10.523186561697408},{"$f":"'Energy efficiency'!Y75","v":1.3966651859298084E-2}]
[36,null,null,"Chain saw",null,"Skidder",null,"TL","logs","plant",640,230,{"$f":"Emissions!X76/'Energy content'!$C$122","v":2.6330991409326607},{"$f":"Damage!Y63","v":0.29449999999999998},{"$f":"'Contribution margin'!I76/'Energy content'!$C$122","v":0.45207054637186034},{"$f":"SUM('Contribution margin'!J76:M76)/'Energy content'!$C$122","v":7.3840000000000012},{"$f":"SUM('Contribution margin'!N76:Q76)/'Energy content'!$C$122","v":3.6053333333333337},{"$f":"'Contribution margin'!R76/'Energy content'!$C$122","v":0},{"$f":"SUM('Contribution margin'!S76:U76)/'Energy content'!$C$122","v":1.7074626865671643},{"$f":"SUM('Contribution margin'!V76:X76)/'Energy content'!$C$122","v":3.4106746091991589},{"$f":"SUM('Contribution margin'!Y76:Z76)/'Energy content'!$C$122","v":0.4},{"$f":"'Contribution margin'!AB76/'Energy content'!$C$122","v":-1.8905229630761717},{"$f":"Employment!X76/'Energy content'!$C$122","v":0.31676278584882034},{"$f":"'Energy efficiency'!X76*1000/'Energy content'!$C$122","v":10.736311282461996},{"$f":"'Energy efficiency'!Y76","v":1.4249516632252275E-2}]
[37,"I",24,"Chain saw","Skidder","Processor",null,"WT","residues","forest road",960,230,{"$f":"Emissions!X77/'Energy content'!$C$122","v":2.7972815599939191},{"$f":"Damage!Y64","v":3.1744999999999995E-2},{"$f":"'Contribution margin'!I77/'Energy content'!$C$122","v":0.45207054637186034},{"$f":"SUM('Contribution margin'!J77:M77)/'Energy content'!$C$122","v":0.94986666666666697},{"$f":"SUM('Contribution margin'!N77:Q77)/'Energy content'!$C$122","v":0.32448000000000005},{"$f":"'Contribution margin'!R77/'Energy content'!$C$122","v":0},{"$f":"SUM('Contribution margin'!S77:U77)/'Energy content'!$C$122","v":4.4000000000000012},{"$f":"SUM('Contribution margin'!V77:X77)/'Energy content'!$C$122","v":1.3139396168969573},{"$f":"SUM('Contribution margin'!Y77:Z77)/'Energy content'!$C$122","v":0.4},{"$f":"'Contribution margin'!AB77/'Energy content'!$C$122","v":7.2286613824598591},{"$f":"Employment!X77/'Energy content'!$C$122","v":6.217514162226611E-2},{"$f":"'Energy efficiency'!X77*1000/'Energy content'!$C$122","v":11.043827123208366},{"$f":"'Energy efficiency'!Y77","v":1.4657659799128822E-2}]
[38,"I",25,"Chain saw","Skidder","Processor",null,"WT","residues","terminal",960,230,{"$f":"Emissions!X78/'Energy content'!$C$122","v":3.0430678477090201},{"$f":"Damage!Y65","v":3.1744999999999995E-2},{"$f":"'Contribution margin'!I78/'Energy content'!$C$122","v":0.45207054637186034},{"$f":"SUM('Contribution margin'!J78:M78)/'Energy content'!$C$122","v":0.94986666666666697},{"$f":"SUM('Contribution margin'!N78:Q78)/'Energy content'!$C$122","v":0.32448000000000005},{"$f":"'Contribution margin'!R78/'Energy content'!$C$122","v":0},{"$f":"SUM('Contribution margin'!S78:U78)/'Energy content'!$C$122","v":4.4000000000000012},{"$f":"SUM('Contribution margin'!V78:X78)/'Energy content'!$C$122","v":4.6597810622740896},{"$f":"SUM('Contribution margin'!Y78:Z78)/'Energy content'!$C$122","v":1.6},{"$f":"'Contribution margin'!AB78/'Energy content'!$C$122","v":2.6828199370827277},{"$f":"Employment!X78/'Energy content'!$C$122","v":0.11373418058775055},{"$f":"'Energy efficiency'!X78*1000/'Energy content'!$C$122","v":12.01207613541937},{"$f":"'Energy efficiency'!Y78","v":1.5942745527427367E-2}]
[39,"I",25,"Chain saw","Skidder","Processor","Bundler","WT","residues","terminal",960,230,{"$f":"Emissions!X79/'Energy content'!$C$122","v":4.354537920152497},{"$f":"Damage!Y66","v":3.1744999999999995E-2},{"$f":"'Contribution margin'!I79/'Energy content'!$C$122","v":0.45207054637186034},{"$f":"SUM('Contribution margin'!J79:M79)/'Energy content'!$C$122","v":0.94986666666666697},{"$f":"SUM('Contribution margin'!N79:Q79)/'Energy content'!$C$122","v":0.32448000000000005},{"$f":"'Contribution margin'!R79/'Energy content'!$C$122","v":10.187755102040818},{"$f":"SUM('Contribution margin'!S79:U79)/'Energy content'!$C$122","v":2.1185185185185191},{"$f":"SUM('Contribution margin'!V79:X79)/'Energy content'!$C$122","v":4.4202188277045158},{"$f":"SUM('Contribution margin'!Y79:Z79)/'Energy content'!$C$122","v":1.6},{"$f":"'Contribution margin'!AB79/'Energy content'!$C$122","v":-4.9838914489070341},{"$f":"Employment!X79/'Energy content'!$C$122","v":0.17221821774750229},{"$f":"'Energy efficiency'!X79*1000/'Energy content'!$C$122","v":17.178473390499736},{"$f":"'Energy efficiency'!Y79","v":2.279972477088018E-2}]
[40,"I",26,"Chain saw","Skidder","Processor",null,"WT","residues","plant",960,230,{"$f":"Emissions!X80/'Energy content'!$C$122","v":3.387638616051031},{"$f":"Damage!Y67","v":3.1744999999999995E-2},{"$f":"'Contribution margin'!I80/'Energy content'!$C$122","v":0.45207054637186034},{"$f":"SUM('Contribution margin'!J80:M80)/'Energy content'!$C$122","v":0.94986666666666697},{"$f":"SUM('Contribution margin'!N80:Q80)/'Energy content'!$C$122","v":0.32448000000000005},{"$f":"'Contribution margin'!R80/'Energy content'!$C$122","v":0},{"$f":"SUM('Contribution margin'!S80:U80)/'Energy content'!$C$122","v":4.4000000000000012},{"$f":"SUM('Contribution margin'!V80:X80)/'Energy content'!$C$122","v":5.6863913288645698},{"$f":"SUM('Contribution margin'!Y80:Z80)/'Energy content'!$C$122","v":0.4},{"$f":"'Contribution margin'!AB80/'Energy content'!$C$122","v":2.8562096704922477},{"$f":"Employment!X80/'Energy content'!$C$122","v":0.1136439941749097},{"$f":"'Energy efficiency'!X80*1000/'Energy content'!$C$122","v":13.369476131918201},{"$f":"'Energy efficiency'!Y80","v":1.774432274681419E-2}]
[41,"I",27,"Chain saw","Skidder","Processor","Bundler","WT","residues","plant",960,230,{"$f":"Emissions!X81/'Energy content'!$C$122","v":4.4796905196806192},{"$f":"Damage!Y68","v":3.1744999999999995E-2},{"$f":"'Contribution margin'!I81/'Energy content'!$C$122","v":0.45207054637186034},{"$f":"SUM('Contribution margin'!J81:M81)/'Energy content'!$C$122","v":0.94986666666666697},{"$f":"SUM('Contribution margin'!N81:Q81)/'Energy content'!$C$122","v":0.32448000000000005},{"$f":"'Contribution margin'!R81/'Energy content'!$C$122","v":10.187755102040818},{"$f":"SUM('Contribution margin'!S81:U81)/'Energy content'!$C$122","v":2.1185185185185191},{"$f":"SUM('Contribution margin'!V81:X81)/'Energy content'!$C$122","v":3.89603819933438},{"$f":"SUM('Contribution margin'!Y81:Z81)/'Energy content'!$C$122","v":0.4},{"$f":"'Contribution margin'!AB81/'Energy content'!$C$122","v":-3.2597108205368972},{"$f":"Employment!X81/'Energy content'!$C$122","v":0.16292572314549683},{"$f":"'Energy efficiency'!X81*1000/'Energy content'!$C$122","v":17.671498782580215},{"$f":"'Energy efficiency'!Y81","v":2.345408112659144E-2}]
[42,"J",28,"Chain saw","Skidder","Processor",null,"WT","trees","forest road",960,230,{"$f":"Emissions!X82/'Energy content'!$C$122","v":3.6036050749260453},{"$f":"Damage!Y69","v":0.29449999999999998},{"$f":"'Contribution margin'!I82/'Energy content'!$C$122","v":0.45207054637186034},{"$f":"SUM('Contribution margin'!J82:M82)/'Energy content'!$C$122","v":9.4986666666666686},{"$f":"SUM('Contribution margin'!N82:Q82)/'Energy content'!$C$122","v":3.2448000000000006},{"$f":"'Contribution margin'!R82/'Energy content'!$C$122","v":0},{"$f":"SUM('Contribution margin'!S82:U82)/'Energy content'!$C$122","v":2.6917647058823531},{"$f":"SUM('Contribution margin'!V82:X82)/'Energy content'!$C$122","v":1.3139396168969573},{"$f":"SUM('Contribution margin'!Y82:Z82)/'Energy content'!$C$122","v":0.4},{"$f":"'Contribution margin'!AB82/'Energy content'!$C$122","v":-2.5322233234224929},{"$f":"Employment!X82/'Energy content'!$C$122","v":0.26470907827384982},{"$f":"'Energy efficiency'!X82*1000/'Energy content'!$C$122","v":14.438350982031897},{"$f":"'Energy efficiency'!Y82","v":1.9162961751755428E-2}]
[43,"J",29,"Chain saw","Skidder","Processor",null,"WT","trees","terminal",960,230,{"$f":"Emissions!X83/'Energy content'!$C$122","v":3.8467213875386124},{"$f":"Damage!Y70","v":0.29449999999999998},{"$f":"'Contribution margin'!I83/'Energy content'!$C$122","v":0.45207054637186034},{"$f":"SUM('Contribution margin'!J83:M83)/'Energy content'!$C$122","v":9.4986666666666686},{"$f":"SUM('Contribution margin'!N83:Q83)/'Energy content'!$C$122","v":3.2448000000000006},{"$f":"'Contribution margin'!R83/'Energy content'!$C$122","v":0},{"$f":"SUM('Contribution margin'!S83:U83)/'Energy content'!$C$122","v":2.6917647058823531},{"$f":"SUM('Contribution margin'!V83:X83)/'Energy content'!$C$122","v":4.633924106420003},{"$f":"SUM('Contribution margin'!Y83:Z83)/'Energy content'!$C$122","v":1.6},{"$f":"'Contribution margin'!AB83/'Energy content'!$C$122","v":-7.0522078129455377},{"$f":"Employment!X83/'Energy content'!$C$122","v":0.31587031791850217},{"$f":"'Energy efficiency'!X83*1000/'Energy content'!$C$122","v":15.396081910505647},{"$f":"'Energy efficiency'!Y83","v":2.0434087600798397E-2}]
[44,"J",30,"Chain saw","Skidder","Processor",null,"WT","trees","plant",960,230,{"$f":"Emissions!X84/'Energy content'!$C$122","v":4.1855072098251336},{"$f":"Damage!Y71","v":0.29449999999999998},{"$f":"'Contribution margin'!I84/'Energy content'!$C$122","v":0.45207054637186034},{"$f":"SUM('Contribution margin'!J84:M84)/'Energy content'!$C$122","v":9.4986666666666686},{"$f":"SUM('Contribution margin'!N84:Q84)/'Energy content'!$C$122","v":3.2448000000000006},{"$f":"'Contribution margin'!R84/'Energy content'!$C$122","v":0},{"$f":"SUM('Contribution margin'!S84:U84)/'Energy content'!$C$122","v":2.6917647058823531},{"$f":"SUM('Contribution margin'!V84:X84)/'Energy content'!$C$122","v":4.5863500463812015},{"$f":"SUM('Contribution margin'!Y84:Z84)/'Energy content'!$C$122","v":0.4},{"$f":"'Contribution margin'!AB84/'Energy content'!$C$122","v":-5.8046337529067378},{"$f":"Employment!X84/'Energy content'!$C$122","v":0.32940127865770402},{"$f":"'Energy efficiency'!X84*1000/'Energy content'!$C$122","v":16.730692725573761},{"$f":"'Energy efficiency'!Y84","v":2.2205418415131475E-2}]
[45,null,null,"Feller-buncher","Chipper","Shuttle",null,"WT","trees","stand",960,320,{"$f":"Emissions!X85/'Energy content'!$C$122","v":6.7131259947509641},{"$f":"Damage!Y72","v":0.24651999999999999},{"$f":"'Contribution margin'!I85/'Energy content'!$C$122","v":0.45207054637186034},{"$f":"SUM('Contribution margin'!J85:M85)/'Energy content'!$C$122","v":9.3241379310344854},{"$f":"SUM('Contribution margin'!N85:Q85)/'Energy content'!$C$122","v":2.140818713450293},{"$f":"'Contribution margin'!R85/'Energy content'!$C$122","v":0},{"$f":"SUM('Contribution margin'!S85:U85)/'Energy content'!$C$122","v":9.4823529411764707},{"$f":"SUM('Contribution margin'!V85:X85)/'Energy content'!$C$122","v":1.3139396168969573},{"$f":"SUM('Contribution margin'!Y85:Z85)/'Energy content'!$C$122","v":0.4},{"$f":"'Contribution margin'!AB85/'Energy content'!$C$122","v":-8.0443015365347197},{"$f":"Employment!X85/'Energy content'!$C$122","v":0.17079189857680463},{"$f":"'Energy efficiency'!X85*1000/'Energy content'!$C$122","v":26.445647858109851},{"$f":"'Energy efficiency'!Y85","v":3.5099364119629793E-2}]
[46,null,null,"Feller-buncher",null,"Forwarder",null,"WT","trees","forest road",960,300,{"$f":"Emissions!X86/'Energy content'!$C$122","v":5.1358080174547815},{"$f":"Damage!Y73","v":0.13600000000000001},{"$f":"'Contribution margin'!I86/'Energy content'!$C$122","v":0.45207054637186034},{"$f":"SUM('Contribution margin'!J86:M86)/'Energy content'!$C$122","v":9.3241379310344854},{"$f":"SUM('Contribution margin'!N86:Q86)/'Energy content'!$C$122","v":5.8240000000000007},{"$f":"'Contribution margin'!R86/'Energy content'!$C$122","v":0},{"$f":"SUM('Contribution margin'!S86:U86)/'Energy content'!$C$122","v":2.6917647058823531},{"$f":"SUM('Contribution margin'!V86:X86)/'Energy content'!$C$122","v":1.3139396168969573},{"$f":"SUM('Contribution margin'!Y86:Z86)/'Energy content'!$C$122","v":0.4},{"$f":"'Contribution margin'!AB86/'Energy content'!$C$122","v":-4.9368945877903103},{"$f":"Employment!X86/'Energy content'!$C$122","v":0.17306853490916854},{"$f":"'Energy efficiency'!X86*1000/'Energy content'!$C$122","v":20.231970977852168},{"$f":"'Energy efficiency'!Y86","v":2.6852407625614156E-2}]
[47,null,null,"Feller-buncher",null,"Forwarder",null,"WT","trees","terminal",960,300,{"$f":"Emissions!X87/'Energy content'!$C$122","v":5.378924330067349},{"$f":"Damage!Y74","v":0.13600000000000001},{"$f":"'Contribution margin'!I87/'Energy content'!$C$122","v":0.45207054637186034},{"$f":"SUM('Contribution margin'!J87:M87)/'Energy content'!$C$122","v":9.3241379310344854},{"$f":"SUM('Contribution margin'!N87:Q87)/'Energy content'!$C$122","v":5.8240000000000007},{"$f":"'Contribution margin'!R87/'Energy content'!$C$122","v":0},{"$f":"SUM('Contribution margin'!S87:U87)/'Energy content'!$C$122","v":2.6917647058823531},{"$f":"SUM('Contribution margin'!V87:X87)/'Energy content'!$C$122","v":4.633924106420003},{"$f":"SUM('Contribution margin'!Y87:Z87)/'Energy content'!$C$122","v":1.6},{"$f":"'Contribution margin'!AB87/'Energy content'!$C$122","v":-9.4568790773133582},{"$f":"Employment!X87/'Energy content'!$C$122","v":0.22422977455382093},{"$f":"'Energy efficiency'!X87*1000/'Energy content'!$C$122","v":21.189701906325919},{"$f":"'Energy efficiency'!Y87","v":2.8123533474657125E-2}]
[48,null,null,"Feller-buncher",null,"Forwarder",null,"WT","trees","plant",960,300,{"$f":"Emissions!X88/'Energy content'!$C$122","v":5.7177101523538694},{"$f":"Damage!Y75","v":0.13600000000000001},{"$f":"'Contribution margin'!I88/'Energy content'!$C$122","v":0.45207054637186034},{"$f":"SUM('Contribution margin'!J88:M88)/'Energy content'!$C$122","v":9.3241379310344854},{"$f":"SUM('Contribution margin'!N88:Q88)/'Energy content'!$C$122","v":5.8240000000000007},{"$f":"'Contribution margin'!R88/'Energy content'!$C$122","v":0},{"$f":"SUM('Contribution margin'!S88:U88)/'Energy content'!$C$122","v":2.6917647058823531},{"$f":"SUM('Contribution margin'!V88:X88)/'Energy content'!$C$122","v":4.5863500463812015},{"$f":"SUM('Contribution margin'!Y88:Z88)/'Energy content'!$C$122","v":0.4},{"$f":"'Contribution margin'!AB88/'Energy content'!$C$122","v":-8.2093050172745556},{"$f":"Employment!X88/'Energy content'!$C$122","v":0.23776073529302277},{"$f":"'Energy efficiency'!X88*1000/'Energy content'!$C$122","v":22.524312721394029},{"$f":"'Energy efficiency'!Y88","v":2.9894864288990203E-2}]

{"sheet":"Emissions","index":15,"n_rows":88,"n_cols":24,"rows_kept":88,"cut":false,"hidden":true,"merged":[]}
[null,"Productivity","Fuel","Consumption","Consumption"]
[null,"MWh/h","l/h","l/MWh","kg CO2/MWh",null,"kg CO2/l"]
["Chain Saw - Felling",{"$f":"'2ca Felling and processing'!$C$13*'Energy content'!$D$123","v":5.6508818296482541},{"$f":"'2ca Felling and processing'!C7","v":0.53},{"$f":"C3/B3","v":9.3790671257585029E-2},{"$f":"D3*G3","v":0.21853226403017312},null,2.33,null,null,0,1]
["Chain Saw - Felling and Delimbing",{"$f":"'2ca Felling and processing'!$C$16*'Energy content'!$D$123","v":3.7672545530988359},{"$f":"'2ca Felling and processing'!C7","v":0.53},{"$f":"C4/B4","v":0.14068600688637756},{"$f":"D4*G4","v":0.32779839604525973},null,2.33,null,null,1,1]
["Chain Saw - Felling and Processing",{"$f":"'2ca Felling and processing'!$C$19*'Energy content'!$D$123","v":2.8254409148241271},{"$f":"'2ca Felling and processing'!C7","v":0.53},0.18758134251517006,0.43706452806034624,null,2.33,null,null,2,1]
["Harvester",{"$f":"'2ca Felling and processing'!$C$39*'Energy content'!$D$123","v":16.387557305979936},{"$f":"'2ca Felling and processing'!C33","v":15.6},0.95194175121556701,2.5131262232090972,null,2.64,null,null,3,1]
["Feller buncher",{"$f":"'2ca Felling and processing'!$C$29*'Energy content'!$D$123","v":10.925038203986624},{"$f":"'2ca Felling and processing'!C23","v":6.5},0.59496359450972935,1.5707038895056855,null,2.64,null,null,4,1]
["Processor",{"$f":"'2ca Felling and processing'!$C$49*'Energy content'!$D$123","v":18.836272765494179},{"$f":"'2ca Felling and processing'!C43","v":8},{"$f":"C8/B8","v":0.42471247361925296},{"$f":"D8*G8","v":1.1212409303548279},null,2.64,null,null,5,1]
["Forwarder - logs",{"$f":"'2cb Extracting'!$C$14*'Energy content'!$D$123","v":20.154811859078769},{"$f":"'2cb Extracting'!$C$8","v":11.1},0.55073696929599403,1.4539455989414243,null,2.64,null,null,6,{"$f":"6/7","v":0.8571428571428571}]
["Forwarder - residues",{"$f":"'2cb Extracting'!$C$17*'Energy content'!$D$123","v":5.6508818296482541},{"$f":"'2cb Extracting'!$C$8","v":11.1},1.9642951904890449,5.1857393028910783,null,2.64,null,null,7,{"$f":"5/7","v":0.7142857142857143}]
["Forwarder - trees",{"$f":"'2cb Extracting'!$C$20*'Energy content'!$D$123","v":10.359950021021799},{"$f":"'2cb Extracting'!$C$8","v":11.1},1.0714337402667518,2.8285850743042249,null,2.64,null,null,8,{"$f":"4/7","v":0.5714285714285714}]
["Skidder - TL",{"$f":"'2cb Extracting'!$C$30*'Energy content'!$D$123","v":16.952645488944761},{"$f":"'2cb Extracting'!$C$24","v":7.32},0.43179101484624055,1.139928279194075,null,2.64,null,null,9,{"$f":"3/7","v":0.42857142857142855}]
["Skidder - WT",{"$f":"'2cb Extracting'!$C$33*'Energy content'!$D$123","v":18.836272765494179},{"$f":"'2cb Extracting'!$C$24","v":7.32},0.38861191336161649,1.0259354512746677,null,2.64,null,null,10,{"$f":"2/7","v":0.2857142857142857}]
["Tower yarder - TL",{"$f":"'2cb Extracting'!$C$46*'Energy content'!$D$123","v":11.301763659296508},{"$f":"'2cb Extracting'!$C$37","v":16},1.4157082453975098,3.7374697678494262,null,2.64,null,null,11,{"$f":"1/7","v":0.14285714285714285}]
["Tower yarder - WT",{"$f":"'2cb Extracting'!$C$49*'Energy content'!$D$123","v":11.301763659296508},{"$f":"'2cb Extracting'!$C$37","v":16},1.4157082453975098,3.7374697678494262,null,2.64,null,null,12,0]
["Shuttle",{"$f":"'2cb Extracting'!$C$59*'Energy content'!$D$123","v":32.21002642899505},{"$f":"'2cb Extracting'!$C$53","v":10},0.31046233451699778,0.81962056312487419,null,2.64,null,null,13,0]
["Bundler",{"$f":"'2cc Bundling'!$C$13*'Energy content'!$D$123","v":9.2297736550921492},{"$f":"'2cc Bundling'!C7","v":11.5},1.2459677159748492,3.2893547701736021,null,2.64,null,null,14,0]
["Tractor & chipper - logs",{"$f":"'2cd Chipping'!$C$14*'Energy content'!$D$121","v":50.481211011524401},{"$f":"'2cd Chipping'!$C$8","v":34.799999999999997},0.68936539561333965,1.8199246444192168,null,2.64,null,null,15,0]
["Tractor & chipper - residues",{"$f":"'2cd Chipping'!$C$17*'Energy content'!$D$121","v":19.589723676113948},{"$f":"'2cd Chipping'!$C$8","v":34.799999999999997},1.7764415963882214,4.6898058144649051,null,2.64]
["Tractor & chipper - bundles",{"$f":"'2cd Chipping'!$C$20*'Energy content'!$D$121","v":40.686349173467427},{"$f":"'2cd Chipping'!$C$8","v":34.799999999999997},0.85532373159432884,2.2580546514090281,null,2.64]
["Tractor & chipper - trees",{"$f":"'2cd Chipping'!$C$23*'Energy content'!$D$121","v":21.850076407973248},{"$f":"'2cd Chipping'!$C$8","v":34.799999999999997},1.5926717760721987,4.2046534888306049,null,2.64]
["Chippertruck - logs",{"$f":"'2cd Chipping'!$C$33*'Energy content'!$D$121","v":100.9624220230488},{"$f":"'2cd Chipping'!$C$27","v":40.479999999999997},0.40094125308086193,1.0584849081334755,null,2.64]
["Chippertruck - residues",{"$f":"'2cd Chipping'!$C$36*'Energy content'!$D$121","v":39.179447352227896},{"$f":"'2cd Chipping'!$C$27","v":40.479999999999997},1.0331947675545288,2.7276341863439559,null,2.64]
["Chippertruck - bundles",{"$f":"'2cd Chipping'!$C$39*'Energy content'!$D$121","v":81.372698346934854},{"$f":"'2cd Chipping'!$C$27","v":40.479999999999997},0.49746414734106942,1.3133053489804234,null,2.64]
["Chippertruck - trees",{"$f":"'2cd Chipping'!$C$42*'Energy content'!$D$121","v":64.04332740268022},{"$f":"'2cd Chipping'!$C$27","v":40.479999999999997},0.63207209309218226,1.6686703257633613,null,2.64]
["Mobile chipper",{"$f":"'2cd Chipping'!$C$52*'Energy content'!$D$121","v":12.808665480536042},{"$f":"'2cd Chipping'!C46","v":28},2.1860200848049787,5.7710930238851441,null,2.64]
[]
[null,"km","l/km","MWh","kg CO2/MWh"]
["Pre-transport - logs",{"$f":"'2b Environment'!$D$10","v":12},{"$f":"'2ce Transporting'!B10/100","v":0.4},{"$f":"RH_MW_T","v":41.432830837624465},{"$f":"C29*B29*G29/D29","v":0.30584441718842847},null,2.64]
["Pre-transport - residues",{"$f":"'2b Environment'!$D$10","v":12},{"$f":"'2ce Transporting'!B21/100","v":0.25},{"$f":"SA_MW_T","v":16.371199318083676},{"$f":"C30*B30*G30/D30","v":0.48377640795390869},null,2.64]
["Pre-transport - bundles",{"$f":"'2b Environment'!$D$10","v":12},{"$f":"'2ce Transporting'!B32/100","v":0.4},{"$f":"Bün_MW_T","v":36.271180336289447},{"$f":"C31*B31*G31/D31","v":0.3493682830972451},null,2.64]
["Pre-transport - trees",{"$f":"'2b Environment'!$D$10","v":12},{"$f":"'2ce Transporting'!B43/100","v":0.25},{"$f":"'Contribution margin'!G115","v":16.492003223591972},0.48023274629672413,null,2.64]
["Main transport - chips",{"$f":"'2b Environment'!D11","v":30},{"$f":"'2ce Transporting'!B54/100","v":0.5},{"$f":"HG_MW_T","v":67.02109211521514},{"$f":"C33*B33*G33/D33","v":0.59085876923527481},null,2.64]
["Direct transport - logs",{"$f":"'2b Environment'!$D$9","v":38},{"$f":"C29","v":0.4},{"$f":"RH_MW_T","v":41.432830837624465},0.96850732109669024,null,2.64]
["Direct transport - residues",{"$f":"'2b Environment'!$D$9","v":38},{"$f":"C30","v":0.25},{"$f":"SA_MW_T","v":16.371199318083676},1.5319586251873776,null,2.64]
["Direct transport - bundles",{"$f":"'2b Environment'!$D$9","v":38},{"$f":"C31","v":0.4},{"$f":"Bün_MW_T","v":36.271180336289447},1.1063328964746095,null,2.64]
["Direct transport - trees",{"$f":"'2b Environment'!$D$9","v":38},{"$f":"C32","v":0.25},{"$f":"'Contribution margin'!G115","v":16.492003223591972},1.5207370299396266,null,2.64]
["Direct transport - chips",{"$f":"'2b Environment'!$D$9","v":38},{"$f":"C33","v":0.5},{"$f":"HG_MW_T","v":67.02109211521514},0.74842110769801484,null,2.64]
[]
[null,null,null,null,null,null,null,null,"Chain Saw","Feller buncher","Harvester","Processor","Forwarder","Skidder","Tower Yarder","Shuttle","Bundler","Tractor & Chipper","Chippertruck","Mobile chipper","Pre-transport","Main-transport","Direct transport","SUM"]
[1,"Chain Saw",null,"Forwarder",null,"CTL","Logs","Forest road",{"$f":"$E$5","v":0.43706452806034624},null,null,null,{"$f":"$E$9","v":1.4539455989414243},null,null,null,null,null,{"$f":"$E$22","v":1.0584849081334755},null,null,null,{"$f":"$E$38","v":0.74842110769801484},{"$f":"SUM(I41:W41)","v":3.697916142833261}]
[2,"Chain Saw",null,"Forwarder",null,"CTL","Logs","Terminal",{"$f":"$E$5","v":0.43706452806034624},null,null,null,{"$f":"$E$9","v":1.4539455989414243},null,null,null,null,null,{"$f":"$E$22","v":1.0584849081334755},null,{"$f":"$E$29","v":0.30584441718842847},{"$f":"$E$33","v":0.59085876923527481},null,{"$f":"SUM(I42:W42)","v":3.8461982215589496}]
[3,"Chain Saw",null,"Forwarder",null,"CTL","Logs","Plant",0.43706452806034624,null,null,null,1.4539455989414243,null,null,null,null,null,1.0584849081334755,null,null,null,{"$f":"$E$34","v":0.96850732109669024},3.9180023562319364]
[4,"Chain Saw",null,"Forwarder",null,"CTL","Residues","Forest road",{"$f":"$E$5*'2b Environment'!$D$23","v":4.3706452806034628E-2},null,null,null,{"$f":"$E$10","v":5.1857393028910783},null,null,null,null,null,{"$f":"$E$23","v":2.7276341863439559},null,null,null,{"$f":"$E$38","v":0.74842110769801484},8.7055010497390839]
[5,"Chain Saw",null,"Forwarder",null,"CTL","Residues","Terminal",{"$f":"$E$5*'2b Environment'!$D$23","v":4.3706452806034628E-2},null,null,null,{"$f":"$E$10","v":5.1857393028910783},null,null,null,null,null,{"$f":"$E$23","v":2.7276341863439559},null,{"$f":"$E$30","v":0.48377640795390869},{"$f":"$E$33","v":0.59085876923527481},null,9.0317151192302543]
[6,"Chain Saw",null,"Forwarder","Bundler","CTL","Residues","Terminal",{"$f":"$E$5*'2b Environment'!$D$23","v":4.3706452806034628E-2},null,null,null,5.1857393028910783,null,null,null,{"$f":"$E$17","v":3.2893547701736021},null,{"$f":"$E$24","v":1.3133053489804234},null,{"$f":"$E$31","v":0.3493682830972451},0.59085876923527481,null,10.772332927183658]
[7,"Chain Saw",null,"Forwarder",null,"CTL","Residues","Plant",{"$f":"$E$5*'2b Environment'!$D$23","v":4.3706452806034628E-2},null,null,null,5.1857393028910783,null,null,null,null,null,{"$f":"$E$23","v":2.7276341863439559},null,null,null,{"$f":"$E$35","v":1.5319586251873776},9.4890385672284463]
[8,"Chain Saw",null,"Forwarder","Bundler","CTL","Residues","Plant",{"$f":"$E$5*'2b Environment'!$D$23","v":4.3706452806034628E-2},null,null,null,5.1857393028910783,null,null,null,{"$f":"$E$17","v":3.2893547701736021},null,{"$f":"$E$24","v":1.3133053489804234},null,null,null,{"$f":"$E$36","v":1.1063328964746095},10.938438771325748]
[9,"Chain Saw",null,"Forwarder",null,"CTL","Logs & residues","Forest road",{"$f":"$E$3","v":0.21853226403017312},null,null,null,{"$f":"$E$11","v":2.8285850743042249},null,null,null,null,null,{"$f":"$E$25","v":1.6686703257633613},null,null,null,{"$f":"$E$38","v":0.74842110769801484},5.4642087717957732]
[10,"Chain Saw",null,"Forwarder",null,"CTL","Logs & residues","Terminal",{"$f":"$E$3","v":0.21853226403017312},null,null,null,{"$f":"$E$11","v":2.8285850743042249},null,null,null,null,null,{"$f":"$E$25","v":1.6686703257633613},null,{"$f":"$E$32","v":0.48023274629672413},{"$f":"$E$33","v":0.59085876923527481},null,5.7868791796297572]
[11,"Chain Saw",null,"Forwarder",null,"CTL","Logs & residues","Plant",0.21853226403017312,null,null,null,2.8285850743042249,null,null,null,null,null,1.6686703257633613,null,null,null,{"$f":"$E$37","v":1.5207370299396266},6.2365246940373851]
[12,"Harvester",null,"Forwarder",null,"CTL","Logs","Forest road",null,null,{"$f":"$E$6","v":2.5131262232090972},null,{"$f":"$E$9","v":1.4539455989414243},null,null,null,null,null,{"$f":"$E$22","v":1.0584849081334755},null,null,null,{"$f":"$E$38","v":0.74842110769801484},5.7739778379820113]
[13,"Harvester",null,"Forwarder",null,"CTL","Logs","Terminal",null,null,{"$f":"$E$6","v":2.5131262232090972},null,{"$f":"$E$9","v":1.4539455989414243},null,null,null,null,null,1.0584849081334755,null,{"$f":"$E$29","v":0.30584441718842847},{"$f":"$E$33","v":0.59085876923527481},null,5.9222599167076995]
[14,"Harvester",null,"Forwarder",null,"CTL","Logs","Plant",null,null,2.5131262232090972,null,1.4539455989414243,null,null,null,null,null,1.0584849081334755,null,null,null,{"$f":"$E$34","v":0.96850732109669024},5.9940640513806871]
[15,"Harvester",null,"Forwarder",null,"CTL","Residues","Forest road",null,null,{"$f":"$E$6*'2b Environment'!$D$23","v":0.25131262232090973},null,{"$f":"$E$10","v":5.1857393028910783},null,null,null,null,null,{"$f":"$E$23","v":2.7276341863439559},null,null,null,{"$f":"$E$38","v":0.74842110769801484},8.9131072192539591]
[16,"Harvester",null,"Forwarder",null,"CTL","Residues","Terminal",null,null,{"$f":"$E$6*'2b Environment'!$D$23","v":0.25131262232090973},null,5.1857393028910783,null,null,null,null,null,{"$f":"$E$23","v":2.7276341863439559},null,{"$f":"$E$30","v":0.48377640795390869},{"$f":"$E$33","v":0.59085876923527481},null,9.2393212887451295]
[17,"Harvester",null,"Forwarder","Bundler","CTL","Residues","Terminal",null,null,{"$f":"$E$6*'2b Environment'!$D$23","v":0.25131262232090973},null,5.1857393028910783,null,null,null,{"$f":"$E$17","v":3.2893547701736021},null,{"$f":"$E$24","v":1.3133053489804234},null,{"$f":"$E$31","v":0.3493682830972451},0.59085876923527481,null,10.979939096698534]
[18,"Harvester",null,"Forwarder",null,"CTL","Residues","Plant",null,null,{"$f":"$E$6*'2b Environment'!$D$23","v":0.25131262232090973},null,5.1857393028910783,null,null,null,null,null,{"$f":"$E$23","v":2.7276341863439559},null,null,null,{"$f":"$E$35","v":1.5319586251873776},9.6966447367433215]
[19,"Harvester",null,"Forwarder","Bundler","CTL","Residues","Plant",null,null,{"$f":"$E$6*'2b Environment'!$D$23","v":0.25131262232090973},null,5.1857393028910783,null,null,null,{"$f":"$E$17","v":3.2893547701736021},null,{"$f":"$E$24","v":1.3133053489804234},null,null,null,{"$f":"$E$36","v":1.1063328964746095},11.146044940840623]
[20,"Harvester",null,"Forwarder",null,"CTL","Logs & residues","Forest road",null,null,2.5131262232090972,null,{"$f":"$E$11","v":2.8285850743042249},null,null,null,null,null,{"$f":"$E$25","v":1.6686703257633613},null,null,null,{"$f":"$E$38","v":0.74842110769801484},7.7588027309746987]
[21,"Harvester",null,"Forwarder",null,"CTL","Logs & residues","Terminal",null,null,2.5131262232090972,null,2.8285850743042249,null,null,null,null,null,1.6686703257633613,null,{"$f":"$E$32","v":0.48023274629672413},{"$f":"$E$33","v":0.59085876923527481},null,8.0814731388086827]
[22,"Harvester",null,"Forwarder",null,"CTL","Logs & residues","Plant",null,null,2.5131262232090972,null,2.8285850743042249,null,null,null,null,null,1.6686703257633613,null,null,null,{"$f":"$E$37","v":1.5207370299396266},8.5311186532163106]
[23,"Chain Saw",null,"Tower Yarder",null,"TL","Logs","Forest road",{"$f":"$E$4","v":0.32779839604525973},null,null,null,null,null,{"$f":"$E$14","v":3.7374697678494262},null,null,null,{"$f":"$E$22","v":1.0584849081334755},null,null,null,{"$f":"$E$38","v":0.74842110769801484},5.8721741797261764]
[24,"Chain Saw",null,"Tower Yarder",null,"TL","Logs","Terminal",{"$f":"$E$4","v":0.32779839604525973},null,null,null,null,null,{"$f":"$E$14","v":3.7374697678494262},null,null,null,1.0584849081334755,null,{"$f":"$E$29","v":0.30584441718842847},{"$f":"$E$33","v":0.59085876923527481},null,6.0204562584518646]
[25,"Chain Saw",null,"Tower Yarder",null,"TL","Logs","Plant",0.32779839604525973,null,null,null,null,null,3.7374697678494262,null,null,null,1.0584849081334755,null,null,null,{"$f":"$E$34","v":0.96850732109669024},6.0922603931248522]
[26,"Chain Saw","Processor","Tower Yarder",null,"WT","Residues","Forest road",{"$f":"$E$3*'2b Environment'!$D$23","v":2.1853226403017314E-2},null,null,{"$f":"$E$8*'2b Environment'!$D$23","v":0.11212409303548279},null,null,{"$f":"$E$15*'2b Environment'!$D$23","v":0.37374697678494262},null,null,null,{"$f":"$E$23","v":2.7276341863439559},null,null,null,{"$f":"$E$38","v":0.74842110769801484},3.9837795902654136]
[27,"Chain Saw","Processor","Tower Yarder",null,"WT","Residues","Terminal",{"$f":"$E$3*'2b Environment'!$D$23","v":2.1853226403017314E-2},null,null,{"$f":"$E$8*'2b Environment'!$D$23","v":0.11212409303548279},null,null,{"$f":"$E$15*'2b Environment'!$D$23","v":0.37374697678494262},null,null,null,{"$f":"$E$23","v":2.7276341863439559},null,{"$f":"$E$30","v":0.48377640795390869},{"$f":"$E$33","v":0.59085876923527481},null,4.3099936597565822]
[28,"Chain Saw","Processor","Tower Yarder","Bundler","WT","Residues","Terminal",{"$f":"$E$3*'2b Environment'!$D$23","v":2.1853226403017314E-2},null,null,{"$f":"$E$8*'2b Environment'!$D$23","v":0.11212409303548279},null,null,{"$f":"$E$15*'2b Environment'!$D$23","v":0.37374697678494262},null,{"$f":"$E$17","v":3.2893547701736021},null,{"$f":"$E$24","v":1.3133053489804234},null,{"$f":"$E$31","v":0.3493682830972451},0.59085876923527481,null,6.050611467709988]
[29,"Chain Saw","Processor","Tower Yarder",null,"WT","Residues","Plant",{"$f":"$E$3*'2b Environment'!$D$23","v":2.1853226403017314E-2},null,null,{"$f":"$E$8*'2b Environment'!$D$23","v":0.11212409303548279},null,null,{"$f":"$E$15*'2b Environment'!$D$23","v":0.37374697678494262},null,null,null,{"$f":"$E$23","v":2.7276341863439559},null,null,null,{"$f":"$E$35","v":1.5319586251873776},4.767317107754776]
[30,"Chain Saw","Processor","Tower Yarder","Bundler","WT","Residues","Plant",{"$f":"$E$3*'2b Environment'!$D$23","v":2.1853226403017314E-2},null,null,{"$f":"$E$8*'2b Environment'!$D$23","v":0.11212409303548279},null,null,{"$f":"$E$15*'2b Environment'!$D$23","v":0.37374697678494262},null,{"$f":"$E$17","v":3.2893547701736021},null,{"$f":"$E$24","v":1.3133053489804234},null,null,null,{"$f":"$E$36","v":1.1063328964746095},6.2167173118520775]
[31,"Chain Saw","Processor","Tower Yarder",null,"WT","Logs & residues","Forest road",{"$f":"$E$3","v":0.21853226403017312},null,null,{"$f":"$E$8","v":1.1212409303548279},null,null,{"$f":"$E$15","v":3.7374697678494262},null,null,null,{"$f":"$E$25","v":1.6686703257633613},null,null,null,{"$f":"$E$38","v":0.74842110769801484},7.4943343956958035]
[32,"Chain Saw","Processor","Tower Yarder",null,"WT","Logs & residues","Terminal",0.21853226403017312,null,null,1.1212409303548279,null,null,3.7374697678494262,null,null,null,1.6686703257633613,null,{"$f":"$E$32","v":0.48023274629672413},{"$f":"$E$33","v":0.59085876923527481},null,7.8170048035297874]
[33,"Chain Saw","Processor","Tower Yarder",null,"WT","Logs & residues","Plant",0.21853226403017312,null,null,1.1212409303548279,null,null,3.7374697678494262,null,null,null,1.6686703257633613,null,null,null,{"$f":"$E$37","v":1.5207370299396266},8.2666503179374153]
[34,"Chain Saw",null,"Skidder",null,"TL","Logs","Forest road",{"$f":"$E$4","v":0.32779839604525973},null,null,null,null,{"$f":"$E$12","v":1.139928279194075},null,null,null,null,{"$f":"$E$22","v":1.0584849081334755},null,null,null,{"$f":"$E$38","v":0.74842110769801484},3.2746326910708254]
[35,"Chain Saw",null,"Skidder",null,"TL","Logs","Terminal",0.32779839604525973,null,null,null,null,{"$f":"$E$12","v":1.139928279194075},null,null,null,null,1.0584849081334755,null,{"$f":"$E$29","v":0.30584441718842847},{"$f":"$E$33","v":0.59085876923527481},null,3.4229147697965137]
[36,"Chain Saw",null,"Skidder",null,"TL","Logs","Plant",0.32779839604525973,null,null,null,null,1.139928279194075,null,null,null,null,1.0584849081334755,null,null,null,{"$f":"$E$34","v":0.96850732109669024},3.4947189044695008]
[37,"Chain Saw","Skidder","Processor",null,"WT","Residues","Forest road",{"$f":"$E$3*'2b Environment'!$D$23","v":2.1853226403017314E-2},null,null,{"$f":"$E$8*'2b Environment'!$D$23","v":0.11212409303548279},null,{"$f":"$E$13*'2b Environment'!$D$23","v":0.10259354512746677},null,null,null,null,{"$f":"$E$23","v":2.7276341863439559},null,null,null,{"$f":"$E$38","v":0.74842110769801484},3.7126261586079377]
[38,"Chain Saw","Skidder","Processor",null,"WT","Residues","Terminal",{"$f":"$E$3*'2b Environment'!$D$23","v":2.1853226403017314E-2},null,null,{"$f":"$E$8*'2b Environment'!$D$23","v":0.11212409303548279},null,{"$f":"$E$13*'2b Environment'!$D$23","v":0.10259354512746677},null,null,null,null,{"$f":"$E$23","v":2.7276341863439559},null,{"$f":"$E$30","v":0.48377640795390869},{"$f":"$E$33","v":0.59085876923527481},null,4.0388402280991063]
[39,"Chain Saw","Skidder","Processor","Bundler","WT","Residues","Terminal",{"$f":"$E$3*'2b Environment'!$D$23","v":2.1853226403017314E-2},null,null,{"$f":"$E$8*'2b Environment'!$D$23","v":0.11212409303548279},null,{"$f":"$E$13*'2b Environment'!$D$23","v":0.10259354512746677},null,null,{"$f":"$E$17","v":3.2893547701736021},null,{"$f":"$E$24","v":1.3133053489804234},null,{"$f":"$E$31","v":0.3493682830972451},0.59085876923527481,null,5.7794580360525121]
[40,"Chain Saw","Skidder","Processor",null,"WT","Residues","Plant",{"$f":"$E$3*'2b Environment'!$D$23","v":2.1853226403017314E-2},null,null,{"$f":"$E$8*'2b Environment'!$D$23","v":0.11212409303548279},null,{"$f":"$E$13*'2b Environment'!$D$23","v":0.10259354512746677},null,null,null,null,{"$f":"$E$23","v":2.7276341863439559},null,null,null,{"$f":"$E$35","v":1.5319586251873776},4.4961636760973001]
[41,"Chain Saw","Skidder","Processor","Bundler","WT","Residues","Plant",{"$f":"$E$3*'2b Environment'!$D$23","v":2.1853226403017314E-2},null,null,{"$f":"$E$8*'2b Environment'!$D$23","v":0.11212409303548279},null,{"$f":"$E$13*'2b Environment'!$D$23","v":0.10259354512746677},null,null,{"$f":"$E$17","v":3.2893547701736021},null,{"$f":"$E$24","v":1.3133053489804234},null,null,null,{"$f":"$E$36","v":1.1063328964746095},5.9455638801946016]
[42,"Chain Saw","Skidder","Processor",null,"WT","Logs & residues","Forest road",{"$f":"$E$3","v":0.21853226403017312},null,null,{"$f":"$E$8","v":1.1212409303548279},null,{"$f":"$E$13","v":1.0259354512746677},null,null,null,null,{"$f":"$E$25","v":1.6686703257633613},null,null,null,{"$f":"$E$38","v":0.74842110769801484},4.7828000791210439]
[43,"Chain Saw","Skidder","Processor",null,"WT","Logs & residues","Terminal",0.21853226403017312,null,null,1.1212409303548279,null,1.0259354512746677,null,null,null,null,1.6686703257633613,null,{"$f":"$E$32","v":0.48023274629672413},{"$f":"$E$33","v":0.59085876923527481},null,5.1054704869550278]
[44,"Chain Saw","Skidder","Processor",null,"WT","Logs & residues","Plant",0.21853226403017312,null,null,1.1212409303548279,null,1.0259354512746677,null,null,null,null,1.6686703257633613,null,null,null,{"$f":"$E$37","v":1.5207370299396266},5.5551160013626557]
[45,"Feller-buncher","Chipper","Shuttle",null,"CHIPS","Logs & residues","Stand",null,{"$f":"$E$7","v":1.5707038895056855},null,null,null,null,null,{"$f":"E16","v":0.81962056312487419},null,null,null,{"$f":"E26","v":5.7710930238851441},null,null,{"$f":"$E$38","v":0.74842110769801484},8.909838584213718]
[46,"Feller-buncher",null,"Forwarder",null,"WT","Logs & residues","Forest road",null,{"$f":"$E$7","v":1.5707038895056855},null,null,{"$f":"$E$11","v":2.8285850743042249},null,null,null,null,null,{"$f":"$E$25","v":1.6686703257633613},null,null,null,{"$f":"$E$38","v":0.74842110769801484},6.8163803972712866]
[47,"Feller-buncher",null,"Forwarder",null,"WT","Logs & residues","Terminal",null,1.5707038895056855,null,null,2.8285850743042249,null,null,null,null,null,1.6686703257633613,null,{"$f":"$E$32","v":0.48023274629672413},{"$f":"$E$33","v":0.59085876923527481},null,7.1390508051052706]
[48,"Feller-buncher",null,"Forwarder",null,"WT","Logs & residues","Plant",null,1.5707038895056855,null,null,2.8285850743042249,null,null,null,null,null,1.6686703257633613,null,null,null,{"$f":"$E$37","v":1.5207370299396266},7.5886963195128985]

{"sheet":"Contribution margin","index":16,"n_rows":140,"n_cols":28,"rows_kept":140,"cut":false,"hidden":true,"merged":[]}
[null,"Costs"]
[null,"€/MWh"]
["Chain Saw - Felling",{"$f":"'2ca Felling and processing'!F13/'Energy content'!$D$123","v":6.5334935525095093},null,null,{"$f":"B3","v":6.5334935525095093}]
["Chain Saw - Felling and Delimbing",{"$f":"'2ca Felling and processing'!F16/'Energy content'!$D$123","v":9.8002403287642625},null,null,{"$f":"B4","v":9.8002403287642625},null,null,null,null,null,null,null,-15,0]
["Chain Saw - Felling and Processing",{"$f":"'2ca Felling and processing'!F19/'Energy content'!$D$123","v":13.066987105019019},null,null,13.066987105019019,null,null,null,null,null,null,null,-10,0]
["Harvester",{"$f":"'2ca Felling and processing'!F39/'Energy content'!$D$123","v":6.4732039082658561},null,null,6.4732039082658561,null,null,null,null,null,null,null,-5,0.25]
["Feller buncher",{"$f":"'2ca Felling and processing'!F29/'Energy content'!$D$123","v":12.375242765802373},null,null,12.375242765802373,null,null,null,null,null,null,null,0,0.5]
["Processor",{"$f":"'2ca Felling and processing'!F49/'Energy content'!$D$123","v":6.0733883727553177},null,null,6.0733883727553177,null,null,null,null,null,null,null,0,0.5]
["Forwarder - logs",{"$f":"'2cb Extracting'!F14/'Energy content'!$D$123","v":3.9732447298399274},null,null,3.9732447298399274,null,null,null,null,null,null,null,5,0.75]
["Forwarder - residues",{"$f":"'2cb Extracting'!F17/'Energy content'!$D$123","v":14.171239536429075},null,null,14.171239536429075,null,null,null,null,null,null,null,10,1]
["Forwarder - trees",{"$f":"'2cb Extracting'!F20/'Energy content'!$D$123","v":7.7297670198704047},null,null,7.7297670198704047,null,null,null,null,null,null,null,15,1]
["Skidder - TL",{"$f":"'2cb Extracting'!F30/'Energy content'!$D$123","v":4.7850938694435836},null,null,4.7850938694435836]
["Skidder - WT",{"$f":"'2cb Extracting'!F33/'Energy content'!$D$123","v":4.3065844824992254},null,null,4.3065844824992254]
["Tower yarder - TL",{"$f":"'2cb Extracting'!F46/'Energy content'!$D$123","v":15.496342454121143},null,null,15.496342454121143]
["Tower yarder - WT",{"$f":"'2cb Extracting'!F49/'Energy content'!$D$123","v":15.496342454121143},null,null,15.496342454121143]
["Shuttle",{"$f":"'2cb Extracting'!F59/'Energy content'!$D$123","v":2.841351285499564},null,null,2.841351285499564]
["Bundler",{"$f":"'2cc Bundling'!F13/'Energy content'!$D$123","v":13.521458343796626},null,null,13.521458343796626]
["Tractor & chipper - logs",{"$f":"'2cd Chipping'!F14/'Energy content'!$D$121","v":2.8842414253247775},null,null,2.8842414253247775]
["Tractor & chipper - residues",{"$f":"'2cd Chipping'!F17/'Energy content'!$D$121","v":7.4324682883369277},null,null,7.4324682883369277]
["Tractor & chipper - bundles",{"$f":"'2cd Chipping'!F20/'Energy content'!$D$121","v":3.5785958425325943},null,null,3.5785958425325943]
["Tractor & chipper - trees",{"$f":"'2cd Chipping'!F23/'Energy content'!$D$121","v":6.6635922585089693},null,null,6.6635922585089693]
["Chippertruck - logs",{"$f":"'2cd Chipping'!F33/'Energy content'!$D$121","v":2.2661896913266109},null,null,2.2661896913266109]
["Chippertruck - residues",{"$f":"'2cd Chipping'!F36/'Energy content'!$D$121","v":5.8397965122647291},null,null,5.8397965122647291]
["Chippertruck - bundles",{"$f":"'2cd Chipping'!F39/'Energy content'!$D$121","v":2.8117538762756102},null,null,2.8117538762756102]
["Chippertruck - trees",{"$f":"'2cd Chipping'!F42/'Energy content'!$D$121","v":3.572581395738422},null,null,3.572581395738422]
["Mobile chipper",{"$f":"'2cd Chipping'!F52/'Energy content'!$D$121","v":12.585229916805805},null,null,12.585229916805805]
[]
[]
["Pre-transport - logs",{"$f":"VT_ERH","v":3.8230552148553558},null,null,3.8230552148553558]
["Pre-transport - residues",{"$f":"VT_SA","v":4.6850568800586867},null,null,4.6850568800586867]
["Pre-transport - bundles",{"$f":"VT_Bün","v":4.3671035387155639},null,null,4.3671035387155639]
["Pre-transport - trees",{"$f":"E122","v":4.6507388435553967},null,null,4.6507388435553967]
["Main transport - chips",{"$f":"HT_HG","v":1.4995279370743717},null,null,1.4995279370743717]
["Direct transport - logs",{"$f":"DIR_ERH","v":4.5267376561979802},null,null,4.5267376561979802]
["Direct transport - residues",{"$f":"DIR_SA","v":7.5471291476535693},null,null,7.5471291476535693]
["Direct transport - bundles",{"$f":"DIR_Bün","v":5.1709250654825141},null,null,5.1709250654825141]
["Direct transport - trees",{"$f":"G122","v":6.0871252283822983},null,null,6.0871252283822983]
["Direct transport - chips",{"$f":"DIR_HG","v":1.7438954527457509},null,null,1.7438954527457509]
[]
[null,null,null,null,null,null,null,null,"Purchase","Chain Saw","Feller buncher","Harvester","Processor","Forwarder","Skidder","Tower Yarder","Shuttle","Bundler","Tractor & Chipper","Chippertruck","Mobile chipper","Pre-transport","Main-transport","Direct transport","Storage Terminal","Storage Plant","SUM","Contribution margin"]
[1,"Chain Saw",null,"Forwarder",null,"CTL","Logs","Forest road",{"$f":"'2b Environment'!$D$25/2.5","v":0.6},{"$f":"$E$5","v":13.066987105019019},null,null,null,{"$f":"$E$9","v":3.9732447298399274},null,null,null,null,null,{"$f":"$E$22","v":2.2661896913266109},null,null,null,{"$f":"$E$38","v":1.7438954527457509},null,{"$f":"'2b Environment'!$D$21/'Energy content'!$D$123","v":0.53089059202406619},{"$f":"SUM(I41:Z41)","v":22.181207570955369},{"$f":"'2b Environment'!$D$29-'Contribution margin'!AA41","v":-2.1812075709553689}]
[2,"Chain Saw",null,"Forwarder",null,"CTL","Logs","Terminal",{"$f":"'2b Environment'!$D$25/2.5","v":0.6},{"$f":"$E$5","v":13.066987105019019},null,null,null,{"$f":"$E$9","v":3.9732447298399274},null,null,null,null,null,{"$f":"$E$22","v":2.2661896913266109},null,{"$f":"$E$29","v":3.8230552148553558},{"$f":"$E$33","v":1.4995279370743717},null,{"$f":"'2b Environment'!$D$20/'Energy content'!$D$123","v":1.5926717760721987},{"$f":"'2b Environment'!$D$21/'Energy content'!$D$123","v":0.53089059202406619},{"$f":"SUM(I42:Z42)","v":27.352567046211544},{"$f":"'2b Environment'!$D$29-'Contribution margin'!AA42","v":-7.3525670462115436}]
[3,"Chain Saw",null,"Forwarder",null,"CTL","Logs","Plant",{"$f":"'2b Environment'!$D$25/2.5","v":0.6},13.066987105019019,null,null,null,3.9732447298399274,null,null,null,null,null,2.2661896913266109,null,null,null,{"$f":"$E$34","v":4.5267376561979802},null,{"$f":"'2b Environment'!$D$21/'Energy content'!$D$123","v":0.53089059202406619},24.964049774407599,{"$f":"'2b Environment'!$D$29-'Contribution margin'!AA43","v":-4.9640497744075986}]
[4,"Chain Saw",null,"Forwarder",null,"CTL","Residues","Forest road",{"$f":"'2b Environment'!$D$25/2.5","v":0.6},{"$f":"$E$5*'2b Environment'!$D$23","v":1.3066987105019019},null,null,null,{"$f":"$E$10","v":14.171239536429075},null,null,null,null,null,{"$f":"$E$23","v":5.8397965122647291},null,null,null,{"$f":"$E$38","v":1.7438954527457509},null,{"$f":"'2b Environment'!$D$21/'Energy content'!$D$123","v":0.53089059202406619},24.192520803965522,{"$f":"'2b Environment'!$D$29-'Contribution margin'!AA44","v":-4.1925208039655217}]
[5,"Chain Saw",null,"Forwarder",null,"CTL","Residues","Terminal",{"$f":"'2b Environment'!$D$25/2.5","v":0.6},{"$f":"$E$5*'2b Environment'!$D$23","v":1.3066987105019019},null,null,null,{"$f":"$E$10","v":14.171239536429075},null,null,null,null,null,{"$f":"$E$23","v":5.8397965122647291},null,{"$f":"$E$30","v":4.6850568800586867},{"$f":"$E$33","v":1.4995279370743717},null,{"$f":"'2b Environment'!$D$20/'Energy content'!$D$123","v":1.5926717760721987},{"$f":"'2b Environment'!$D$21/'Energy content'!$D$123","v":0.53089059202406619},30.225881944425026,{"$f":"'2b Environment'!$D$29-'Contribution margin'!AA45","v":-10.225881944425026}]
[6,"Chain Saw",null,"Forwarder","Bundler","CTL","Residues","Terminal",{"$f":"'2b Environment'!$D$25/2.5","v":0.6},{"$f":"$E$5*'2b Environment'!$D$23","v":1.3066987105019019},null,null,null,14.171239536429075,null,null,null,{"$f":"$E$17","v":13.521458343796626},null,{"$f":"$E$24","v":2.8117538762756102},null,{"$f":"$E$31","v":4.3671035387155639},1.4995279370743717,null,{"$f":"'2b Environment'!$D$20/'Energy content'!$D$123","v":1.5926717760721987},{"$f":"'2b Environment'!$D$21/'Energy content'!$D$123","v":0.53089059202406619},40.401344310889407,{"$f":"'2b Environment'!$D$29-'Contribution margin'!AA46","v":-20.401344310889407}]
[7,"Chain Saw",null,"Forwarder",null,"CTL","Residues","Plant",{"$f":"'2b Environment'!$D$25/2.5","v":0.6},{"$f":"$E$5*'2b Environment'!$D$23","v":1.3066987105019019},null,null,null,14.171239536429075,null,null,null,null,null,{"$f":"$E$23","v":5.8397965122647291},null,null,null,{"$f":"$E$35","v":7.5471291476535693},null,{"$f":"'2b Environment'!$D$21/'Energy content'!$D$123","v":0.53089059202406619},29.995754498873339,{"$f":"'2b Environment'!$D$29-'Contribution margin'!AA47","v":-9.9957544988733389}]
[8,"Chain Saw",null,"Forwarder","Bundler","CTL","Residues","Plant",{"$f":"'2b Environment'!$D$25/2.5","v":0.6},{"$f":"$E$5*'2b Environment'!$D$23","v":1.3066987105019019},null,null,null,14.171239536429075,null,null,null,{"$f":"$E$17","v":13.521458343796626},null,{"$f":"$E$24","v":2.8117538762756102},null,null,null,{"$f":"$E$36","v":5.1709250654825141},null,{"$f":"'2b Environment'!$D$21/'Energy content'!$D$123","v":0.53089059202406619},38.112966124509789,{"$f":"'2b Environment'!$D$29-'Contribution margin'!AA48","v":-18.112966124509789}]
[9,"Chain Saw",null,"Forwarder",null,"CTL","Logs & residues","Forest road",{"$f":"'2b Environment'!$D$25/2.5","v":0.6},{"$f":"$E$3","v":6.5334935525095093},null,null,null,{"$f":"$E$11","v":7.7297670198704047},null,null,null,null,null,{"$f":"$E$25","v":3.572581395738422},null,null,null,{"$f":"$E$38","v":1.7438954527457509},null,{"$f":"'2b Environment'!$D$21/'Energy content'!$D$123","v":0.53089059202406619},20.710628012888151,{"$f":"'2b Environment'!$D$29-'Contribution margin'!AA49","v":-0.71062801288815081}]
[10,"Chain Saw",null,"Forwarder",null,"CTL","Logs & residues","Terminal",{"$f":"'2b Environment'!$D$25/2.5","v":0.6},{"$f":"$E$3","v":6.5334935525095093},null,null,null,{"$f":"$E$11","v":7.7297670198704047},null,null,null,null,null,{"$f":"$E$25","v":3.572581395738422},null,{"$f":"$E$32","v":4.6507388435553967},{"$f":"$E$33","v":1.4995279370743717},null,{"$f":"'2b Environment'!$D$20/'Energy content'!$D$123","v":1.5926717760721987},{"$f":"'2b Environment'!$D$21/'Energy content'!$D$123","v":0.53089059202406619},26.709671116844369,{"$f":"'2b Environment'!$D$29-'Contribution margin'!AA50","v":-6.709671116844369}]
[11,"Chain Saw",null,"Forwarder",null,"CTL","Logs & residues","Plant",{"$f":"'2b Environment'!$D$25/2.5","v":0.6},6.5334935525095093,null,null,null,7.7297670198704047,null,null,null,null,null,3.572581395738422,null,null,null,{"$f":"$E$37","v":6.0871252283822983},null,{"$f":"'2b Environment'!$D$21/'Energy content'!$D$123","v":0.53089059202406619},25.053857788524699,{"$f":"'2b Environment'!$D$29-'Contribution margin'!AA51","v":-5.0538577885246987}]
[12,"Harvester",null,"Forwarder",null,"CTL","Logs","Forest road",{"$f":"'2b Environment'!$D$25/2.5","v":0.6},null,null,{"$f":"$E$6","v":6.4732039082658561},null,{"$f":"$E$9","v":3.9732447298399274},null,null,null,null,null,{"$f":"$E$22","v":2.2661896913266109},null,null,null,{"$f":"$E$38","v":1.7438954527457509},null,{"$f":"'2b Environment'!$D$21/'Energy content'!$D$123","v":0.53089059202406619},15.587424374202211,{"$f":"'2b Environment'!$D$29-'Contribution margin'!AA52","v":4.4125756257977891}]
[13,"Harvester",null,"Forwarder",null,"CTL","Logs","Terminal",{"$f":"'2b Environment'!$D$25/2.5","v":0.6},null,null,{"$f":"$E$6","v":6.4732039082658561},null,{"$f":"$E$9","v":3.9732447298399274},null,null,null,null,null,2.2661896913266109,null,{"$f":"$E$29","v":3.8230552148553558},{"$f":"$E$33","v":1.4995279370743717},null,{"$f":"'2b Environment'!$D$20/'Energy content'!$D$123","v":1.5926717760721987},{"$f":"'2b Environment'!$D$21/'Energy content'!$D$123","v":0.53089059202406619},20.758783849458386,{"$f":"'2b Environment'!$D$29-'Contribution margin'!AA53","v":-0.75878384945838562}]
[14,"Harvester",null,"Forwarder",null,"CTL","Logs","Plant",{"$f":"'2b Environment'!$D$25/2.5","v":0.6},null,null,6.4732039082658561,null,3.9732447298399274,null,null,null,null,null,2.2661896913266109,null,null,null,{"$f":"$E$34","v":4.5267376561979802},null,{"$f":"'2b Environment'!$D$21/'Energy content'!$D$123","v":0.53089059202406619},18.370266577654441,{"$f":"'2b Environment'!$D$29-'Contribution margin'!AA54","v":1.6297334223455593}]
[15,"Harvester",null,"Forwarder",null,"CTL","Residues","Forest road",{"$f":"'2b Environment'!$D$25/2.5","v":0.6},null,null,{"$f":"$E$6*'2b Environment'!$D$23","v":0.64732039082658566},null,{"$f":"$E$10","v":14.171239536429075},null,null,null,null,null,{"$f":"$E$23","v":5.8397965122647291},null,null,null,{"$f":"$E$38","v":1.7438954527457509},null,{"$f":"'2b Environment'!$D$21/'Energy content'!$D$123","v":0.53089059202406619},23.533142484290206,{"$f":"'2b Environment'!$D$29-'Contribution margin'!AA55","v":-3.5331424842902059}]
[16,"Harvester",null,"Forwarder",null,"CTL","Residues","Terminal",{"$f":"'2b Environment'!$D$25/2.5","v":0.6},null,null,{"$f":"$E$6*'2b Environment'!$D$23","v":0.64732039082658566},null,14.171239536429075,null,null,null,null,null,{"$f":"$E$23","v":5.8397965122647291},null,{"$f":"$E$30","v":4.6850568800586867},{"$f":"$E$33","v":1.4995279370743717},null,{"$f":"'2b Environment'!$D$20/'Energy content'!$D$123","v":1.5926717760721987},{"$f":"'2b Environment'!$D$21/'Energy content'!$D$123","v":0.53089059202406619},29.566503624749714,{"$f":"'2b Environment'!$D$29-'Contribution margin'!AA56","v":-9.5665036247497142}]
[17,"Harvester",null,"Forwarder","Bundler","CTL","Residues","Terminal",{"$f":"'2b Environment'!$D$25/2.5","v":0.6},null,null,{"$f":"$E$6*'2b Environment'!$D$23","v":0.64732039082658566},null,14.171239536429075,null,null,null,{"$f":"$E$17","v":13.521458343796626},null,{"$f":"$E$24","v":2.8117538762756102},null,{"$f":"$E$31","v":4.3671035387155639},1.4995279370743717,null,{"$f":"'2b Environment'!$D$20/'Energy content'!$D$123","v":1.5926717760721987},{"$f":"'2b Environment'!$D$21/'Energy content'!$D$123","v":0.53089059202406619},39.741965991214094,{"$f":"'2b Environment'!$D$29-'Contribution margin'!AA57","v":-19.741965991214094}]
[18,"Harvester",null,"Forwarder",null,"CTL","Residues","Plant",{"$f":"'2b Environment'!$D$25/2.5","v":0.6},null,null,{"$f":"$E$6*'2b Environment'!$D$23","v":0.64732039082658566},null,14.171239536429075,null,null,null,null,null,{"$f":"$E$23","v":5.8397965122647291},null,null,null,{"$f":"$E$35","v":7.5471291476535693},null,{"$f":"'2b Environment'!$D$21/'Energy content'!$D$123","v":0.53089059202406619},29.336376179198027,{"$f":"'2b Environment'!$D$29-'Contribution margin'!AA58","v":-9.3363761791980266}]
[19,"Harvester",null,"Forwarder","Bundler","CTL","Residues","Plant",{"$f":"'2b Environment'!$D$25/2.5","v":0.6},null,null,{"$f":"$E$6*'2b Environment'!$D$23","v":0.64732039082658566},null,14.171239536429075,null,null,null,{"$f":"$E$17","v":13.521458343796626},null,{"$f":"$E$24","v":2.8117538762756102},null,null,null,{"$f":"$E$36","v":5.1709250654825141},null,{"$f":"'2b Environment'!$D$21/'Energy content'!$D$123","v":0.53089059202406619},37.453587804834477,{"$f":"'2b Environment'!$D$29-'Contribution margin'!AA59","v":-17.453587804834477}]
[20,"Harvester",null,"Forwarder",null,"CTL","Logs & residues","Forest road",{"$f":"'2b Environment'!$D$25/2.5","v":0.6},null,null,6.4732039082658561,null,{"$f":"$E$11","v":7.7297670198704047},null,null,null,null,null,{"$f":"$E$25","v":3.572581395738422},null,null,null,{"$f":"$E$38","v":1.7438954527457509},null,{"$f":"'2b Environment'!$D$21/'Energy content'!$D$123","v":0.53089059202406619},20.650338368644498,{"$f":"'2b Environment'!$D$29-'Contribution margin'!AA60","v":-0.65033836864449768}]
[21,"Harvester",null,"Forwarder",null,"CTL","Logs & residues","Terminal",{"$f":"'2b Environment'!$D$25/2.5","v":0.6},null,null,6.4732039082658561,null,7.7297670198704047,null,null,null,null,null,3.572581395738422,null,{"$f":"$E$32","v":4.6507388435553967},{"$f":"$E$33","v":1.4995279370743717},null,{"$f":"'2b Environment'!$D$20/'Energy content'!$D$123","v":1.5926717760721987},{"$f":"'2b Environment'!$D$21/'Energy content'!$D$123","v":0.53089059202406619},26.649381472600716,{"$f":"'2b Environment'!$D$29-'Contribution margin'!AA61","v":-6.6493814726007159}]
[22,"Harvester",null,"Forwarder",null,"CTL","Logs & residues","Plant",{"$f":"'2b Environment'!$D$25/2.5","v":0.6},null,null,6.4732039082658561,null,7.7297670198704047,null,null,null,null,null,3.572581395738422,null,null,null,{"$f":"$E$37","v":6.0871252283822983},null,{"$f":"'2b Environment'!$D$21/'Energy content'!$D$123","v":0.53089059202406619},24.993568144281046,{"$f":"'2b Environment'!$D$29-'Contribution margin'!AA62","v":-4.9935681442810456}]
[23,"Chain Saw",null,"Tower Yarder",null,"TL","Logs","Forest road",{"$f":"'2b Environment'!$D$25/2.5","v":0.6},{"$f":"$E$4","v":9.8002403287642625},null,null,null,null,null,{"$f":"$E$14","v":15.496342454121143},null,null,null,{"$f":"$E$22","v":2.2661896913266109},null,null,null,{"$f":"$E$38","v":1.7438954527457509},null,{"$f":"'2b Environment'!$D$21/'Energy content'!$D$123","v":0.53089059202406619},30.437558518981827,{"$f":"'2b Environment'!$D$29-'Contribution margin'!AA63","v":-10.437558518981827}]
[24,"Chain Saw",null,"Tower Yarder",null,"TL","Logs","Terminal",{"$f":"'2b Environment'!$D$25/2.5","v":0.6},{"$f":"$E$4","v":9.8002403287642625},null,null,null,null,null,{"$f":"$E$14","v":15.496342454121143},null,null,null,2.2661896913266109,null,{"$f":"$E$29","v":3.8230552148553558},{"$f":"$E$33","v":1.4995279370743717},null,{"$f":"'2b Environment'!$D$20/'Energy content'!$D$123","v":1.5926717760721987},{"$f":"'2b Environment'!$D$21/'Energy content'!$D$123","v":0.53089059202406619},35.608917994238006,{"$f":"'2b Environment'!$D$29-'Contribution margin'!AA64","v":-15.608917994238006}]
[25,"Chain Saw",null,"Tower Yarder",null,"TL","Logs","Plant",{"$f":"'2b Environment'!$D$25/2.5","v":0.6},9.8002403287642625,null,null,null,null,null,15.496342454121143,null,null,null,2.2661896913266109,null,null,null,{"$f":"$E$34","v":4.5267376561979802},null,{"$f":"'2b Environment'!$D$21/'Energy content'!$D$123","v":0.53089059202406619},33.220400722434057,{"$f":"'2b Environment'!$D$29-'Contribution margin'!AA65","v":-13.220400722434057}]
[26,"Chain Saw","Processor","Tower Yarder",null,"WT","Residues","Forest road",{"$f":"'2b Environment'!$D$25/2.5","v":0.6},{"$f":"$E$3*'2b Environment'!$D$23","v":0.65334935525095095},null,null,{"$f":"$E$8*'2b Environment'!$D$23","v":0.60733883727553184},null,null,{"$f":"$E$15*'2b Environment'!$D$23","v":1.5496342454121144},null,null,null,{"$f":"$E$23","v":5.8397965122647291},null,null,null,{"$f":"$E$38","v":1.7438954527457509},null,{"$f":"'2b Environment'!$D$21/'Energy content'!$D$123","v":0.53089059202406619},11.524904994973143,{"$f":"'2b Environment'!$D$29-'Contribution margin'!AA66","v":8.4750950050268568}]
[27,"Chain Saw","Processor","Tower Yarder",null,"WT","Residues","Terminal",{"$f":"'2b Environment'!$D$25/2.5","v":0.6},{"$f":"$E$3*'2b Environment'!$D$23","v":0.65334935525095095},null,null,{"$f":"$E$8*'2b Environment'!$D$23","v":0.60733883727553184},null,null,{"$f":"$E$15*'2b Environment'!$D$23","v":1.5496342454121144},null,null,null,{"$f":"$E$23","v":5.8397965122647291},null,{"$f":"$E$30","v":4.6850568800586867},{"$f":"$E$33","v":1.4995279370743717},null,{"$f":"'2b Environment'!$D$20/'Energy content'!$D$123","v":1.5926717760721987},{"$f":"'2b Environment'!$D$21/'Energy content'!$D$123","v":0.53089059202406619},17.55826613543265,{"$f":"'2b Environment'!$D$29-'Contribution margin'!AA67","v":2.4417338645673503}]
[28,"Chain Saw","Processor","Tower Yarder","Bundler","WT","Residues","Terminal",{"$f":"'2b Environment'!$D$25/2.5","v":0.6},{"$f":"$E$3*'2b Environment'!$D$23","v":0.65334935525095095},null,null,{"$f":"$E$8*'2b Environment'!$D$23","v":0.60733883727553184},null,null,{"$f":"$E$15*'2b Environment'!$D$23","v":1.5496342454121144},null,{"$f":"$E$17","v":13.521458343796626},null,{"$f":"$E$24","v":2.8117538762756102},null,{"$f":"$E$31","v":4.3671035387155639},1.4995279370743717,null,{"$f":"'2b Environment'!$D$20/'Energy content'!$D$123","v":1.5926717760721987},{"$f":"'2b Environment'!$D$21/'Energy content'!$D$123","v":0.53089059202406619},27.733728501897033,{"$f":"'2b Environment'!$D$29-'Contribution margin'!AA68","v":-7.7337285018970334}]
[29,"Chain Saw","Processor","Tower Yarder",null,"WT","Residues","Plant",{"$f":"'2b Environment'!$D$25/2.5","v":0.6},{"$f":"$E$3*'2b Environment'!$D$23","v":0.65334935525095095},null,null,{"$f":"$E$8*'2b Environment'!$D$23","v":0.60733883727553184},null,null,{"$f":"$E$15*'2b Environment'!$D$23","v":1.5496342454121144},null,null,null,{"$f":"$E$23","v":5.8397965122647291},null,null,null,{"$f":"$E$35","v":7.5471291476535693},null,{"$f":"'2b Environment'!$D$21/'Energy content'!$D$123","v":0.53089059202406619},17.328138689880959,{"$f":"'2b Environment'!$D$29-'Contribution margin'!AA69","v":2.6718613101190414}]
[30,"Chain Saw","Processor","Tower Yarder","Bundler","WT","Residues","Plant",{"$f":"'2b Environment'!$D$25/2.5","v":0.6},{"$f":"$E$3*'2b Environment'!$D$23","v":0.65334935525095095},null,null,{"$f":"$E$8*'2b Environment'!$D$23","v":0.60733883727553184},null,null,{"$f":"$E$15*'2b Environment'!$D$23","v":1.5496342454121144},null,{"$f":"$E$17","v":13.521458343796626},null,{"$f":"$E$24","v":2.8117538762756102},null,null,null,{"$f":"$E$36","v":5.1709250654825141},null,{"$f":"'2b Environment'!$D$21/'Energy content'!$D$123","v":0.53089059202406619},25.445350315517413,{"$f":"'2b Environment'!$D$29-'Contribution margin'!AA70","v":-5.4453503155174126}]
[31,"Chain Saw","Processor","Tower Yarder",null,"WT","Logs & residues","Forest road",{"$f":"'2b Environment'!$D$25/2.5","v":0.6},{"$f":"$E$3","v":6.5334935525095093},null,null,{"$f":"$E$8","v":6.0733883727553177},null,null,{"$f":"$E$15","v":15.496342454121143},null,null,null,{"$f":"$E$25","v":3.572581395738422},null,null,null,{"$f":"$E$38","v":1.7438954527457509},null,{"$f":"'2b Environment'!$D$21/'Energy content'!$D$123","v":0.53089059202406619},34.550591819894215,{"$f":"'2b Environment'!$D$29-'Contribution margin'!AA71","v":-14.550591819894215}]
[32,"Chain Saw","Processor","Tower Yarder",null,"WT","Logs & residues","Terminal",{"$f":"'2b Environment'!$D$25/2.5","v":0.6},6.5334935525095093,null,null,6.0733883727553177,null,null,15.496342454121143,null,null,null,3.572581395738422,null,{"$f":"$E$32","v":4.6507388435553967},{"$f":"$E$33","v":1.4995279370743717},null,{"$f":"'2b Environment'!$D$20/'Energy content'!$D$123","v":1.5926717760721987},{"$f":"'2b Environment'!$D$21/'Energy content'!$D$123","v":0.53089059202406619},40.549634923850427,{"$f":"'2b Environment'!$D$29-'Contribution margin'!AA72","v":-20.549634923850427}]
[33,"Chain Saw","Processor","Tower Yarder",null,"WT","Logs & residues","Plant",{"$f":"'2b Environment'!$D$25/2.5","v":0.6},6.5334935525095093,null,null,6.0733883727553177,null,null,15.496342454121143,null,null,null,3.572581395738422,null,null,null,{"$f":"$E$37","v":6.0871252283822983},null,{"$f":"'2b Environment'!$D$21/'Energy content'!$D$123","v":0.53089059202406619},38.89382159553076,{"$f":"'2b Environment'!$D$29-'Contribution margin'!AA73","v":-18.89382159553076}]
[34,"Chain Saw",null,"Skidder",null,"TL","Logs","Forest road",{"$f":"'2b Environment'!$D$25/2.5","v":0.6},{"$f":"$E$4","v":9.8002403287642625},null,null,null,null,{"$f":"$E$12","v":4.7850938694435836},null,null,null,null,{"$f":"$E$22","v":2.2661896913266109},null,null,null,{"$f":"$E$38","v":1.7438954527457509},null,{"$f":"'2b Environment'!$D$21/'Energy content'!$D$123","v":0.53089059202406619},19.726309934304272,{"$f":"'2b Environment'!$D$29-'Contribution margin'!AA74","v":0.27369006569572818}]
[35,"Chain Saw",null,"Skidder",null,"TL","Logs","Terminal",{"$f":"'2b Environment'!$D$25/2.5","v":0.6},9.8002403287642625,null,null,null,null,{"$f":"$E$12","v":4.7850938694435836},null,null,null,null,2.2661896913266109,null,{"$f":"$E$29","v":3.8230552148553558},{"$f":"$E$33","v":1.4995279370743717},null,{"$f":"'2b Environment'!$D$20/'Energy content'!$D$123","v":1.5926717760721987},{"$f":"'2b Environment'!$D$21/'Energy content'!$D$123","v":0.53089059202406619},24.897669409560446,{"$f":"'2b Environment'!$D$29-'Contribution margin'!AA75","v":-4.8976694095604465}]
[36,"Chain Saw",null,"Skidder",null,"TL","Logs","Plant",{"$f":"'2b Environment'!$D$25/2.5","v":0.6},9.8002403287642625,null,null,null,null,4.7850938694435836,null,null,null,null,2.2661896913266109,null,null,null,{"$f":"$E$34","v":4.5267376561979802},null,{"$f":"'2b Environment'!$D$21/'Energy content'!$D$123","v":0.53089059202406619},22.509152137756502,{"$f":"'2b Environment'!$D$29-'Contribution margin'!AA76","v":-2.5091521377565016}]
[37,"Chain Saw","Skidder","Processor",null,"WT","Residues","Forest road",{"$f":"'2b Environment'!$D$25/2.5","v":0.6},{"$f":"$E$3*'2b Environment'!$D$23","v":0.65334935525095095},null,null,{"$f":"$E$8*'2b Environment'!$D$23","v":0.60733883727553184},null,{"$f":"$E$13*'2b Environment'!$D$23","v":0.43065844824992255},null,null,null,null,{"$f":"$E$23","v":5.8397965122647291},null,null,null,{"$f":"$E$38","v":1.7438954527457509},null,{"$f":"'2b Environment'!$D$21/'Energy content'!$D$123","v":0.53089059202406619},10.405929197810952,{"$f":"'2b Environment'!$D$29-'Contribution margin'!AA77","v":9.594070802189048}]
[38,"Chain Saw","Skidder","Processor",null,"WT","Residues","Terminal",{"$f":"'2b Environment'!$D$25/2.5","v":0.6},{"$f":"$E$3*'2b Environment'!$D$23","v":0.65334935525095095},null,null,{"$f":"$E$8*'2b Environment'!$D$23","v":0.60733883727553184},null,{"$f":"$E$13*'2b Environment'!$D$23","v":0.43065844824992255},null,null,null,null,{"$f":"$E$23","v":5.8397965122647291},null,{"$f":"$E$30","v":4.6850568800586867},{"$f":"$E$33","v":1.4995279370743717},null,{"$f":"'2b Environment'!$D$20/'Energy content'!$D$123","v":1.5926717760721987},{"$f":"'2b Environment'!$D$21/'Energy content'!$D$123","v":0.53089059202406619},16.439290338270457,{"$f":"'2b Environment'!$D$29-'Contribution margin'!AA78","v":3.5607096617295433}]
[39,"Chain Saw","Skidder","Processor","Bundler","WT","Residues","Terminal",{"$f":"'2b Environment'!$D$25/2.5","v":0.6},{"$f":"$E$3*'2b Environment'!$D$23","v":0.65334935525095095},null,null,{"$f":"$E$8*'2b Environment'!$D$23","v":0.60733883727553184},null,{"$f":"$E$13*'2b Environment'!$D$23","v":0.43065844824992255},null,null,{"$f":"$E$17","v":13.521458343796626},null,{"$f":"$E$24","v":2.8117538762756102},null,{"$f":"$E$31","v":4.3671035387155639},1.4995279370743717,null,{"$f":"'2b Environment'!$D$20/'Energy content'!$D$123","v":1.5926717760721987},{"$f":"'2b Environment'!$D$21/'Energy content'!$D$123","v":0.53089059202406619},26.61475270473484,{"$f":"'2b Environment'!$D$29-'Contribution margin'!AA79","v":-6.6147527047348404}]
[40,"Chain Saw","Skidder","Processor",null,"WT","Residues","Plant",{"$f":"'2b Environment'!$D$25/2.5","v":0.6},{"$f":"$E$3*'2b Environment'!$D$23","v":0.65334935525095095},null,null,{"$f":"$E$8*'2b Environment'!$D$23","v":0.60733883727553184},null,{"$f":"$E$13*'2b Environment'!$D$23","v":0.43065844824992255},null,null,null,null,{"$f":"$E$23","v":5.8397965122647291},null,null,null,{"$f":"$E$35","v":7.5471291476535693},null,{"$f":"'2b Environment'!$D$21/'Energy content'!$D$123","v":0.53089059202406619},16.209162892718769,{"$f":"'2b Environment'!$D$29-'Contribution margin'!AA80","v":3.7908371072812308}]
[41,"Chain Saw","Skidder","Processor","Bundler","WT","Residues","Plant",{"$f":"'2b Environment'!$D$25/2.5","v":0.6},{"$f":"$E$3*'2b Environment'!$D$23","v":0.65334935525095095},null,null,{"$f":"$E$8*'2b Environment'!$D$23","v":0.60733883727553184},null,{"$f":"$E$13*'2b Environment'!$D$23","v":0.43065844824992255},null,null,{"$f":"$E$17","v":13.521458343796626},null,{"$f":"$E$24","v":2.8117538762756102},null,null,null,{"$f":"$E$36","v":5.1709250654825141},null,{"$f":"'2b Environment'!$D$21/'Energy content'!$D$123","v":0.53089059202406619},24.32637451835522,{"$f":"'2b Environment'!$D$29-'Contribution margin'!AA81","v":-4.3263745183552196}]
[42,"Chain Saw","Skidder","Processor",null,"WT","Logs & residues","Forest road",{"$f":"'2b Environment'!$D$25/2.5","v":0.6},{"$f":"$E$3","v":6.5334935525095093},null,null,{"$f":"$E$8","v":6.0733883727553177},null,{"$f":"$E$13","v":4.3065844824992254},null,null,null,null,{"$f":"$E$25","v":3.572581395738422},null,null,null,{"$f":"$E$38","v":1.7438954527457509},null,{"$f":"'2b Environment'!$D$21/'Energy content'!$D$123","v":0.53089059202406619},23.360833848272289,{"$f":"'2b Environment'!$D$29-'Contribution margin'!AA82","v":-3.3608338482722893}]
[43,"Chain Saw","Skidder","Processor",null,"WT","Logs & residues","Terminal",{"$f":"'2b Environment'!$D$25/2.5","v":0.6},6.5334935525095093,null,null,6.0733883727553177,null,4.3065844824992254,null,null,null,null,3.572581395738422,null,{"$f":"$E$32","v":4.6507388435553967},{"$f":"$E$33","v":1.4995279370743717},null,{"$f":"'2b Environment'!$D$20/'Energy content'!$D$123","v":1.5926717760721987},{"$f":"'2b Environment'!$D$21/'Energy content'!$D$123","v":0.53089059202406619},29.359876952228504,{"$f":"'2b Environment'!$D$29-'Contribution margin'!AA83","v":-9.3598769522285039}]
[44,"Chain Saw","Skidder","Processor",null,"WT","Logs & residues","Plant",{"$f":"'2b Environment'!$D$25/2.5","v":0.6},6.5334935525095093,null,null,6.0733883727553177,null,4.3065844824992254,null,null,null,null,3.572581395738422,null,null,null,{"$f":"$E$37","v":6.0871252283822983},null,{"$f":"'2b Environment'!$D$21/'Energy content'!$D$123","v":0.53089059202406619},27.704063623908837,{"$f":"'2b Environment'!$D$29-'Contribution margin'!AA84","v":-7.7040636239088371}]
[45,"Feller-buncher","Chipper","Shuttle",null,"CHIPS","Logs & residues","Stand",{"$f":"'2b Environment'!$D$25/2.5","v":0.6},null,{"$f":"$E$7","v":12.375242765802373},null,null,null,null,null,{"$f":"E16","v":2.841351285499564},null,null,null,{"$f":"E26","v":12.585229916805805},null,null,{"$f":"$E$38","v":1.7438954527457509},null,{"$f":"'2b Environment'!$D$21/'Energy content'!$D$123","v":0.53089059202406619},30.676610012877557,{"$f":"'2b Environment'!$D$29-'Contribution margin'!AA85","v":-10.676610012877557}]
[46,"Feller-buncher",null,"Forwarder",null,"WT","Logs & residues","Forest road",{"$f":"'2b Environment'!$D$25/2.5","v":0.6},null,{"$f":"$E$7","v":12.375242765802373},null,null,{"$f":"$E$11","v":7.7297670198704047},null,null,null,null,null,{"$f":"$E$25","v":3.572581395738422},null,null,null,{"$f":"$E$38","v":1.7438954527457509},null,{"$f":"'2b Environment'!$D$21/'Energy content'!$D$123","v":0.53089059202406619},26.552377226181015,{"$f":"'2b Environment'!$D$29-'Contribution margin'!AA86","v":-6.5523772261810151}]
[47,"Feller-buncher",null,"Forwarder",null,"WT","Logs & residues","Terminal",{"$f":"'2b Environment'!$D$25/2.5","v":0.6},null,12.375242765802373,null,null,7.7297670198704047,null,null,null,null,null,3.572581395738422,null,{"$f":"$E$32","v":4.6507388435553967},{"$f":"$E$33","v":1.4995279370743717},null,{"$f":"'2b Environment'!$D$20/'Energy content'!$D$123","v":1.5926717760721987},{"$f":"'2b Environment'!$D$21/'Energy content'!$D$123","v":0.53089059202406619},32.551420330137233,{"$f":"'2b Environment'!$D$29-'Contribution margin'!AA87","v":-12.551420330137233}]
[48,"Feller-buncher",null,"Forwarder",null,"WT","Logs & residues","Plant",{"$f":"'2b Environment'!$D$25/2.5","v":0.6},null,12.375242765802373,null,null,7.7297670198704047,null,null,null,null,null,3.572581395738422,null,null,null,{"$f":"$E$37","v":6.0871252283822983},null,{"$f":"'2b Environment'!$D$21/'Energy content'!$D$123","v":0.53089059202406619},30.895607001817563,{"$f":"'2b Environment'!$D$29-'Contribution margin'!AA88","v":-10.895607001817563}]
[]
["Transport (Load volume)",null,null,{"$f":"'2b Environment'!D13","v":55},{"$f":"'2b Environment'!D13","v":55},{"$f":"'2b Environment'!D13","v":55},{"$f":"'2b Environment'!D13","v":55},{"$f":"'2b Environment'!D14","v":30},null,null,{"$f":"'2b Environment'!D13","v":55}]
[null,null,null,"logs","residues","bundles","logs & residues","chips",null,null,"chips",null,null,"dry-ton/m³"]
["Wood density [kg/m³ stacked]",{"$f":"'2a Site and stand'!C21/('2a Site and stand'!C21+'2a Site and stand'!C22+'2a Site and stand'!C23)","v":0.75},{"$f":"'2a Site and stand'!D21","v":"Norway Spruce"},{"$f":"VLOOKUP(C92,'Energy content'!$J$4:$N$23,3,FALSE)","v":512.38641144271901},{"$f":"VLOOKUP(C92,'Energy content'!$J$4:$N$23,4,FALSE)","v":264.51948490730359},{"$f":"VLOOKUP(C92,'Energy content'!$J$4:$N$23,5,FALSE)","v":302.30798275120418},{"$f":"VLOOKUP(C92,'Energy content'!$J$4:$O$23,6,FALSE)","v":420.67564862461535},{"$f":"VLOOKUP(C92,'Energy content'!$J$50:$K$69,2,FALSE)","v":221.17324493611275},null,null,{"$f":"VLOOKUP(C92,'Energy content'!$J$4:$K$23,2,FALSE)","v":302.30798275120418},null,null,{"$f":"VLOOKUP(C92,'Energy content'!$A$97:$C$116,3,FALSE)","v":0.41}]
["max. load volume [m³]",null,"m³",{"$f":"'2ce Transporting'!D10","v":50},{"$f":"'2ce Transporting'!D21","v":25},{"$f":"'2ce Transporting'!D32","v":50},{"$f":"'2ce Transporting'!D43","v":25},{"$f":"'2ce Transporting'!D54","v":90},null,null,{"$f":"'2ce Transporting'!D54","v":90}]
["max. load volume [m³ loose]",null,"m³ loose",{"$f":"D93*1.7","v":85},{"$f":"E93*1.7/2","v":21.25},{"$f":"F93","v":50},{"$f":"G93*1.38","v":34.5},{"$f":"H93","v":90},null,null,{"$f":"K93","v":90}]
["theor. load capacity [kg]",null,"calculated mass",{"$f":"D92*D93","v":25619.320572135952},{"$f":"E92*E93","v":6612.9871226825899},{"$f":"F92*F93","v":15115.399137560209},{"$f":"G92*G93","v":10516.891215615384},{"$f":"H92*H93","v":19905.592044250148},null,null,{"$f":"K92*K93","v":27207.718447608375}]
["max. load capacity [kg]",null,"maximum mass",{"$f":"'2ce Transporting'!D13*1000","v":18000},{"$f":"'2ce Transporting'!D24*1000","v":10000},{"$f":"'2ce Transporting'!D35*1000","v":18000},{"$f":"'2ce Transporting'!D46*1000","v":10000},{"$f":"'2ce Transporting'!D57*1000","v":20000},null,null,{"$f":"'2ce Transporting'!D57*1000","v":20000}]
["load volume [m³ loose]",null,"m³ loose",{"$f":"IF(D95<D96,D94,D96/D92*1.7)*B92","v":44.790414982669063},{"$f":"IF(E95<E96,E94,E96/E92*0.85)*B92","v":15.9375},{"$f":"IF(F95<F96,F94,F96/F92)*B92","v":37.5},{"$f":"IF(G95<G96,G94,G96/G92)*B92","v":17.82846243779737},{"$f":"IF(H95<H96,H94,H96/H92)*B92","v":67.5},null,null,{"$f":"IF(K95<K96,K94,K96/K92)*B92","v":49.618272939702088}]
[null,null,"kWh",{"$f":"VLOOKUP($C$92,'Energy content'!$J$26:$N$45,2,FALSE)*D97","v":31529.861364925389},{"$f":"VLOOKUP($C$92,'Energy content'!$J$26:$N$45,2,FALSE)*E97","v":11219.07813754205},{"$f":"VLOOKUP($C$92,'Energy content'!$J$26:$N$45,2,FALSE)*F97","v":26397.830911863646},{"$f":"VLOOKUP($C$92,'Energy content'!$J$26:$N$45,2,FALSE)*G97","v":12550.206316039663},{"$f":"VLOOKUP($C$92,'Energy content'!$J$72:$N$91,2,FALSE)*H97","v":50918.599575869302},{"$f":"IF(Menge_HG=0,0,H98/Menge_HG)","v":754.34962334621184},null,{"$f":"VLOOKUP($C$92,'Energy content'!$J$26:$N$45,2,FALSE)*K97","v":34928.394112025475},{"$f":"IF(K97=0,0,K98/K97)","v":703.94215764969726}]
["Wood density [kg/m³ stacked]",{"$f":"'2a Site and stand'!C22/('2a Site and stand'!C21+'2a Site and stand'!C22+'2a Site and stand'!C23)","v":0.2},{"$f":"'2a Site and stand'!D22","v":"Beech"},{"$f":"VLOOKUP(C99,'Energy content'!$J$4:$N$23,3,FALSE)","v":742.73820836402376},{"$f":"VLOOKUP(C99,'Energy content'!$J$4:$N$23,4,FALSE)","v":383.43860006792727},{"$f":"VLOOKUP(C99,'Energy content'!$J$4:$N$23,5,FALSE)","v":438.21554293477402},{"$f":"VLOOKUP(C99,'Energy content'!$J$4:$O$23,6,FALSE)","v":609.79735329446805},{"$f":"VLOOKUP(C99,'Energy content'!$J$50:$K$69,2,FALSE)","v":323.82747729408243},null,null,{"$f":"VLOOKUP(C99,'Energy content'!$J$4:$K$23,2,FALSE)","v":438.21554293477402},null,null,{"$f":"VLOOKUP(C99,'Energy content'!$A$97:$C$116,3,FALSE)","v":0.68}]
["max. load volume [m³]",null,"m³",{"$f":"'2ce Transporting'!D10","v":50},{"$f":"'2ce Transporting'!D21","v":25},{"$f":"'2ce Transporting'!D32","v":50},{"$f":"'2ce Transporting'!D43","v":25},{"$f":"'2ce Transporting'!D54","v":90},null,null,{"$f":"K93","v":90}]
["max. load volume [m³ loose]",null,"m³ loose",{"$f":"D100*1.7","v":85},{"$f":"E100*1.7/2","v":21.25},{"$f":"F100","v":50},{"$f":"G100*1.38","v":34.5},{"$f":"H100","v":90},null,null,{"$f":"K100","v":90}]
["theor. load capacity [kg]",null,"calculated mass",{"$f":"D99*D100","v":37136.910418201187},{"$f":"E99*E100","v":9585.9650016981814},{"$f":"F99*F100","v":21910.777146738699},{"$f":"G99*G100","v":15244.933832361701},{"$f":"H99*H100","v":29144.47295646742},null,null,{"$f":"K99*K100","v":39439.39886412966}]
["max. load capacity [kg]",null,"maximum mass",{"$f":"D96","v":18000},{"$f":"E96","v":10000},18000,10000,20000,null,null,{"$f":"K96","v":20000}]
["load volume [m³ loose]",null,"m³ loose",{"$f":"IF(D102<D103,D101,D103/D99*1.7)*B99","v":8.2397807613534315},{"$f":"IF(E102<E103,E101,E103/E99*0.85)*B99","v":4.25},{"$f":"IF(F102<F103,F101,F103/F99)*B99","v":8.2151353552875701},{"$f":"IF(G102<G103,G101,G103/G99)*B99","v":3.2797780921725486},{"$f":"IF(H102<H103,H101,H103/H99)*B99","v":12.352256310749747},null,null,{"$f":"IF(K102<K103,K101,K103/K99)*B99","v":9.1279281725417434}]
[null,null,"kWh",{"$f":"VLOOKUP($C$99,'Energy content'!$J$26:$N$45,2,FALSE)*D104","v":7916.0520247505901},{"$f":"VLOOKUP($C$99,'Energy content'!$J$26:$N$45,2,FALSE)*E104","v":4083.023818180317},{"$f":"VLOOKUP($C$99,'Energy content'!$J$26:$N$45,2,FALSE)*F104","v":7892.3749000504404},{"$f":"VLOOKUP($C$99,'Energy content'!$J$26:$N$45,2,FALSE)*G104","v":3150.9204867497683},{"$f":"VLOOKUP($C$99,'Energy content'!$J$72:$N$91,2,FALSE)*H104","v":12876.22164323349},{"$f":"IF(H104=0,0,H105/H104)","v":1042.4185929519415},null,{"$f":"VLOOKUP($C$99,'Energy content'!$J$26:$N$45,2,FALSE)*K104","v":8769.3054445004873},{"$f":"IF(K104=0,0,K105/K104)","v":960.71148663066276}]
["Wood density [kg/m³ stacked]",{"$f":"'2a Site and stand'!C23/('2a Site and stand'!C21+'2a Site and stand'!C22+'2a Site and stand'!C23)","v":0.05},{"$f":"'2a Site and stand'!D23","v":"Ash"},{"$f":"VLOOKUP(C106,'Energy content'!$J$4:$N$23,3,FALSE)","v":780.39147074693142},{"$f":"VLOOKUP(C106,'Energy content'!$J$4:$N$23,4,FALSE)","v":402.87709677310323},{"$f":"VLOOKUP(C106,'Energy content'!$J$4:$N$23,5,FALSE)","v":460.43096774068948},{"$f":"VLOOKUP(C106,'Energy content'!$J$4:$O$23,6,FALSE)","v":640.71115237661502},{"$f":"VLOOKUP(C106,'Energy content'!$J$50:$K$69,2,FALSE)","v":338.54700226818306},null,null,{"$f":"VLOOKUP(C106,'Energy content'!$J$4:$K$23,2,FALSE)","v":460.43096774068948},null,null,{"$f":"VLOOKUP(C106,'Energy content'!$A$97:$C$116,3,FALSE)","v":0.67}]
["max. load volume [m³]",null,"m³",{"$f":"D93","v":50},{"$f":"E93","v":25},50,25,90,null,null,{"$f":"K100","v":90}]
["max. load volume [m³ loose]",null,"m³ loose",{"$f":"D94","v":85},{"$f":"E94","v":21.25},50,34.5,90,null,null,{"$f":"K107","v":90}]
["theor. load capacity [kg]",null,"calculated mass",{"$f":"D106*D107","v":39019.573537346572},{"$f":"E106*E107","v":10071.927419327581},{"$f":"F106*F107","v":23021.548387034472},{"$f":"G106*G107","v":16017.778809415375},{"$f":"H106*H107","v":30469.230204136475},null,null,{"$f":"K106*K107","v":41438.787096662054}]
["max. load capacity [kg]",null,"maximum mass",{"$f":"D96","v":18000},{"$f":"E96","v":10000},18000,10000,20000,null,null,{"$f":"K103","v":20000}]
["load volume [m³ loose]",null,"m³ loose",{"$f":"IF(D109<D110,D108,D110/D106*1.7)*B106","v":1.9605544875261132},{"$f":"IF(E109<E110,E108,E110/E106*0.85)*B106","v":1.0549122881496442},{"$f":"IF(F109<F110,F108,F110/F106)*B106","v":1.954690416277282},{"$f":"IF(G109<G110,G108,G110/G106)*B106","v":0.78038285761896042},{"$f":"IF(H109<H110,H108,H110/H106)*B106","v":2.9537996003516258},null,null,{"$f":"IF(K109<K110,K108,K110/K106)*B106","v":2.1718782403080907}]
[null,null,"kWh",{"$f":"VLOOKUP($C$106,'Energy content'!$J$26:$N$45,2,FALSE)*D111","v":1986.9174479484898},{"$f":"VLOOKUP($C$106,'Energy content'!$J$26:$N$45,2,FALSE)*E111","v":1069.0973623613077},{"$f":"VLOOKUP($C$106,'Energy content'!$J$26:$N$45,2,FALSE)*F111","v":1980.9745243753644},{"$f":"VLOOKUP($C$106,'Energy content'!$J$26:$N$45,2,FALSE)*G111","v":790.87642080254204},{"$f":"VLOOKUP($C$106,'Energy content'!$J$72:$N$91,2,FALSE)*H111","v":3226.2708961123481},{"$f":"IF(H111=0,0,H112/H111)","v":1092.24434038392},null,{"$f":"VLOOKUP($C$106,'Energy content'!$J$26:$N$45,2,FALSE)*K111","v":2201.0828048615153},{"$f":"IF(K111=0,0,K112/K111)","v":1013.4466859197787}]
[null,null,null,null,null,null,null,null,null,null,null,null,null,{"$f":"B92*N92+B99*N99+B106*N106","v":0.47699999999999998}]
[null,null,"Sum SRM",{"$f":"Menge_RH+D104+D111","v":54.990750231548603},{"$f":"Menge_SA+E104+E111","v":21.242412288149644},{"$f":"Menge_Bün+F104+F111","v":47.669825771564852},{"$f":"G97+G104+G111","v":21.888623387588879},{"$f":"Menge_HG+H104+H111","v":82.806055911101382},null,null,{"$f":"K97+K104+K111","v":60.918079352551921}]
[null,null,"Sum MWh",{"$f":"(D98+D105+D112)/1000","v":41.432830837624465},{"$f":"(E98+E105+E112)/1000","v":16.371199318083676},{"$f":"(F98+F105+F112)/1000","v":36.271180336289447},{"$f":"(G98+G105+G112)/1000","v":16.492003223591972},{"$f":"(H98+H105+H112)/1000","v":67.02109211521514},null,null,{"$f":"(K98+K105+K112)/1000","v":45.898782361387482}]
[null,null,null,null,null,null,null,{"$f":"HG_MW_T/H114","v":0.80937428280810031},null,null,{"$f":"K115/K114","v":0.75345091061976721}]
["Transport (costs)"]
["Speed",null,null,"Costs in €/MWh","Pre-transport","Main transport","Direct transport"]
["Direct transport [km/h]",45,null,"logs",{"$f":"(Zeit_VT+B136)*Sysk_RLKW/RH_MW_T","v":3.8230552148553558},{"$f":"(Zeit_HT+B136)*Sysk_RLKW/RH_MW_T","v":4.0547555309071956},{"$f":"(Zeit_GT+B136)*Sysk_RLKW/RH_MW_T","v":4.5267376561979802}]
["Pre-transport [km/h]",25,null,"residues",{"$f":"(Zeit_VT+B137)*Sysk_SALKW/SA_MW_T","v":4.6850568800586867},{"$f":"(Zeit_HT+B137)*Sysk_SALKW/SA_MW_T","v":5.1615033424375349},{"$f":"(Zeit_GT+B137)*Sysk_RLKW/SA_MW_T","v":7.5471291476535693}]
["Main transport [km/h]",50,null,"chips",{"$f":"(Zeit_VT+B140)*Sysk_SLKW/HG_MW_T","v":1.379565702108422},{"$f":"(Zeit_HT+B140)*Sysk_SLKW/HG_MW_T","v":1.4995279370743717},{"$f":"(Zeit_GT+B140)*Sysk_SLKW/HG_MW_T","v":1.7438954527457509}]
[null,null,null,"logs & residues",{"$f":"(Zeit_VT+B139)*B132/G115","v":4.6507388435553967},{"$f":"(Zeit_HT+B139)*B132/G115","v":5.1236953361203517},{"$f":"(Zeit_GT+B139)*B132/G115","v":6.0871252283822983}]
["Time",null,null,"bundles",{"$f":"(Zeit_VT+B138)*Sysk_BLKW/Bün_MW_T","v":4.3671035387155639},{"$f":"(Zeit_HT+B138)*Sysk_BLKW/Bün_MW_T","v":4.6317764804559003},{"$f":"(Zeit_GT+B138)*Sysk_RLKW/Bün_MW_T","v":5.1709250654825141}]
["Time - direct transport [h]",{"$f":"'2b Environment'!D9/'Contribution margin'!B119","v":0.84444444444444444}]
["Time - pre-transport [h]",{"$f":"'2b Environment'!D10/B120","v":0.48}]
["Time - main transport [h]",{"$f":"'2b Environment'!D11/B121","v":0.6}]
[]
["system costs/h"]
["logs",{"$f":"'2ce Transporting'!B13","v":80}]
["residues",{"$f":"'2ce Transporting'!B24","v":65}]
["bundles",{"$f":"'2ce Transporting'!B35","v":80}]
["logs & residues",{"$f":"'2ce Transporting'!B46","v":65}]
["chips",{"$f":"'2ce Transporting'!B57","v":67}]
[]
["Loading time"]
["logs",{"$f":"'2ce Transporting'!B16","v":1.5}]
["residues",{"$f":"'2ce Transporting'!B27","v":0.7}]
["bundles",{"$f":"'2ce Transporting'!B38","v":1.5}]
["logs & residues",{"$f":"'2ce Transporting'!B49","v":0.7}]
["chips",{"$f":"'2ce Transporting'!B60","v":0.9}]

{"sheet":"Employment","index":17,"n_rows":88,"n_cols":24,"rows_kept":88,"cut":false,"hidden":true,"merged":[]}
[null,"Operators","Productivity",null,"Employment rate"]
[null,"Number of","MWh/h",null,"h/MWh"]
["Chain Saw - Felling",1,{"$f":"'2ca Felling and processing'!$C$13*'Energy content'!$D$123","v":5.6508818296482541},null,{"$f":"B3/C3","v":0.17696353067468873},null,null,0,0]
["Chain Saw - Felling and Delimbing",1,{"$f":"'2ca Felling and processing'!$C$16*'Energy content'!$D$123","v":3.7672545530988359},null,0.26544529601203309,null,null,0.1,0.2]
["Chain Saw - Felling and Processing",1,{"$f":"'2ca Felling and processing'!$C$19*'Energy content'!$D$123","v":2.8254409148241271},null,0.35392706134937746,null,null,0.2,0.4]
["Harvester",1,{"$f":"'2ca Felling and processing'!$C$39*'Energy content'!$D$123","v":16.387557305979936},null,6.1021907129203017E-2,null,null,0.3,0.6]
["Feller buncher",1,{"$f":"'2ca Felling and processing'!$C$29*'Energy content'!$D$123","v":10.925038203986624},null,9.1532860693804521E-2,null,null,0.4,0.8]
["Processor",1,{"$f":"'2ca Felling and processing'!$C$49*'Energy content'!$D$123","v":18.836272765494179},null,5.308905920240662E-2,null,null,0.5,1]
["Forwarder - logs",1,{"$f":"'2cb Extracting'!$C$14*'Energy content'!$D$123","v":20.154811859078769},null,4.961594317981928E-2,null,null,0.6,1]
["Forwarder - residues",1,{"$f":"'2cb Extracting'!$C$17*'Energy content'!$D$123","v":5.6508818296482541},null,0.17696353067468873,null,null,0.7,1]
["Forwarder - trees",1,{"$f":"'2cb Extracting'!$C$20*'Energy content'!$D$123","v":10.359950021021799},null,9.6525562186193861E-2,null,null,0.8,1]
["Skidder - TL",1.5,{"$f":"'2cb Extracting'!$C$30*'Energy content'!$D$123","v":16.952645488944761},null,8.8481765337344379E-2,null,null,0.9,1]
["Skidder - WT",1.5,{"$f":"'2cb Extracting'!$C$33*'Energy content'!$D$123","v":18.836272765494179},null,7.9633588803609934E-2,null,null,1,1]
["Tower yarder - TL",2,{"$f":"'2cb Extracting'!$C$46*'Energy content'!$D$123","v":11.301763659296508},null,0.17696353067468873,null,null,1.1000000000000001,1]
["Tower yarder - WT",2,{"$f":"'2cb Extracting'!$C$49*'Energy content'!$D$123","v":11.301763659296508},null,0.17696353067468873,null,null,1.2,1]
["Shuttle",1,{"$f":"'2cb Extracting'!$C$59*'Energy content'!$D$123","v":32.21002642899505},null,3.1046233451699774E-2,null,null,1.3,1]
["Bundler",1,{"$f":"'2cc Bundling'!$C$13*'Energy content'!$D$123","v":9.2297736550921492},null,0.10834501878042166,null,null,1.4,1]
["Tractor & chipper - logs",1,{"$f":"'2cd Chipping'!$C$14*'Energy content'!$D$121","v":50.481211011524401},null,1.9809350448659186E-2,null,null,1.5,1]
["Tractor & chipper - residues",1,{"$f":"'2cd Chipping'!$C$17*'Energy content'!$D$121","v":19.589723676113948},null,5.1047172310006363E-2]
["Tractor & chipper - bundles",1,{"$f":"'2cd Chipping'!$C$20*'Energy content'!$D$121","v":40.686349173467427},null,2.4578268149262325E-2]
["Tractor & chipper - trees",1,{"$f":"'2cd Chipping'!$C$23*'Energy content'!$D$121","v":21.850076407973248},null,4.5766430346902261E-2]
["Chippertruck - logs",1,{"$f":"'2cd Chipping'!$C$33*'Energy content'!$D$121","v":100.9624220230488},null,9.904675224329593E-3]
["Chippertruck - residues",1,{"$f":"'2cd Chipping'!$C$36*'Energy content'!$D$121","v":39.179447352227896},null,2.5523586155003181E-2]
["Chippertruck - bundles",1,{"$f":"'2cd Chipping'!$C$39*'Energy content'!$D$121","v":81.372698346934854},null,1.2289134074631163E-2]
["Chippertruck - trees",1,{"$f":"'2cd Chipping'!$C$42*'Energy content'!$D$121","v":64.04332740268022},null,1.5614429177178415E-2]
["Mobile chipper",1,{"$f":"'2cd Chipping'!$C$52*'Energy content'!$D$121","v":12.808665480536042},null,7.8072145885892091E-2]
[]
[]
["Pre-transport - logs",null,null,null,{"$f":"1/(RH_MW_T/(Zeit_VT+RH_LADE))","v":4.7788190185691942E-2}]
["Pre-transport - residues",null,null,null,{"$f":"1/(SA_MW_T/(Zeit_VT+SA_LADE))","v":7.2077798154749018E-2}]
["Pre-transport - bundles",null,null,null,{"$f":"1/(Bün_MW_T/(Zeit_VT+Bün_LADE))","v":5.458879423394454E-2}]
["Pre-transport - trees",null,null,null,{"$f":"1/('Contribution margin'!G115/(Zeit_VT+'Contribution margin'!B139))","v":7.1549828362390711E-2}]
["Main transport - chips",null,null,null,{"$f":"1/(HG_MW_T/(Zeit_HT+SG_LADE))","v":2.2381013986184653E-2}]
["Direct transport - logs",null,null,null,{"$f":"1/(RH_MW_T/(Zeit_GT+RH_LADE))","v":5.658422070247475E-2}]
["Direct transport - residues",null,null,null,{"$f":"1/(SA_MW_T/(Zeit_GT+SA_LADE))","v":9.433911434566962E-2}]
["Direct transport - bundles",null,null,null,{"$f":"1/(Bün_MW_T/(Zeit_GT+Bün_LADE))","v":6.4636563318531418E-2}]
["Direct transport - trees",null,null,null,{"$f":"1/('Contribution margin'!G120/(Zeit_GT+'Contribution margin'!B144))","v":0.11188949174229851}]
["Direct transport - chips",null,null,null,{"$f":"1/(HG_MW_T/(Zeit_GT+SG_LADE))","v":2.6028290339488818E-2}]
[]
[null,null,null,null,null,null,null,null,"Chain Saw","Feller buncher","Harvester","Processor","Forwarder","Skidder","Tower Yarder","Shuttle","Bundler","Tractor & Chipper","Chippertruck","Mobile chipper","Pre-transport","Main-transport","Direct transport","SUM"]
[1,"Chain Saw",null,"Forwarder",null,"CTL","Logs","Forest road",{"$f":"$E$5","v":0.35392706134937746},null,null,null,{"$f":"$E$9","v":4.961594317981928E-2},null,null,null,null,null,{"$f":"$E$22","v":9.904675224329593E-3},null,null,null,{"$f":"$E$38","v":2.6028290339488818E-2},{"$f":"SUM(I41:W41)","v":0.43947597009301514}]
[2,"Chain Saw",null,"Forwarder",null,"CTL","Logs","Terminal",{"$f":"$E$5","v":0.35392706134937746},null,null,null,{"$f":"$E$9","v":4.961594317981928E-2},null,null,null,null,null,{"$f":"$E$22","v":9.904675224329593E-3},null,{"$f":"$E$29","v":4.7788190185691942E-2},{"$f":"$E$33","v":2.2381013986184653E-2},null,{"$f":"SUM(I42:W42)","v":0.48361688392540292}]
[3,"Chain Saw",null,"Forwarder",null,"CTL","Logs","Plant",0.35392706134937746,null,null,null,4.961594317981928E-2,null,null,null,null,null,9.904675224329593E-3,null,null,null,{"$f":"$E$34","v":5.658422070247475E-2},0.47003190045600107]
[4,"Chain Saw",null,"Forwarder",null,"CTL","Residues","Forest road",{"$f":"$E$5*'2b Environment'!$D$23","v":3.5392706134937744E-2},null,null,null,{"$f":"$E$10","v":0.17696353067468873},null,null,null,null,null,{"$f":"$E$23","v":2.5523586155003181E-2},null,null,null,{"$f":"$E$38","v":2.6028290339488818E-2},0.26390811330411851]
[5,"Chain Saw",null,"Forwarder",null,"CTL","Residues","Terminal",{"$f":"$E$5*'2b Environment'!$D$23","v":3.5392706134937744E-2},null,null,null,{"$f":"$E$10","v":0.17696353067468873},null,null,null,null,null,{"$f":"$E$23","v":2.5523586155003181E-2},null,{"$f":"$E$30","v":7.2077798154749018E-2},{"$f":"$E$33","v":2.2381013986184653E-2},null,0.33233863510556333]
[6,"Chain Saw",null,"Forwarder","Bundler","CTL","Residues","Terminal",{"$f":"$E$5*'2b Environment'!$D$23","v":3.5392706134937744E-2},null,null,null,0.17696353067468873,null,null,null,{"$f":"$E$17","v":0.10834501878042166},null,{"$f":"$E$24","v":1.2289134074631163E-2},null,{"$f":"$E$31","v":5.458879423394454E-2},2.2381013986184653E-2,null,0.40996019788480847]
[7,"Chain Saw",null,"Forwarder",null,"CTL","Residues","Plant",{"$f":"$E$5*'2b Environment'!$D$23","v":3.5392706134937744E-2},null,null,null,0.17696353067468873,null,null,null,null,null,{"$f":"$E$23","v":2.5523586155003181E-2},null,null,null,{"$f":"$E$35","v":9.433911434566962E-2},0.33221893731029928]
[8,"Chain Saw",null,"Forwarder","Bundler","CTL","Residues","Plant",{"$f":"$E$5*'2b Environment'!$D$23","v":3.5392706134937744E-2},null,null,null,0.17696353067468873,null,null,null,{"$f":"$E$17","v":0.10834501878042166},null,{"$f":"$E$24","v":1.2289134074631163E-2},null,null,null,{"$f":"$E$36","v":6.4636563318531418E-2},0.39762695298321071]
[9,"Chain Saw",null,"Forwarder",null,"CTL","Logs & residues","Forest road",{"$f":"$E$3","v":0.17696353067468873},null,null,null,{"$f":"$E$11","v":9.6525562186193861E-2},null,null,null,null,null,{"$f":"$E$25","v":1.5614429177178415E-2},null,null,null,{"$f":"$E$38","v":2.6028290339488818E-2},0.31513181237754984]
[10,"Chain Saw",null,"Forwarder",null,"CTL","Logs & residues","Terminal",{"$f":"$E$3","v":0.17696353067468873},null,null,null,{"$f":"$E$11","v":9.6525562186193861E-2},null,null,null,null,null,{"$f":"$E$25","v":1.5614429177178415E-2},null,{"$f":"$E$32","v":7.1549828362390711E-2},{"$f":"$E$33","v":2.2381013986184653E-2},null,0.38303436438663635]
[11,"Chain Saw",null,"Forwarder",null,"CTL","Logs & residues","Plant",0.17696353067468873,null,null,null,9.6525562186193861E-2,null,null,null,null,null,1.5614429177178415E-2,null,null,null,{"$f":"$E$37","v":0.11188949174229851},0.40099301378035951]
[12,"Harvester",null,"Forwarder",null,"CTL","Logs","Forest road",null,null,{"$f":"$E$6","v":6.1021907129203017E-2},null,{"$f":"$E$9","v":4.961594317981928E-2},null,null,null,null,null,{"$f":"$E$22","v":9.904675224329593E-3},null,null,null,{"$f":"$E$38","v":2.6028290339488818E-2},0.14657081587284071]
[13,"Harvester",null,"Forwarder",null,"CTL","Logs","Terminal",null,null,{"$f":"$E$6","v":6.1021907129203017E-2},null,{"$f":"$E$9","v":4.961594317981928E-2},null,null,null,null,null,9.904675224329593E-3,null,{"$f":"$E$29","v":4.7788190185691942E-2},{"$f":"$E$33","v":2.2381013986184653E-2},null,0.19071172970522848]
[14,"Harvester",null,"Forwarder",null,"CTL","Logs","Plant",null,null,6.1021907129203017E-2,null,4.961594317981928E-2,null,null,null,null,null,9.904675224329593E-3,null,null,null,{"$f":"$E$34","v":5.658422070247475E-2},0.17712674623582664]
[15,"Harvester",null,"Forwarder",null,"CTL","Residues","Forest road",null,null,{"$f":"$E$6*'2b Environment'!$D$23","v":6.1021907129203022E-3},null,{"$f":"$E$10","v":0.17696353067468873},null,null,null,null,null,{"$f":"$E$23","v":2.5523586155003181E-2},null,null,null,{"$f":"$E$38","v":2.6028290339488818E-2},0.23461759788210104]
[16,"Harvester",null,"Forwarder",null,"CTL","Residues","Terminal",null,null,{"$f":"$E$6*'2b Environment'!$D$23","v":6.1021907129203022E-3},null,0.17696353067468873,null,null,null,null,null,{"$f":"$E$23","v":2.5523586155003181E-2},null,{"$f":"$E$30","v":7.2077798154749018E-2},{"$f":"$E$33","v":2.2381013986184653E-2},null,0.30304811968354589]
[17,"Harvester",null,"Forwarder","Bundler","CTL","Residues","Terminal",null,null,{"$f":"$E$6*'2b Environment'!$D$23","v":6.1021907129203022E-3},null,0.17696353067468873,null,null,null,{"$f":"$E$17","v":0.10834501878042166},null,{"$f":"$E$24","v":1.2289134074631163E-2},null,{"$f":"$E$31","v":5.458879423394454E-2},2.2381013986184653E-2,null,0.38066968246279104]
[18,"Harvester",null,"Forwarder",null,"CTL","Residues","Plant",null,null,{"$f":"$E$6*'2b Environment'!$D$23","v":6.1021907129203022E-3},null,0.17696353067468873,null,null,null,null,null,{"$f":"$E$23","v":2.5523586155003181E-2},null,null,null,{"$f":"$E$35","v":9.433911434566962E-2},0.30292842188828184]
[19,"Harvester",null,"Forwarder","Bundler","CTL","Residues","Plant",null,null,{"$f":"$E$6*'2b Environment'!$D$23","v":6.1021907129203022E-3},null,0.17696353067468873,null,null,null,{"$f":"$E$17","v":0.10834501878042166},null,{"$f":"$E$24","v":1.2289134074631163E-2},null,null,null,{"$f":"$E$36","v":6.4636563318531418E-2},0.36833643756119328]
[20,"Harvester",null,"Forwarder",null,"CTL","Logs & residues","Forest road",null,null,6.1021907129203017E-2,null,{"$f":"$E$11","v":9.6525562186193861E-2},null,null,null,null,null,{"$f":"$E$25","v":1.5614429177178415E-2},null,null,null,{"$f":"$E$38","v":2.6028290339488818E-2},0.1991901888320641]
[21,"Harvester",null,"Forwarder",null,"CTL","Logs & residues","Terminal",null,null,6.1021907129203017E-2,null,9.6525562186193861E-2,null,null,null,null,null,1.5614429177178415E-2,null,{"$f":"$E$32","v":7.1549828362390711E-2},{"$f":"$E$33","v":2.2381013986184653E-2},null,0.26709274084115064]
[22,"Harvester",null,"Forwarder",null,"CTL","Logs & residues","Plant",null,null,6.1021907129203017E-2,null,9.6525562186193861E-2,null,null,null,null,null,1.5614429177178415E-2,null,null,null,{"$f":"$E$37","v":0.11188949174229851},0.2850513902348738]
[23,"Chain Saw",null,"Tower Yarder",null,"TL","Logs","Forest road",{"$f":"$E$4","v":0.26544529601203309},null,null,null,null,null,{"$f":"$E$14","v":0.17696353067468873},null,null,null,{"$f":"$E$22","v":9.904675224329593E-3},null,null,null,{"$f":"$E$38","v":2.6028290339488818E-2},0.47834179225054024]
[24,"Chain Saw",null,"Tower Yarder",null,"TL","Logs","Terminal",{"$f":"$E$4","v":0.26544529601203309},null,null,null,null,null,{"$f":"$E$14","v":0.17696353067468873},null,null,null,9.904675224329593E-3,null,{"$f":"$E$29","v":4.7788190185691942E-2},{"$f":"$E$33","v":2.2381013986184653E-2},null,0.52248270608292802]
[25,"Chain Saw",null,"Tower Yarder",null,"TL","Logs","Plant",0.26544529601203309,null,null,null,null,null,0.17696353067468873,null,null,null,9.904675224329593E-3,null,null,null,{"$f":"$E$34","v":5.658422070247475E-2},0.50889772261352617]
[26,"Chain Saw","Processor","Tower Yarder",null,"WT","Residues","Forest road",{"$f":"$E$3*'2b Environment'!$D$23","v":1.7696353067468872E-2},null,null,{"$f":"$E$8*'2b Environment'!$D$23","v":5.3089059202406624E-3},null,null,{"$f":"$E$15*'2b Environment'!$D$23","v":1.7696353067468872E-2},null,null,null,{"$f":"$E$23","v":2.5523586155003181E-2},null,null,null,{"$f":"$E$38","v":2.6028290339488818E-2},9.2253488549670401E-2]
[27,"Chain Saw","Processor","Tower Yarder",null,"WT","Residues","Terminal",{"$f":"$E$3*'2b Environment'!$D$23","v":1.7696353067468872E-2},null,null,{"$f":"$E$8*'2b Environment'!$D$23","v":5.3089059202406624E-3},null,null,{"$f":"$E$15*'2b Environment'!$D$23","v":1.7696353067468872E-2},null,null,null,{"$f":"$E$23","v":2.5523586155003181E-2},null,{"$f":"$E$30","v":7.2077798154749018E-2},{"$f":"$E$33","v":2.2381013986184653E-2},null,0.16068401035111524]
[28,"Chain Saw","Processor","Tower Yarder","Bundler","WT","Residues","Terminal",{"$f":"$E$3*'2b Environment'!$D$23","v":1.7696353067468872E-2},null,null,{"$f":"$E$8*'2b Environment'!$D$23","v":5.3089059202406624E-3},null,null,{"$f":"$E$15*'2b Environment'!$D$23","v":1.7696353067468872E-2},null,{"$f":"$E$17","v":0.10834501878042166},null,{"$f":"$E$24","v":1.2289134074631163E-2},null,{"$f":"$E$31","v":5.458879423394454E-2},2.2381013986184653E-2,null,0.23830557313036038]
[29,"Chain Saw","Processor","Tower Yarder",null,"WT","Residues","Plant",{"$f":"$E$3*'2b Environment'!$D$23","v":1.7696353067468872E-2},null,null,{"$f":"$E$8*'2b Environment'!$D$23","v":5.3089059202406624E-3},null,null,{"$f":"$E$15*'2b Environment'!$D$23","v":1.7696353067468872E-2},null,null,null,{"$f":"$E$23","v":2.5523586155003181E-2},null,null,null,{"$f":"$E$35","v":9.433911434566962E-2},0.16056431255585119]
[30,"Chain Saw","Processor","Tower Yarder","Bundler","WT","Residues","Plant",{"$f":"$E$3*'2b Environment'!$D$23","v":1.7696353067468872E-2},null,null,{"$f":"$E$8*'2b Environment'!$D$23","v":5.3089059202406624E-3},null,null,{"$f":"$E$15*'2b Environment'!$D$23","v":1.7696353067468872E-2},null,{"$f":"$E$17","v":0.10834501878042166},null,{"$f":"$E$24","v":1.2289134074631163E-2},null,null,null,{"$f":"$E$36","v":6.4636563318531418E-2},0.22597232822876262]
[31,"Chain Saw","Processor","Tower Yarder",null,"WT","Logs & residues","Forest road",{"$f":"$E$3","v":0.17696353067468873},null,null,{"$f":"$E$8","v":5.308905920240662E-2},null,null,{"$f":"$E$15","v":0.17696353067468873},null,null,null,{"$f":"$E$25","v":1.5614429177178415E-2},null,null,null,{"$f":"$E$38","v":2.6028290339488818E-2},0.4486588400684513]
[32,"Chain Saw","Processor","Tower Yarder",null,"WT","Logs & residues","Terminal",0.17696353067468873,null,null,5.308905920240662E-2,null,null,0.17696353067468873,null,null,null,1.5614429177178415E-2,null,{"$f":"$E$32","v":7.1549828362390711E-2},{"$f":"$E$33","v":2.2381013986184653E-2},null,0.51656139207753782]
[33,"Chain Saw","Processor","Tower Yarder",null,"WT","Logs & residues","Plant",0.17696353067468873,null,null,5.308905920240662E-2,null,null,0.17696353067468873,null,null,null,1.5614429177178415E-2,null,null,null,{"$f":"$E$37","v":0.11188949174229851},0.53452004147126098]
[34,"Chain Saw",null,"Skidder",null,"TL","Logs","Forest road",{"$f":"$E$4","v":0.26544529601203309},null,null,null,null,{"$f":"$E$12","v":8.8481765337344379E-2},null,null,null,null,{"$f":"$E$22","v":9.904675224329593E-3},null,null,null,{"$f":"$E$38","v":2.6028290339488818E-2},0.38986002691319588]
[35,"Chain Saw",null,"Skidder",null,"TL","Logs","Terminal",0.26544529601203309,null,null,null,null,{"$f":"$E$12","v":8.8481765337344379E-2},null,null,null,null,9.904675224329593E-3,null,{"$f":"$E$29","v":4.7788190185691942E-2},{"$f":"$E$33","v":2.2381013986184653E-2},null,0.4340009407455836]
[36,"Chain Saw",null,"Skidder",null,"TL","Logs","Plant",0.26544529601203309,null,null,null,null,8.8481765337344379E-2,null,null,null,null,9.904675224329593E-3,null,null,null,{"$f":"$E$34","v":5.658422070247475E-2},0.42041595727618181]
[37,"Chain Saw","Skidder","Processor",null,"WT","Residues","Forest road",{"$f":"$E$3*'2b Environment'!$D$23","v":1.7696353067468872E-2},null,null,{"$f":"$E$8*'2b Environment'!$D$23","v":5.3089059202406624E-3},null,{"$f":"$E$13*'2b Environment'!$D$23","v":7.9633588803609944E-3},null,null,null,null,{"$f":"$E$23","v":2.5523586155003181E-2},null,null,null,{"$f":"$E$38","v":2.6028290339488818E-2},8.2520494362562535E-2]
[38,"Chain Saw","Skidder","Processor",null,"WT","Residues","Terminal",{"$f":"$E$3*'2b Environment'!$D$23","v":1.7696353067468872E-2},null,null,{"$f":"$E$8*'2b Environment'!$D$23","v":5.3089059202406624E-3},null,{"$f":"$E$13*'2b Environment'!$D$23","v":7.9633588803609944E-3},null,null,null,null,{"$f":"$E$23","v":2.5523586155003181E-2},null,{"$f":"$E$30","v":7.2077798154749018E-2},{"$f":"$E$33","v":2.2381013986184653E-2},null,0.15095101616400736]
[39,"Chain Saw","Skidder","Processor","Bundler","WT","Residues","Terminal",{"$f":"$E$3*'2b Environment'!$D$23","v":1.7696353067468872E-2},null,null,{"$f":"$E$8*'2b Environment'!$D$23","v":5.3089059202406624E-3},null,{"$f":"$E$13*'2b Environment'!$D$23","v":7.9633588803609944E-3},null,null,{"$f":"$E$17","v":0.10834501878042166},null,{"$f":"$E$24","v":1.2289134074631163E-2},null,{"$f":"$E$31","v":5.458879423394454E-2},2.2381013986184653E-2,null,0.22857257894325256]
[40,"Chain Saw","Skidder","Processor",null,"WT","Residues","Plant",{"$f":"$E$3*'2b Environment'!$D$23","v":1.7696353067468872E-2},null,null,{"$f":"$E$8*'2b Environment'!$D$23","v":5.3089059202406624E-3},null,{"$f":"$E$13*'2b Environment'!$D$23","v":7.9633588803609944E-3},null,null,null,null,{"$f":"$E$23","v":2.5523586155003181E-2},null,null,null,{"$f":"$E$35","v":9.433911434566962E-2},0.15083131836874333]
[41,"Chain Saw","Skidder","Processor","Bundler","WT","Residues","Plant",{"$f":"$E$3*'2b Environment'!$D$23","v":1.7696353067468872E-2},null,null,{"$f":"$E$8*'2b Environment'!$D$23","v":5.3089059202406624E-3},null,{"$f":"$E$13*'2b Environment'!$D$23","v":7.9633588803609944E-3},null,null,{"$f":"$E$17","v":0.10834501878042166},null,{"$f":"$E$24","v":1.2289134074631163E-2},null,null,null,{"$f":"$E$36","v":6.4636563318531418E-2},0.2162393340416548]
[42,"Chain Saw","Skidder","Processor",null,"WT","Logs & residues","Forest road",{"$f":"$E$3","v":0.17696353067468873},null,null,{"$f":"$E$8","v":5.308905920240662E-2},null,{"$f":"$E$13","v":7.9633588803609934E-2},null,null,null,null,{"$f":"$E$25","v":1.5614429177178415E-2},null,null,null,{"$f":"$E$38","v":2.6028290339488818E-2},0.35132889819737251]
[43,"Chain Saw","Skidder","Processor",null,"WT","Logs & residues","Terminal",0.17696353067468873,null,null,5.308905920240662E-2,null,7.9633588803609934E-2,null,null,null,null,1.5614429177178415E-2,null,{"$f":"$E$32","v":7.1549828362390711E-2},{"$f":"$E$33","v":2.2381013986184653E-2},null,0.41923145020645902]
[44,"Chain Saw","Skidder","Processor",null,"WT","Logs & residues","Plant",0.17696353067468873,null,null,5.308905920240662E-2,null,7.9633588803609934E-2,null,null,null,null,1.5614429177178415E-2,null,null,null,{"$f":"$E$37","v":0.11188949174229851},0.43719009960018218]
[45,"Feller-buncher","Chipper","Shuttle",null,"CHIPS","Logs & residues","Stand",null,{"$f":"$E$7","v":9.1532860693804521E-2},null,null,null,null,null,{"$f":"E16","v":3.1046233451699774E-2},null,null,null,{"$f":"E26","v":7.8072145885892091E-2},null,null,{"$f":"$E$38","v":2.6028290339488818E-2},0.2266795303708852]
[46,"Feller-buncher",null,"Forwarder",null,"WT","Logs & residues","Forest road",null,{"$f":"$E$7","v":9.1532860693804521E-2},null,null,{"$f":"$E$11","v":9.6525562186193861E-2},null,null,null,null,null,{"$f":"$E$25","v":1.5614429177178415E-2},null,null,null,{"$f":"$E$38","v":2.6028290339488818E-2},0.22970114239666561]
[47,"Feller-buncher",null,"Forwarder",null,"WT","Logs & residues","Terminal",null,9.1532860693804521E-2,null,null,9.6525562186193861E-2,null,null,null,null,null,1.5614429177178415E-2,null,{"$f":"$E$32","v":7.1549828362390711E-2},{"$f":"$E$33","v":2.2381013986184653E-2},null,0.29760369440575218]
[48,"Feller-buncher",null,"Forwarder",null,"WT","Logs & residues","Plant",null,9.1532860693804521E-2,null,null,9.6525562186193861E-2,null,null,null,null,null,1.5614429177178415E-2,null,null,null,{"$f":"$E$37","v":0.11188949174229851},0.31556234379947534]

{"sheet":"Accidents","index":18,"n_rows":72,"n_cols":17,"rows_kept":72,"cut":false,"hidden":true,"merged":[]}
[]
[]
["Felling with chain saw",{"$f":"Q5","v":0.20421245421245424},{"$f":"B3","v":0.20421245421245424}]
["Felling and delimbing with chain saw",{"$f":"Q6","v":0.10645604395604395},{"$f":"B4","v":0.10645604395604395},null,null,null,null,null,null,null,"Felling with chain saw","Felling and delimbing with chain saw","Felling, delimbing and crosscutting with chain saw","Felling with feller buncher","Felling, delimbing and crosscutting with harvester"]
["Felling, delimbing and crosscutting with chain saw",{"$f":"Q7","v":4.1132478632478632E-2},{"$f":"B5","v":4.1132478632478632E-2},null,null,null,null,null,null,"Felling with chain saw",null,2,3,{"$f":"1/6","v":0.16666666666666666},{"$f":"1/7","v":0.14285714285714285},{"$f":"SUM(K5:O5)/COUNT(K5:O5)","v":1.3273809523809526},{"$f":"P5/$P$9","v":0.20421245421245424}]
["Felling, delimbing and crosscutting with harvester",{"$f":"Q9","v":1},{"$f":"B6","v":1},null,null,null,null,null,null,"Felling and delimbing with chain saw",{"$f":"1/2","v":0.5},null,2,{"$f":"1/7","v":0.14285714285714285},{"$f":"1/8","v":0.125},{"$f":"SUM(K6:O6)/COUNT(K6:O6)","v":0.6919642857142857},{"$f":"P6/$P$9","v":0.10645604395604395}]
["Felling with feller buncher",{"$f":"Q8","v":0.82692307692307687},{"$f":"B7","v":0.82692307692307687},null,null,null,null,null,null,"Felling, delimbing and crosscutting with chain saw",{"$f":"1/3","v":0.33333333333333331},0.5,null,{"$f":"1/8","v":0.125},{"$f":"1/9","v":0.1111111111111111},0.2673611111111111,4.1132478632478632E-2]
[null,null,null,null,null,null,null,null,null,"Felling with feller buncher",6,7,8,null,{"$f":"1/2","v":0.5},5.375,{"$f":"P8/$P$9","v":0.82692307692307687}]
["Extracting of logs with forwarder",{"$f":"P14","v":1},{"$f":"B9","v":1},null,null,null,null,null,null,"Felling, delimbing and crosscutting with harvester",7,8,9,2,null,6.5,{"$f":"P9/$P$9","v":1}]
["Extracting of residues with forwarder",{"$f":"P14","v":1},1]
["Extracting of logs & residues with forwarder",{"$f":"P14","v":1},1]
["Extracting of stems with skidder",{"$f":"P15","v":8.5714285714285715E-2},8.5714285714285715E-2]
["Extracting of trees with skidder",{"$f":"P15","v":8.5714285714285715E-2},8.5714285714285715E-2,null,null,null,null,null,null,null,"Forwarder","Skidder","Towe yarder","Shuttle"]
["Extracting of stems with tower yarder",{"$f":"P16","v":8.5714285714285715E-2},8.5714285714285715E-2,null,null,null,null,null,null,"Forwarder",null,7,7,1,{"$f":"SUM(K14:N14)/COUNT(K14:N14)","v":5},{"$f":"O14/$O$14","v":1}]
["Extracting of trees with tower yarder",{"$f":"P16","v":8.5714285714285715E-2},8.5714285714285715E-2,null,null,null,null,null,null,"Skidder",{"$f":"1/7","v":0.14285714285714285},null,1,{"$f":"1/7","v":0.14285714285714285},{"$f":"SUM(K15:N15)/COUNT(K15:N15)","v":0.42857142857142855},{"$f":"O15/$O$14","v":8.5714285714285715E-2}]
["Extracting of chips with shuttle",{"$f":"P17","v":1},1,null,null,null,null,null,null,"Tower yarder",{"$f":"1/7","v":0.14285714285714285},1,null,{"$f":"1/7","v":0.14285714285714285},{"$f":"SUM(K16:N16)/COUNT(K16:N16)","v":0.42857142857142855},{"$f":"O16/$O$14","v":8.5714285714285715E-2}]
[null,null,null,null,null,null,null,null,null,"Shuttle",1,7,7,null,{"$f":"SUM(K17:N17)/COUNT(K17:N17)","v":5},{"$f":"O17/$O$14","v":1}]
[]
[]
[]
[]
[]
[]
[null,null,null,null,null,null,null,null,"Chain saw","Feller buncher","Harvester","Forwarder","Skidder","Tower yarder","Shuttle","SUM"]
[1,"Chain Saw",null,"Forwarder",null,"CTL","Logs","Forest road",{"$f":"$C$5","v":4.1132478632478632E-2},null,null,{"$f":"$C$9","v":1},null,null,null,{"$f":"SUM(I25:O25)/COUNT(I25:O25)","v":0.52056623931623935}]
[2,"Chain Saw",null,"Forwarder",null,"CTL","Logs","Terminal",4.1132478632478632E-2,null,null,{"$f":"$C$9","v":1},null,null,null,{"$f":"SUM(I26:O26)/COUNT(I26:O26)","v":0.52056623931623935}]
[3,"Chain Saw",null,"Forwarder",null,"CTL","Logs","Plant",4.1132478632478632E-2,null,null,{"$f":"$C$9","v":1},null,null,null,0.52056623931623935]
[4,"Chain Saw",null,"Forwarder",null,"CTL","Residues","Forest road",4.1132478632478632E-2,null,null,{"$f":"$C$10","v":1},null,null,null,0.52056623931623935]
[5,"Chain Saw",null,"Forwarder",null,"CTL","Residues","Terminal",4.1132478632478632E-2,null,null,{"$f":"$C$10","v":1},null,null,null,0.52056623931623935]
[6,"Chain Saw",null,"Forwarder","Bundler","CTL","Residues","Terminal",4.1132478632478632E-2,null,null,{"$f":"$C$10","v":1},null,null,null,0.52056623931623935]
[7,"Chain Saw",null,"Forwarder",null,"CTL","Residues","Plant",4.1132478632478632E-2,null,null,{"$f":"$C$10","v":1},null,null,null,0.52056623931623935]
[8,"Chain Saw",null,"Forwarder","Bundler","CTL","Residues","Plant",4.1132478632478632E-2,null,null,{"$f":"$C$10","v":1},null,null,null,0.52056623931623935]
[9,"Chain Saw",null,"Forwarder",null,"CTL","Logs & residues","Forest road",{"$f":"$C$3","v":0.20421245421245424},null,null,{"$f":"$C$11","v":1},null,null,null,0.60210622710622708]
[10,"Chain Saw",null,"Forwarder",null,"CTL","Logs & residues","Terminal",{"$f":"$C$3","v":0.20421245421245424},null,null,{"$f":"$C$11","v":1},null,null,null,0.60210622710622708]
[11,"Chain Saw",null,"Forwarder",null,"CTL","Logs & residues","Plant",{"$f":"$C$3","v":0.20421245421245424},null,null,{"$f":"$C$11","v":1},null,null,null,0.60210622710622708]
[12,"Harvester",null,"Forwarder",null,"CTL","Logs","Forest road",null,null,{"$f":"$C$6","v":1},{"$f":"$C$9","v":1},null,null,null,1]
[13,"Harvester",null,"Forwarder",null,"CTL","Logs","Terminal",null,null,1,{"$f":"$C$9","v":1},null,null,null,1]
[14,"Harvester",null,"Forwarder",null,"CTL","Logs","Plant",null,null,1,{"$f":"$C$9","v":1},null,null,null,1]
[15,"Harvester",null,"Forwarder",null,"CTL","Residues","Forest road",null,null,1,{"$f":"$C$10","v":1},null,null,null,1]
[16,"Harvester",null,"Forwarder",null,"CTL","Residues","Terminal",null,null,1,{"$f":"$C$10","v":1},null,null,null,1]
[17,"Harvester",null,"Forwarder","Bundler","CTL","Residues","Terminal",null,null,1,{"$f":"$C$10","v":1},null,null,null,1]
[18,"Harvester",null,"Forwarder",null,"CTL","Residues","Plant",null,null,1,{"$f":"$C$10","v":1},null,null,null,1]
[19,"Harvester",null,"Forwarder","Bundler","CTL","Residues","Plant",null,null,1,{"$f":"$C$10","v":1},null,null,null,1]
[20,"Harvester",null,"Forwarder",null,"CTL","Logs & residues","Forest road",null,null,1,{"$f":"$C$11","v":1},null,null,null,1]
[21,"Harvester",null,"Forwarder",null,"CTL","Logs & residues","Terminal",null,null,1,{"$f":"$C$11","v":1},null,null,null,1]
[22,"Harvester",null,"Forwarder",null,"CTL","Logs & residues","Plant",null,null,1,{"$f":"$C$11","v":1},null,null,null,1]
[23,"Chain Saw",null,"Tower Yarder",null,"TL","Logs","Forest road",{"$f":"$C$4","v":0.10645604395604395},null,null,null,null,{"$f":"$C$14","v":8.5714285714285715E-2},null,9.6085164835164827E-2]
[24,"Chain Saw",null,"Tower Yarder",null,"TL","Logs","Terminal",{"$f":"$C$4","v":0.10645604395604395},null,null,null,null,8.5714285714285715E-2,null,9.6085164835164827E-2]
[25,"Chain Saw",null,"Tower Yarder",null,"TL","Logs","Plant",{"$f":"$C$4","v":0.10645604395604395},null,null,null,null,8.5714285714285715E-2,null,9.6085164835164827E-2]
[26,"Chain Saw","Processor","Tower Yarder",null,"WT","Residues","Forest road",{"$f":"$C$3","v":0.20421245421245424},null,null,null,null,8.5714285714285715E-2,null,0.14496336996336998]
[27,"Chain Saw","Processor","Tower Yarder",null,"WT","Residues","Terminal",0.20421245421245424,null,null,null,null,8.5714285714285715E-2,null,0.14496336996336998]
[28,"Chain Saw","Processor","Tower Yarder","Bundler","WT","Residues","Terminal",0.20421245421245424,null,null,null,null,8.5714285714285715E-2,null,0.14496336996336998]
[29,"Chain Saw","Processor","Tower Yarder",null,"WT","Residues","Plant",0.20421245421245424,null,null,null,null,8.5714285714285715E-2,null,0.14496336996336998]
[30,"Chain Saw","Processor","Tower Yarder","Bundler","WT","Residues","Plant",0.20421245421245424,null,null,null,null,8.5714285714285715E-2,null,0.14496336996336998]
[31,"Chain Saw","Processor","Tower Yarder",null,"WT","Logs & residues","Forest road",0.20421245421245424,null,null,null,null,{"$f":"$C$15","v":8.5714285714285715E-2},null,0.14496336996336998]
[32,"Chain Saw","Processor","Tower Yarder",null,"WT","Logs & residues","Terminal",0.20421245421245424,null,null,null,null,{"$f":"$C$15","v":8.5714285714285715E-2},null,0.14496336996336998]
[33,"Chain Saw","Processor","Tower Yarder",null,"WT","Logs & residues","Plant",0.20421245421245424,null,null,null,null,{"$f":"$C$15","v":8.5714285714285715E-2},null,0.14496336996336998]
[34,"Chain Saw",null,"Skidder",null,"TL","Logs","Forest road",{"$f":"$C$4","v":0.10645604395604395},null,null,null,{"$f":"$C$12","v":8.5714285714285715E-2},null,null,9.6085164835164827E-2]
[35,"Chain Saw",null,"Skidder",null,"TL","Logs","Terminal",{"$f":"$C$4","v":0.10645604395604395},null,null,null,8.5714285714285715E-2,null,null,9.6085164835164827E-2]
[36,"Chain Saw",null,"Skidder",null,"TL","Logs","Plant",{"$f":"$C$4","v":0.10645604395604395},null,null,null,8.5714285714285715E-2,null,null,9.6085164835164827E-2]
[37,"Chain Saw","Skidder","Processor",null,"WT","Residues","Forest road",{"$f":"$C$3","v":0.20421245421245424},null,null,null,8.5714285714285715E-2,null,null,0.14496336996336998]
[38,"Chain Saw","Skidder","Processor",null,"WT","Residues","Terminal",0.20421245421245424,null,null,null,8.5714285714285715E-2,null,null,0.14496336996336998]
[39,"Chain Saw","Skidder","Processor","Bundler","WT","Residues","Terminal",0.20421245421245424,null,null,null,8.5714285714285715E-2,null,null,0.14496336996336998]
[40,"Chain Saw","Skidder","Processor",null,"WT","Residues","Plant",0.20421245421245424,null,null,null,8.5714285714285715E-2,null,null,0.14496336996336998]
[41,"Chain Saw","Skidder","Processor","Bundler","WT","Residues","Plant",0.20421245421245424,null,null,null,8.5714285714285715E-2,null,null,0.14496336996336998]
[42,"Chain Saw","Skidder","Processor",null,"WT","Logs & residues","Forest road",0.20421245421245424,null,null,null,{"$f":"$C$13","v":8.5714285714285715E-2},null,null,0.14496336996336998]
[43,"Chain Saw","Skidder","Processor",null,"WT","Logs & residues","Terminal",0.20421245421245424,null,null,null,{"$f":"$C$13","v":8.5714285714285715E-2},null,null,0.14496336996336998]
[44,"Chain Saw","Skidder","Processor",null,"WT","Logs & residues","Plant",0.20421245421245424,null,null,null,{"$f":"$C$13","v":8.5714285714285715E-2},null,null,0.14496336996336998]
[45,"Feller-buncher","Chipper","Shuttle",null,"CHIPS","Logs & residues","Stand",null,{"$f":"$C$7","v":0.82692307692307687},null,null,null,null,{"$f":"C16","v":1},0.91346153846153844]
[46,"Feller-buncher",null,"Forwarder",null,"WT","Logs & residues","Forest road",null,{"$f":"$C$7","v":0.82692307692307687},null,{"$f":"$C$11","v":1},null,null,null,0.91346153846153844]
[47,"Feller-buncher",null,"Forwarder",null,"WT","Logs & residues","Terminal",null,{"$f":"$C$7","v":0.82692307692307687},null,{"$f":"$C$11","v":1},null,null,null,0.91346153846153844]
[48,"Feller-buncher",null,"Forwarder",null,"WT","Logs & residues","Plant",null,{"$f":"$C$7","v":0.82692307692307687},null,{"$f":"$C$11","v":1},null,null,null,0.91346153846153844]

{"sheet":"3b Details A","index":19,"n_rows":68,"n_cols":13,"rows_kept":68,"cut":false,"hidden":true,"merged":[[48,2,48,12],[4,2,5,12],[3,1,3,12]]}
[]
[null,"(3b) Detailed analysis A"]
[]
[null,"The detailed analysis shows the utility values ​​and their ranking for different supply chain options. Graphs and tables give a better understanding of the calculation and show the composition of utility values ​​and the impacts on the evaluation criteria."]
[null,null,"Category A - Felling, (delimbing and crosscutting) with chain saw, extracting with forwarder"]
[]
[null,null,"Option 1","Option 2","Option 3","Option 4","Option 5","Option 6","Option 7","Option 8","Option 9","Option 10","Option 11"]
[null,null,{"$f":"C25","v":4},{"$f":"D25","v":3},1,11,10,9,8,6,7,5,2]
[null,"    Working method","Cut-to-length","Cut-to-length","Cut-to-length","Cut-to-length","Cut-to-length","Cut-to-length","Cut-to-length","Cut-to-length","Whole-tree","Whole-tree","Whole-tree"]
[null,"    Bundling","no","no","no","no","no","yes","no","yes","no","no","no"]
[null,"    Kind of energy wood","Logs","Logs","Logs","Residues","Residues","Residues","Residues","Residues","Logs & residues","Logs & residues","Logs & residues"]
[null,"    Chipping location","Forest road","Terminal","Plant","Forest road","Terminal","Terminal","Plant","Plant","Forest road","Terminal","Plant"]
[null,"    Nutrient loss",{"$f":"'Supply chains'!$AO$4","v":4.2499999999999996E-2},{"$f":"'Supply chains'!$AO$5","v":4.2499999999999996E-2},{"$f":"'Supply chains'!$AO$6","v":4.2499999999999996E-2},{"$f":"'Supply chains'!$AO$7","v":2.1666666666666667E-2},{"$f":"'Supply chains'!$AO$8","v":2.1666666666666667E-2},{"$f":"'Supply chains'!$AO$9","v":2.1666666666666667E-2},{"$f":"'Supply chains'!$AO$10","v":2.1666666666666667E-2},{"$f":"'Supply chains'!$AO$11","v":2.1666666666666667E-2},{"$f":"'Supply chains'!$AO$12","v":2.1666666666666667E-2},{"$f":"'Supply chains'!$AO$13","v":2.1666666666666667E-2},{"$f":"'Supply chains'!$AO$14","v":2.1666666666666667E-2}]
[null,"    Bearing pressure",{"$f":"'Supply chains'!$AP$4","v":3.3333333333333333E-2},{"$f":"'Supply chains'!$AP$5","v":3.3333333333333333E-2},{"$f":"'Supply chains'!$AP$6","v":3.3333333333333333E-2},{"$f":"'Supply chains'!$AP$7","v":3.3333333333333333E-2},{"$f":"'Supply chains'!$AP$8","v":3.3333333333333333E-2},{"$f":"'Supply chains'!$AP$9","v":3.3333333333333333E-2},{"$f":"'Supply chains'!$AP$10","v":3.3333333333333333E-2},{"$f":"'Supply chains'!$AP$11","v":3.3333333333333333E-2},{"$f":"'Supply chains'!$AP$12","v":3.3333333333333333E-2},{"$f":"'Supply chains'!$AP$13","v":3.3333333333333333E-2},{"$f":"'Supply chains'!$AP$14","v":3.3333333333333333E-2}]
[null,"    Energy efficiency",{"$f":"'Supply chains'!$AW$4","v":8.3333333333333329E-2},{"$f":"'Supply chains'!$AW$5","v":8.3333333333333329E-2},{"$f":"'Supply chains'!$AW$6","v":8.3333333333333329E-2},{"$f":"'Supply chains'!$AW$7","v":4.3447989733121258E-2},{"$f":"'Supply chains'!$AW$8","v":3.9878307154514188E-2},{"$f":"'Supply chains'!$AW$9","v":2.0831142589367507E-2},{"$f":"'Supply chains'!$AW$10","v":3.4873925989550782E-2},{"$f":"'Supply chains'!$AW$11","v":1.9013486045725114E-2},{"$f":"'Supply chains'!$AW$12","v":7.4917189419043795E-2},{"$f":"'Supply chains'!$AW$13","v":7.1386284282813323E-2},{"$f":"'Supply chains'!$AW$14","v":6.6465920909665882E-2}]
[null,"    Damage on remaining stand",{"$f":"'Supply chains'!$AR$4","v":6.5833333333333327E-2},{"$f":"'Supply chains'!$AR$5","v":6.5833333333333327E-2},{"$f":"'Supply chains'!$AR$6","v":6.5833333333333327E-2},{"$f":"'Supply chains'!$AR$7","v":8.3333333333333329E-2},{"$f":"'Supply chains'!$AR$8","v":8.3333333333333329E-2},{"$f":"'Supply chains'!$AR$9","v":8.3333333333333329E-2},{"$f":"'Supply chains'!$AR$10","v":8.3333333333333329E-2},{"$f":"'Supply chains'!$AR$11","v":8.3333333333333329E-2},{"$f":"'Supply chains'!$AR$12","v":6.5833333333333327E-2},{"$f":"'Supply chains'!$AR$13","v":6.5833333333333327E-2},{"$f":"'Supply chains'!$AR$14","v":6.5833333333333327E-2}]
[null," SUM ECOLOGY",{"$f":"SUM(C13:C16)","v":0.22500000000000001},0.22500000000000001,0.22500000000000001,0.18178132306645459,0.17821164048784752,0.15916447592270083,0.17320725932288411,0.15734681937905842,0.19575052275237712,0.19221961761614664,0.1872992542429992]
[null,"    Contribution margin",{"$f":"'Supply chains'!$AS$4","v":6.5156603575371924E-2},{"$f":"'Supply chains'!$AS$5","v":2.206194128157047E-2},{"$f":"'Supply chains'!$AS$6","v":4.1966251879936675E-2},{"$f":"'Supply chains'!$AS$7","v":4.8395659966953983E-2},{"$f":"'Supply chains'!$AS$8","v":0},{"$f":"'Supply chains'!$AS$9","v":0},{"$f":"'Supply chains'!$AS$10","v":3.5379176055509257E-5},{"$f":"'Supply chains'!$AS$11","v":0},{"$f":"'Supply chains'!$AS$12","v":7.741143322593208E-2},{"$f":"'Supply chains'!$AS$13","v":2.7419407359630256E-2},{"$f":"'Supply chains'!$AS$14","v":4.1217851762294172E-2}]
[null,"    Supply guarantee",{"$f":"'Supply chains'!$AT$4","v":4.9999999999999996E-2},{"$f":"'Supply chains'!$AT$5","v":9.9999999999999992E-2},{"$f":"'Supply chains'!$AT$6","v":0.16666666666666666},{"$f":"'Supply chains'!$AT$7","v":1.6666666666666666E-2},{"$f":"'Supply chains'!$AT$8","v":6.6666666666666666E-2},{"$f":"'Supply chains'!$AT$9","v":8.3333333333333329E-2},{"$f":"'Supply chains'!$AT$10","v":0.11666666666666665},{"$f":"'Supply chains'!$AT$11","v":0.15},{"$f":"'Supply chains'!$AT$12","v":3.3333333333333333E-2},{"$f":"'Supply chains'!$AT$13","v":8.3333333333333329E-2},{"$f":"'Supply chains'!$AT$14","v":0.13333333333333333}]
[null," SUM ECONOMY",{"$f":"SUM(C18:C19)","v":0.11515660357537191},0.12206194128157047,0.20863291854660332,6.5062326633620646E-2,6.6666666666666666E-2,8.3333333333333329E-2,0.11670204584272216,0.15,0.11074476655926541,0.11075274069296359,0.1745511850956275]
[null,"    Employment",{"$f":"'Supply chains'!$AU$4","v":0.14649199003100505},{"$f":"'Supply chains'!$AU$5","v":0.1612056279751343},{"$f":"'Supply chains'!$AU$6","v":0.15667730015200035},{"$f":"'Supply chains'!$AU$7","v":8.7969371101372831E-2},{"$f":"'Supply chains'!$AU$8","v":0.11077954503518778},{"$f":"'Supply chains'!$AU$9","v":0.13665339929493614},{"$f":"'Supply chains'!$AU$10","v":0.11073964577009976},{"$f":"'Supply chains'!$AU$11","v":0.13254231766107022},{"$f":"'Supply chains'!$AU$12","v":0.10504393745918328},{"$f":"'Supply chains'!$AU$13","v":0.12767812146221211},{"$f":"'Supply chains'!$AU$14","v":0.1336643379267865}]
[null,"    Working safety",{"$f":"'Supply chains'!$AV$4","v":8.6761039886039892E-2},{"$f":"'Supply chains'!$AV$5","v":8.6761039886039892E-2},{"$f":"'Supply chains'!$AV$6","v":8.6761039886039892E-2},{"$f":"'Supply chains'!$AV$7","v":8.6761039886039892E-2},{"$f":"'Supply chains'!$AV$8","v":8.6761039886039892E-2},{"$f":"'Supply chains'!$AV$9","v":8.6761039886039892E-2},{"$f":"'Supply chains'!$AV$10","v":8.6761039886039892E-2},{"$f":"'Supply chains'!$AV$11","v":8.6761039886039892E-2},{"$f":"'Supply chains'!$AV$12","v":0.10035103785103784},{"$f":"'Supply chains'!$AV$13","v":0.10035103785103784},{"$f":"'Supply chains'!$AV$14","v":0.10035103785103784}]
[null," SUM SOCIAL",{"$f":"SUM(C21:C22)","v":0.23325302991704494},0.24796666786117419,0.24343834003804024,0.17473041098741271,0.19754058492122767,0.22341443918097603,0.19750068565613965,0.21930335754711011,0.20539497531022111,0.22802915931324996,0.23401537577782433]
[null,"    UTILITY VALUE",{"$f":"C17+C20+C23","v":0.5734096334924168},0.59502860914274469,0.67707125858464356,0.42157406068748793,0.44241889207574187,0.46591224843701018,0.48740999082174591,0.52665017692616845,0.5118902646218636,0.53100151762236014,0.59586581511645109]
[null,"    RANK",{"$f":"RANK(C24,$C$24:$M$24,0)","v":4},3,1,11,10,9,8,6,7,5,2]
[]
[]
[]
[]
[]
[]
[]
[]
[]
[]
[]
[]
[]
[]
[]
[]
[]
[]
[]
[]
[]
[]
[]
[null,null,"A utility value of 0 indicates that the system is technically not applicable. These restrictions are determined by the entered site & stand specification data."]
[]
[null,"Trade-offs",{"$f":"C25","v":4},{"$f":"D25","v":3},1,11,10,9,8,6,7,5,2]
[null,null,"Option 1","Option 2","Option 3","Option 4","Option 5","Option 6","Option 7","Option 8","Option 9","Option 10","Option 11"]
[null,"   Nutrient loss [kg/ha]",{"$f":"Values!$K$3","v":640},{"$f":"Values!$K$4","v":640},{"$f":"Values!$K$5","v":640},{"$f":"Values!$K$6","v":960},{"$f":"Values!$K$7","v":960},{"$f":"Values!$K$8","v":960},{"$f":"Values!$K$9","v":960},{"$f":"Values!$K$10","v":960},{"$f":"Values!$K$11","v":960},{"$f":"Values!$K$12","v":960},{"$f":"Values!$K$13","v":960}]
[null,"   Bearing pressure [kPa]",{"$f":"Values!$L$3","v":300},{"$f":"Values!$L$4","v":300},{"$f":"Values!$L$5","v":300},{"$f":"Values!$L$6","v":300},{"$f":"Values!$L$7","v":300},{"$f":"Values!$L$8","v":300},{"$f":"Values!$L$9","v":300},{"$f":"Values!$L$10","v":300},{"$f":"Values!$L$11","v":300},{"$f":"Values!$L$12","v":300},{"$f":"Values!$L$13","v":300}]
[null,"   Emissions [kg CO2/m³ loose]",{"$f":"Values!$M$3","v":2.7861982852132576},{"$f":"Values!$M$4","v":2.8979215524577198},{"$f":"Values!$M$5","v":2.9520224431133464},{"$f":"Values!$M$6","v":6.5591676933272529},{"$f":"Values!$M$7","v":6.8049539810423552},{"$f":"Values!$M$8","v":8.1164240534858312},{"$f":"Values!$M$9","v":7.1495247493843648},{"$f":"Values!$M$10","v":8.2415766530139525},{"$f":"Values!$M$11","v":4.117013074926045},{"$f":"Values!$M$12","v":4.3601293875386125},{"$f":"Values!$M$13","v":4.6989152098251328}]
[null,"   Energy demand [KWh/m³ loose]",{"$f":"Values!$X$3","v":11.460594618516874},{"$f":"Values!$X$4","v":11.900716580388998},{"$f":"Values!$X$5","v":12.113841301153586},{"$f":"Values!$X$6","v":25.887611656541704},{"$f":"Values!$X$7","v":26.855860668752705},{"$f":"Values!$X$8","v":32.022257923833067},{"$f":"Values!$X$9","v":28.213260665251539},{"$f":"Values!$X$10","v":32.51528331591355},{"$f":"Values!$X$11","v":17.351832679001593},{"$f":"Values!$X$12","v":18.309563607475344},{"$f":"Values!$X$13","v":19.644174422543454}]
[null,"   Energy efficiency [%]",{"$f":"1-Values!$Y$3","v":0.98478919534506937},{"$f":"1-Values!$Y$4","v":0.98420505382281664},{"$f":"1-Values!$Y$5","v":0.98392218904986251},{"$f":"1-Values!$Y$6","v":0.9656412763039236},{"$f":"1-Values!$Y$7","v":0.96435619057562505},{"$f":"1-Values!$Y$8","v":0.95749921133217231},{"$f":"1-Values!$Y$9","v":0.96255461335623826},{"$f":"1-Values!$Y$10","v":0.95684485497646099},{"$f":"1-Values!$Y$11","v":0.97697018819085579},{"$f":"1-Values!$Y$12","v":0.97569906234181281},{"$f":"1-Values!$Y$13","v":0.97392773152747969}]
[null,"   Damage on remaining stand [%]",{"$f":"Values!$N$3","v":0.184},{"$f":"Values!$N$4","v":0.184},{"$f":"Values!$N$5","v":0.184},{"$f":"Values!$N$6","v":5.4399999999999997E-2},{"$f":"Values!$N$7","v":5.4399999999999997E-2},{"$f":"Values!$N$8","v":5.4399999999999997E-2},{"$f":"Values!$N$9","v":5.4399999999999997E-2},{"$f":"Values!$N$10","v":5.4399999999999997E-2},{"$f":"Values!$N$11","v":0.184},{"$f":"Values!$N$12","v":0.184},{"$f":"Values!$N$13","v":0.184}]
[null,"      Purchase [€/m³ loose]",{"$f":"Values!$O$3","v":0.45207054637186034},{"$f":"Values!$O$4","v":0.45207054637186034},{"$f":"Values!$O$5","v":0.45207054637186034},{"$f":"Values!$O$6","v":0.45207054637186034},{"$f":"Values!$O$7","v":0.45207054637186034},{"$f":"Values!$O$8","v":0.45207054637186034},{"$f":"Values!$O$9","v":0.45207054637186034},{"$f":"Values!$O$10","v":0.45207054637186034},{"$f":"Values!$O$11","v":0.45207054637186034},{"$f":"Values!$O$12","v":0.45207054637186034},{"$f":"Values!$O$13","v":0.45207054637186034}]
[null,"      Felling and delimbing [€/m³ loose]",{"$f":"Values!$P$3","v":9.8453333333333362},{"$f":"Values!$P$4","v":9.8453333333333362},{"$f":"Values!$P$5","v":9.8453333333333362},{"$f":"Values!$P$6","v":0.98453333333333359},{"$f":"Values!$P$7","v":0.98453333333333359},{"$f":"Values!$P$8","v":0.98453333333333359},{"$f":"Values!$P$9","v":0.98453333333333359},{"$f":"Values!$P$10","v":0.98453333333333359},{"$f":"Values!$P$11","v":4.9226666666666681},{"$f":"Values!$P$12","v":4.9226666666666681},{"$f":"Values!$P$13","v":4.9226666666666681}]
[null,"      Extracting [€/m³ loose]",{"$f":"Values!$Q$3","v":2.9936448598130845},{"$f":"Values!$Q$4","v":2.9936448598130845},{"$f":"Values!$Q$5","v":2.9936448598130845},{"$f":"Values!$Q$6","v":10.677333333333335},{"$f":"Values!$Q$7","v":10.677333333333335},{"$f":"Values!$Q$8","v":10.677333333333335},{"$f":"Values!$Q$9","v":10.677333333333335},{"$f":"Values!$Q$10","v":10.677333333333335},{"$f":"Values!$Q$11","v":5.8240000000000007},{"$f":"Values!$Q$12","v":5.8240000000000007},{"$f":"Values!$Q$13","v":5.8240000000000007}]
[null,"      Bundling [€/m³ loose]",{"$f":"Values!$R$3","v":0},{"$f":"Values!$R$4","v":0},{"$f":"Values!$R$5","v":0},{"$f":"Values!$R$6","v":0},{"$f":"Values!$R$7","v":0},{"$f":"Values!$R$8","v":10.187755102040818},{"$f":"Values!$R$9","v":0},{"$f":"Values!$R$10","v":10.187755102040818},{"$f":"Values!$R$11","v":0},{"$f":"Values!$R$12","v":0},{"$f":"Values!$R$13","v":0}]
[null,"      Chipping [€/m³ loose]",{"$f":"Values!$S$3","v":1.7074626865671643},{"$f":"Values!$S$4","v":1.7074626865671643},{"$f":"Values!$S$5","v":1.7074626865671643},{"$f":"Values!$S$6","v":4.4000000000000012},{"$f":"Values!$S$7","v":4.4000000000000012},{"$f":"Values!$S$8","v":2.1185185185185191},{"$f":"Values!$S$9","v":4.4000000000000012},{"$f":"Values!$S$10","v":2.1185185185185191},{"$f":"Values!$S$11","v":2.6917647058823531},{"$f":"Values!$S$12","v":2.6917647058823531},{"$f":"Values!$S$13","v":2.6917647058823531}]
[null,"      Transporting [€/m³ loose]",{"$f":"Values!$T$3","v":1.3139396168969573},{"$f":"Values!$T$4","v":4.0103051226708839},{"$f":"Values!$T$5","v":3.4106746091991589},{"$f":"Values!$T$6","v":1.3139396168969573},{"$f":"Values!$T$7","v":4.6597810622740896},{"$f":"Values!$T$8","v":4.4202188277045158},{"$f":"Values!$T$9","v":5.6863913288645698},{"$f":"Values!$T$10","v":3.89603819933438},{"$f":"Values!$T$11","v":1.3139396168969573},{"$f":"Values!$T$12","v":4.633924106420003},{"$f":"Values!$T$13","v":4.5863500463812015}]
[null,"      Storing [€/m³ loose]",{"$f":"Values!$U$3","v":0.4},{"$f":"Values!$U$4","v":1.6},{"$f":"Values!$U$5","v":0.4},{"$f":"Values!$U$6","v":0.4},{"$f":"Values!$U$7","v":1.6},{"$f":"Values!$U$8","v":1.6},{"$f":"Values!$U$9","v":0.4},{"$f":"Values!$U$10","v":0.4},{"$f":"Values!$U$11","v":0.4},{"$f":"Values!$U$12","v":1.6},{"$f":"Values!$U$13","v":0.4}]
[null,"   Supply costs [€/m³ loose]",{"$f":"SUM(C59:C65)","v":16.712451042982401},20.60881654875633,18.809186035284604,18.227876829935486,22.773718275312621,30.440429661302385,22.600328541903099,28.716249032932247,15.604441535817841,20.124426025340888,18.876851965302084]
[null,"   Contribution margin [€/m³ loose]",{"$f":"Values!$V$3","v":-1.6434328305870534},{"$f":"Values!$V$4","v":-5.5397983363609802},{"$f":"Values!$V$5","v":-3.7401678228892554},{"$f":"Values!$V$6","v":-3.1588586175401412},{"$f":"Values!$V$7","v":-7.7047000629172722},{"$f":"Values!$V$8","v":-15.371411448907031},{"$f":"Values!$V$9","v":-7.5313103295077521},{"$f":"Values!$V$10","v":-13.647230820536898},{"$f":"Values!$V$11","v":-0.53542332342249288},{"$f":"Values!$V$12","v":-5.0554078129455409},{"$f":"Values!$V$13","v":-3.8078337529067374}]
[null,"   Working hours [h/m³ loose]",{"$f":"Values!$W$3","v":0.33112356986208785},{"$f":"Values!$W$4","v":0.36438158158468908},{"$f":"Values!$W$5","v":0.3541459634189138},{"$f":"Values!$W$6","v":0.1988418082889328},{"$f":"Values!$W$7","v":0.25040084725441725},{"$f":"Values!$W$8","v":0.30888488441416895},{"$f":"Values!$W$9","v":0.25031066084157638},{"$f":"Values!$W$10","v":0.29959238981216352},{"$f":"Values!$W$11","v":0.23743635100112256},{"$f":"Values!$W$12","v":0.28859759064577489},{"$f":"Values!$W$13","v":0.30212855138497674}]

{"sheet":"3b Details B","index":20,"n_rows":68,"n_cols":13,"rows_kept":68,"cut":false,"hidden":true,"merged":[[3,1,3,12],[4,2,5,12],[48,2,48,12]]}
[]
[null,"(3b) Detailed analysis B"]
[]
[null,"The detailed analysis shows the utility values ​​and their ranking for different supply chain options. Graphs and tables give a better understanding of the calculation and show the composition of utility values ​​and the impacts on the evaluation criteria."]
[null,null,"Category B - Felling, delimbing and crosscutting with harvester, extracting with forwarder"]
[]
[null,null,"Option 1","Option 2","Option 3","Option 4","Option 5","Option 6","Option 7","Option 8","Option 9","Option 10","Option 11"]
[null,null,{"$f":"C25","v":4},{"$f":"D25","v":2},1,11,10,9,6,5,8,7,3]
[null,"    Working method","Cut-to-length","Cut-to-length","Cut-to-length","Cut-to-length","Cut-to-length","Cut-to-length","Cut-to-length","Cut-to-length","Cut-to-length","Cut-to-length","Cut-to-length"]
[null,"    Bundling","no","no","no","no","no","yes","no","yes","no","no","no"]
[null,"    Kind of energy wood","Logs","Logs","Logs","Residues","Residues","Residues","Residues","Residues","Logs & residues","Logs & residues","Logs & residues"]
[null,"    Chipping location","Forest road","Terminal","Plant","Forest road","Terminal","Terminal","Plant","Plant","Forest road","Terminal","Plant"]
[null,"    Nutrient loss",{"$f":"'Supply chains'!$AO$15","v":4.2499999999999996E-2},{"$f":"'Supply chains'!$AO$16","v":4.2499999999999996E-2},{"$f":"'Supply chains'!$AO$17","v":4.2499999999999996E-2},{"$f":"'Supply chains'!$AO$18","v":2.1666666666666667E-2},{"$f":"'Supply chains'!$AO$19","v":2.1666666666666667E-2},{"$f":"'Supply chains'!$AO$20","v":2.1666666666666667E-2},{"$f":"'Supply chains'!$AO$21","v":2.1666666666666667E-2},{"$f":"'Supply chains'!$AO$22","v":2.1666666666666667E-2},{"$f":"'Supply chains'!$AO$23","v":2.1666666666666667E-2},{"$f":"'Supply chains'!$AO$24","v":2.1666666666666667E-2},{"$f":"'Supply chains'!$AO$25","v":2.1666666666666667E-2}]
[null,"    Bearing pressure",{"$f":"'Supply chains'!$AP$15","v":3.3333333333333333E-2},{"$f":"'Supply chains'!$AP$16","v":3.3333333333333333E-2},{"$f":"'Supply chains'!$AP$17","v":3.3333333333333333E-2},{"$f":"'Supply chains'!$AP$18","v":3.3333333333333333E-2},{"$f":"'Supply chains'!$AP$19","v":3.3333333333333333E-2},{"$f":"'Supply chains'!$AP$20","v":3.3333333333333333E-2},{"$f":"'Supply chains'!$AP$21","v":3.3333333333333333E-2},{"$f":"'Supply chains'!$AP$22","v":3.3333333333333333E-2},{"$f":"'Supply chains'!$AP$23","v":3.3333333333333333E-2},{"$f":"'Supply chains'!$AP$24","v":3.3333333333333333E-2},{"$f":"'Supply chains'!$AP$25","v":3.3333333333333333E-2}]
[null,"    Energy efficiency",{"$f":"'Supply chains'!$AW$15","v":7.5705629719052064E-2},{"$f":"'Supply chains'!$AW$16","v":7.4083014379461201E-2},{"$f":"'Supply chains'!$AW$17","v":7.3297278899032897E-2},{"$f":"'Supply chains'!$AW$18","v":4.1354887331396098E-2},{"$f":"'Supply chains'!$AW$19","v":3.7785204752789028E-2},{"$f":"'Supply chains'!$AW$20","v":1.8738040187642326E-2},{"$f":"'Supply chains'!$AW$21","v":3.2780823587825622E-2},{"$f":"'Supply chains'!$AW$22","v":1.6920383643999934E-2},{"$f":"'Supply chains'!$AW$23","v":5.3986165401792033E-2},{"$f":"'Supply chains'!$AW$24","v":5.0455260265561554E-2},{"$f":"'Supply chains'!$AW$25","v":4.553489689241412E-2}]
[null,"    Damage on remaining stand",{"$f":"'Supply chains'!$AR$15","v":8.1833333333333313E-2},{"$f":"'Supply chains'!$AR$16","v":8.1833333333333313E-2},{"$f":"'Supply chains'!$AR$17","v":8.1833333333333313E-2},{"$f":"'Supply chains'!$AR$18","v":8.3333333333333329E-2},{"$f":"'Supply chains'!$AR$19","v":8.3333333333333329E-2},{"$f":"'Supply chains'!$AR$20","v":8.3333333333333329E-2},{"$f":"'Supply chains'!$AR$21","v":8.3333333333333329E-2},{"$f":"'Supply chains'!$AR$22","v":8.3333333333333329E-2},{"$f":"'Supply chains'!$AR$23","v":8.1833333333333313E-2},{"$f":"'Supply chains'!$AR$24","v":8.1833333333333313E-2},{"$f":"'Supply chains'!$AR$25","v":8.1833333333333313E-2}]
[null," SUM ECOLOGY",{"$f":"SUM(C13:C16)","v":0.23337229638571871},{"$f":"SUM(D13:D16)","v":0.23174968104612786},0.23096394556569955,0.17968822066472945,0.17611853808612238,0.15707137352097567,0.17111415692115894,0.15525371697733326,0.19081949873512535,0.18728859359889488,0.18236823022574744]
[null,"    Contribution margin",{"$f":"'Supply chains'!$AS$15","v":0.12010479688164824},{"$f":"'Supply chains'!$AS$16","v":7.7010134587846779E-2},{"$f":"'Supply chains'!$AS$17","v":9.6914445186212977E-2},{"$f":"'Supply chains'!$AS$18","v":5.3890479297581617E-2},{"$f":"'Supply chains'!$AS$19","v":3.6124697937523821E-3},{"$f":"'Supply chains'!$AS$20","v":0},{"$f":"'Supply chains'!$AS$21","v":5.5301985066831105E-3},{"$f":"'Supply chains'!$AS$22","v":0},{"$f":"'Supply chains'!$AS$23","v":7.7913846927962521E-2},{"$f":"'Supply chains'!$AS$24","v":2.7921821061660697E-2},{"$f":"'Supply chains'!$AS$25","v":4.172026546432462E-2}]
[null,"    Supply guarantee",{"$f":"'Supply chains'!$AT$15","v":4.9999999999999996E-2},{"$f":"'Supply chains'!$AT$16","v":9.9999999999999992E-2},{"$f":"'Supply chains'!$AT$17","v":0.16666666666666666},{"$f":"'Supply chains'!$AT$18","v":1.6666666666666666E-2},{"$f":"'Supply chains'!$AT$19","v":6.6666666666666666E-2},{"$f":"'Supply chains'!$AT$20","v":8.3333333333333329E-2},{"$f":"'Supply chains'!$AT$21","v":0.11666666666666665},{"$f":"'Supply chains'!$AT$22","v":0.15},{"$f":"'Supply chains'!$AT$23","v":3.3333333333333333E-2},{"$f":"'Supply chains'!$AT$24","v":8.3333333333333329E-2},{"$f":"'Supply chains'!$AT$25","v":0.13333333333333333}]
[null," SUM ECONOMY",{"$f":"SUM(C18:C19)","v":0.17010479688164823},0.17701013458784676,0.26358111185287963,7.055714596424828E-2,7.0279136460419042E-2,8.3333333333333329E-2,0.12219686517334977,0.15,0.11124718026129585,0.11125515439499403,0.17505359879765794]
[null,"    Employment",{"$f":"'Supply chains'!$AU$15","v":4.8856938624280234E-2},{"$f":"'Supply chains'!$AU$16","v":6.357057656840949E-2},{"$f":"'Supply chains'!$AU$17","v":5.9042248745275541E-2},{"$f":"'Supply chains'!$AU$18","v":7.8205865960700338E-2},{"$f":"'Supply chains'!$AU$19","v":0.1010160398945153},{"$f":"'Supply chains'!$AU$20","v":0.12688989415426366},{"$f":"'Supply chains'!$AU$21","v":0.10097614062942728},{"$f":"'Supply chains'!$AU$22","v":0.12277881252039775},{"$f":"'Supply chains'!$AU$23","v":6.6396729610688029E-2},{"$f":"'Supply chains'!$AU$24","v":8.9030913613716872E-2},{"$f":"'Supply chains'!$AU$25","v":9.5017130078291268E-2}]
[null,"    Working safety",{"$f":"'Supply chains'!$AV$15","v":0.16666666666666666},{"$f":"'Supply chains'!$AV$16","v":0.16666666666666666},{"$f":"'Supply chains'!$AV$17","v":0.16666666666666666},{"$f":"'Supply chains'!$AV$18","v":0.16666666666666666},{"$f":"'Supply chains'!$AV$19","v":0.16666666666666666},{"$f":"'Supply chains'!$AV$20","v":0.16666666666666666},{"$f":"'Supply chains'!$AV$21","v":0.16666666666666666},{"$f":"'Supply chains'!$AV$22","v":0.16666666666666666},{"$f":"'Supply chains'!$AV$23","v":0.16666666666666666},{"$f":"'Supply chains'!$AV$24","v":0.16666666666666666},{"$f":"'Supply chains'!$AV$25","v":0.16666666666666666}]
[null," SUM SOCIAL",{"$f":"SUM(C21:C22)","v":0.21552360529094688},0.23023724323507616,0.22570891541194221,0.244872532627367,0.26768270656118198,0.29355656082093029,0.26764280729609391,0.28944547918706443,0.23306339627735467,0.25569758028038353,0.2616837967449579]
[null,"    UTILITY VALUE",{"$f":"C17+C20+C23","v":0.61900069855831386},0.63899705886905078,0.72025397283052139,0.49511789925634475,0.51408038110772347,0.53396126767523922,0.56095382939060268,0.5946991961643977,0.53513007527377587,0.55424132827427242,0.61910562576836325]
[null,"    RANK",{"$f":"RANK(C24,$C$24:$M$24,0)","v":4},2,1,11,10,9,6,5,8,7,3]
[]
[]
[]
[]
[]
[]
[]
[]
[]
[]
[]
[]
[]
[]
[]
[]
[]
[]
[]
[]
[]
[]
[]
[null,null,"A utility value of 0 indicates that the system is technically not applicable. These restrictions are determined by the entered site & stand specification data."]
[]
[null,"Trade-offs",{"$f":"C25","v":4},{"$f":"D25","v":2},1,11,10,9,6,5,8,7,3]
[null,null,"Option 1","Option 2","Option 3","Option 4","Option 5","Option 6","Option 7","Option 8","Option 9","Option 10","Option 11"]
[null,"   Nutrient loss [kg/ha]",{"$f":"Values!$K$14","v":640},{"$f":"Values!$K$15","v":640},{"$f":"Values!$K$16","v":640},{"$f":"Values!$K$17","v":960},{"$f":"Values!$K$18","v":960},{"$f":"Values!$K$19","v":960},{"$f":"Values!$K$20","v":960},{"$f":"Values!$K$21","v":960},{"$f":"Values!$K$22","v":960},{"$f":"Values!$K$23","v":960},{"$f":"Values!$K$24","v":960}]
[null,"   Bearing pressure [kPa]",{"$f":"Values!$L$14","v":300},{"$f":"Values!$L$15","v":300},{"$f":"Values!$L$16","v":300},{"$f":"Values!$L$17","v":300},{"$f":"Values!$L$18","v":300},{"$f":"Values!$L$19","v":300},{"$f":"Values!$L$20","v":300},{"$f":"Values!$L$21","v":300},{"$f":"Values!$L$22","v":300},{"$f":"Values!$L$23","v":300},{"$f":"Values!$L$24","v":300}]
[null,"   Emissions [kg CO2/m³ loose]",{"$f":"Values!$M$14","v":4.350408859925901},{"$f":"Values!$M$15","v":4.4621321271703636},{"$f":"Values!$M$16","v":4.5162330178259902},{"$f":"Values!$M$17","v":6.715588750798517},{"$f":"Values!$M$18","v":6.9613750385136193},{"$f":"Values!$M$19","v":8.2728451109570944},{"$f":"Values!$M$20","v":7.3059458068556289},{"$f":"Values!$M$21","v":8.3979977104852175},{"$f":"Values!$M$22","v":5.8458769829720234},{"$f":"Values!$M$23","v":6.0889932955845909},{"$f":"Values!$M$24","v":6.4277791178711112}]
[null,"   Energy demand [KWh/m³ loose]",{"$f":"Values!$X$14","v":17.137974296677793},{"$f":"Values!$X$15","v":17.578096258549916},{"$f":"Values!$X$16","v":17.791220979314506},{"$f":"Values!$X$17","v":26.45534962435779},{"$f":"Values!$X$18","v":27.423598636568798},{"$f":"Values!$X$19","v":32.58999589164916},{"$f":"Values!$X$20","v":28.780998633067625},{"$f":"Values!$X$21","v":33.083021283729643},{"$f":"Values!$X$22","v":23.029212357162514},{"$f":"Values!$X$23","v":23.986943285636269},{"$f":"Values!$X$24","v":25.321554100704379}]
[null,"   Energy efficiency [%]",{"$f":"1-Values!$Y$14","v":0.97725402669885875},{"$f":"1-Values!$Y$15","v":0.97666988517660602},{"$f":"1-Values!$Y$16","v":0.97638702040365188},{"$f":"1-Values!$Y$17","v":0.96488775943930261},{"$f":"1-Values!$Y$18","v":0.96360267371100405},{"$f":"1-Values!$Y$19","v":0.9567456944675512},{"$f":"1-Values!$Y$20","v":0.96180109649161727},{"$f":"1-Values!$Y$21","v":0.95609133811183999},{"$f":"1-Values!$Y$22","v":0.96943501954464517},{"$f":"1-Values!$Y$23","v":0.96816389369560218},{"$f":"1-Values!$Y$24","v":0.96639256288126907}]
[null,"   Damage on remaining stand [%]",{"$f":"Values!$N$14","v":0.1072},{"$f":"Values!$N$15","v":0.1072},{"$f":"Values!$N$16","v":0.1072},{"$f":"Values!$N$17","v":4.6719999999999998E-2},{"$f":"Values!$N$18","v":4.6719999999999998E-2},{"$f":"Values!$N$19","v":4.6719999999999998E-2},{"$f":"Values!$N$20","v":4.6719999999999998E-2},{"$f":"Values!$N$21","v":4.6719999999999998E-2},{"$f":"Values!$N$22","v":0.1072},{"$f":"Values!$N$23","v":0.1072},{"$f":"Values!$N$24","v":0.1072}]
[null,"      Purchase [€/m³ loose]",{"$f":"Values!$O$14","v":0.45207054637186034},{"$f":"Values!$O$15","v":0.45207054637186034},{"$f":"Values!$O$16","v":0.45207054637186034},{"$f":"Values!$O$17","v":0.45207054637186034},{"$f":"Values!$O$18","v":0.45207054637186034},{"$f":"Values!$O$19","v":0.45207054637186034},{"$f":"Values!$O$20","v":0.45207054637186034},{"$f":"Values!$O$21","v":0.45207054637186034},{"$f":"Values!$O$22","v":0.45207054637186034},{"$f":"Values!$O$23","v":0.45207054637186034},{"$f":"Values!$O$24","v":0.45207054637186034}]
[null,"      Felling and delimbing [€/m³ loose]",{"$f":"Values!$P$14","v":4.8772413793103455},{"$f":"Values!$P$15","v":4.8772413793103455},{"$f":"Values!$P$16","v":4.8772413793103455},{"$f":"Values!$P$17","v":0.48772413793103458},{"$f":"Values!$P$18","v":0.48772413793103458},{"$f":"Values!$P$19","v":0.48772413793103458},{"$f":"Values!$P$20","v":0.48772413793103458},{"$f":"Values!$P$21","v":0.48772413793103458},{"$f":"Values!$P$22","v":4.8772413793103455},{"$f":"Values!$P$23","v":4.8772413793103455},{"$f":"Values!$P$24","v":4.8772413793103455}]
[null,"      Extracting [€/m³ loose]",{"$f":"Values!$Q$14","v":2.9936448598130845},{"$f":"Values!$Q$15","v":2.9936448598130845},{"$f":"Values!$Q$16","v":2.9936448598130845},{"$f":"Values!$Q$17","v":10.677333333333335},{"$f":"Values!$Q$18","v":10.677333333333335},{"$f":"Values!$Q$19","v":10.677333333333335},{"$f":"Values!$Q$20","v":10.677333333333335},{"$f":"Values!$Q$21","v":10.677333333333335},{"$f":"Values!$Q$22","v":5.8240000000000007},{"$f":"Values!$Q$23","v":5.8240000000000007},{"$f":"Values!$Q$24","v":5.8240000000000007}]
[null,"      Bundling [€/m³ loose]",{"$f":"Values!$R$14","v":0},{"$f":"Values!$R$15","v":0},{"$f":"Values!$R$16","v":0},{"$f":"Values!$R$17","v":0},{"$f":"Values!$R$18","v":0},{"$f":"Values!$R$19","v":10.187755102040818},{"$f":"Values!$R$20","v":0},{"$f":"Values!$R$21","v":10.187755102040818},{"$f":"Values!$R$22","v":0},{"$f":"Values!$R$23","v":0},{"$f":"Values!$R$24","v":0}]
[null,"      Chipping [€/m³ loose]",{"$f":"Values!$S$14","v":1.7074626865671643},{"$f":"Values!$S$15","v":1.7074626865671643},{"$f":"Values!$S$16","v":1.7074626865671643},{"$f":"Values!$S$17","v":4.4000000000000012},{"$f":"Values!$S$18","v":4.4000000000000012},{"$f":"Values!$S$19","v":2.1185185185185191},{"$f":"Values!$S$20","v":4.4000000000000012},{"$f":"Values!$S$21","v":2.1185185185185191},{"$f":"Values!$S$22","v":2.6917647058823531},{"$f":"Values!$S$23","v":2.6917647058823531},{"$f":"Values!$S$24","v":2.6917647058823531}]
[null,"      Transporting [€/m³ loose]",{"$f":"Values!$T$14","v":1.3139396168969573},{"$f":"Values!$T$15","v":4.0103051226708839},{"$f":"Values!$T$16","v":3.4106746091991589},{"$f":"Values!$T$17","v":1.3139396168969573},{"$f":"Values!$T$18","v":4.6597810622740896},{"$f":"Values!$T$19","v":4.4202188277045158},{"$f":"Values!$T$20","v":5.6863913288645698},{"$f":"Values!$T$21","v":3.89603819933438},{"$f":"Values!$T$22","v":1.3139396168969573},{"$f":"Values!$T$23","v":4.633924106420003},{"$f":"Values!$T$24","v":4.5863500463812015}]
[null,"      Storing [€/m³ loose]",{"$f":"Values!$U$14","v":0.4},{"$f":"Values!$U$15","v":1.6},{"$f":"Values!$U$16","v":0.4},{"$f":"Values!$U$17","v":0.4},{"$f":"Values!$U$18","v":1.6},{"$f":"Values!$U$19","v":1.6},{"$f":"Values!$U$20","v":0.4},{"$f":"Values!$U$21","v":0.4},{"$f":"Values!$U$22","v":0.4},{"$f":"Values!$U$23","v":1.6},{"$f":"Values!$U$24","v":0.4}]
[null,"   Supply costs [€/m³ loose]",{"$f":"SUM(C59:C65)","v":11.744359088959412},15.640724594733337,13.841094081261613,17.731067634533186,22.276909079910322,29.943620465900086,22.1035193465008,28.219439837529947,15.559016248461518,20.079000737984565,18.83142667794576]
[null,"   Contribution margin [€/m³ loose]",{"$f":"Values!$V$14","v":3.3246591234359335},{"$f":"Values!$V$15","v":-0.57170638233799298},{"$f":"Values!$V$16","v":1.2279241311337314},{"$f":"Values!$V$17","v":-2.6620494221378426},{"$f":"Values!$V$18","v":-7.2078908675149762},{"$f":"Values!$V$19","v":-14.874602253504735},{"$f":"Values!$V$20","v":-7.0345011341054562},{"$f":"Values!$V$21","v":-13.150421625134602},{"$f":"Values!$V$22","v":-0.48999803606617065},{"$f":"Values!$V$23","v":-5.0099825255892183},{"$f":"Values!$V$24","v":-3.7624084655504153}]
[null,"   Working hours [h/m³ loose]",{"$f":"Values!$W$14","v":0.11043391468967408},{"$f":"Values!$W$15","v":0.14369192641227532},{"$f":"Values!$W$16","v":0.13345630824650001},{"$f":"Values!$W$17","v":0.17677284277169142},{"$f":"Values!$W$18","v":0.22833188173717586},{"$f":"Values!$W$19","v":0.28681591889692754},{"$f":"Values!$W$20","v":0.228241695324335},{"$f":"Values!$W$21","v":0.27752342429492211},{"$f":"Values!$W$22","v":0.15008002916204211},{"$f":"Values!$W$23","v":0.20124126880669446},{"$f":"Values!$W$24","v":0.21477222954589631}]

{"sheet":"3b Details C","index":21,"n_rows":68,"n_cols":13,"rows_kept":68,"cut":false,"hidden":true,"merged":[[3,1,3,12],[4,2,5,12],[48,2,48,12]]}
[]
[null,"(3b) Detailed analysis C"]
[]
[null,"The detailed analysis shows the utility values ​​and their ranking for different supply chain options. Graphs and tables give a better understanding of the calculation and show the composition of utility values ​​and the impacts on the evaluation criteria."]
[null,null,"Category C - Felling (and delimbing) with chain saw, extracting with tower yarder, (delimbing and crosscutting with processor)"]
[]
[null,null,"Option 1","Option 2","Option 3","Option 4","Option 5","Option 6","Option 7","Option 8","Option 9","Option 10","Option 11"]
[null,null,{"$f":"C25","v":9},{"$f":"D25","v":4},1,7,5,10,2,3,11,8,6]
[null,"    Working method","Tree-length","Tree-length","Tree-length","Whole-tree","Whole-tree","Whole-tree","Whole-tree","Whole-tree","Whole-tree","Whole-tree","Whole-tree"]
[null,"    Bundling","no","no","no","no","no","yes","no","yes","no","no","no"]
[null,"    Kind of energy wood","Logs","Logs","Logs","Residues","Residues","Residues","Residues","Residues","Logs & residues","Logs & residues","Logs & residues"]
[null,"    Chipping location","Forest road","Terminal","Plant","Forest road","Terminal","Terminal","Plant","Plant","Forest road","Terminal","Plant"]
[null,"    Nutrient loss",{"$f":"'Supply chains'!$AO$26","v":4.2499999999999996E-2},{"$f":"'Supply chains'!$AO$27","v":4.2499999999999996E-2},{"$f":"'Supply chains'!$AO$28","v":4.2499999999999996E-2},{"$f":"'Supply chains'!$AO$29","v":2.1666666666666667E-2},{"$f":"'Supply chains'!$AO$30","v":2.1666666666666667E-2},{"$f":"'Supply chains'!$AO$31","v":2.1666666666666667E-2},{"$f":"'Supply chains'!$AO$32","v":2.1666666666666667E-2},{"$f":"'Supply chains'!$AO$33","v":2.1666666666666667E-2},{"$f":"'Supply chains'!$AO$34","v":2.1666666666666667E-2},{"$f":"'Supply chains'!$AO$35","v":2.1666666666666667E-2},{"$f":"'Supply chains'!$AO$36","v":2.1666666666666667E-2}]
[null,"    Bearing pressure",{"$f":"'Supply chains'!$AP$26","v":8.1666666666666665E-2},{"$f":"'Supply chains'!$AP$27","v":8.1666666666666665E-2},{"$f":"'Supply chains'!$AP$28","v":8.1666666666666665E-2},{"$f":"'Supply chains'!$AP$29","v":8.1666666666666665E-2},{"$f":"'Supply chains'!$AP$30","v":8.1666666666666665E-2},{"$f":"'Supply chains'!$AP$31","v":8.1666666666666665E-2},{"$f":"'Supply chains'!$AP$32","v":8.1666666666666665E-2},{"$f":"'Supply chains'!$AP$33","v":8.1666666666666665E-2},{"$f":"'Supply chains'!$AP$34","v":8.1666666666666665E-2},{"$f":"'Supply chains'!$AP$35","v":8.1666666666666665E-2},{"$f":"'Supply chains'!$AP$36","v":8.1666666666666665E-2}]
[null,"    Energy efficiency",{"$f":"'Supply chains'!$AW$26","v":7.3290973514503976E-2},{"$f":"'Supply chains'!$AW$27","v":7.1668358174913099E-2},{"$f":"'Supply chains'!$AW$28","v":7.0882622694484781E-2},{"$f":"'Supply chains'!$AW$29","v":8.3333333333333329E-2},{"$f":"'Supply chains'!$AW$30","v":8.3333333333333329E-2},{"$f":"'Supply chains'!$AW$31","v":7.2589152899451365E-2},{"$f":"'Supply chains'!$AW$32","v":8.3333333333333329E-2},{"$f":"'Supply chains'!$AW$33","v":7.0771496355808969E-2},{"$f":"'Supply chains'!$AW$34","v":5.5986767764086905E-2},{"$f":"'Supply chains'!$AW$35","v":5.2455862627856432E-2},{"$f":"'Supply chains'!$AW$36","v":4.7535499254708999E-2}]
[null,"    Damage on remaining stand",{"$f":"'Supply chains'!$AR$26","v":4.2812500000000003E-2},{"$f":"'Supply chains'!$AR$27","v":4.2812500000000003E-2},{"$f":"'Supply chains'!$AR$28","v":4.2812500000000003E-2},{"$f":"'Supply chains'!$AR$29","v":8.3333333333333329E-2},{"$f":"'Supply chains'!$AR$30","v":8.3333333333333329E-2},{"$f":"'Supply chains'!$AR$31","v":8.3333333333333329E-2},{"$f":"'Supply chains'!$AR$32","v":8.3333333333333329E-2},{"$f":"'Supply chains'!$AR$33","v":8.3333333333333329E-2},{"$f":"'Supply chains'!$AR$34","v":4.2812500000000003E-2},{"$f":"'Supply chains'!$AR$35","v":4.2812500000000003E-2},{"$f":"'Supply chains'!$AR$36","v":4.2812500000000003E-2}]
[null," SUM ECOLOGY",{"$f":"SUM(C13:C16)","v":0.24027014018117063},0.23864752484157978,0.23786178936115146,0.26999999999999996,0.26999999999999996,0.25925581956611804,0.26999999999999996,0.25743816302247563,0.20213260109742023,0.19860169596118976,0.19368133258804235]
[null,"    Contribution margin",{"$f":"'Supply chains'!$AS$26","v":0},{"$f":"'Supply chains'!$AS$27","v":0},{"$f":"'Supply chains'!$AS$28","v":0},{"$f":"'Supply chains'!$AS$29","v":0.15395912504189047},{"$f":"'Supply chains'!$AS$30","v":0.10368111553806125},{"$f":"'Supply chains'!$AS$31","v":1.888559581752472E-2},{"$f":"'Supply chains'!$AS$32","v":0.105598844250992},{"$f":"'Supply chains'!$AS$33","v":3.795541403735489E-2},{"$f":"'Supply chains'!$AS$34","v":0},{"$f":"'Supply chains'!$AS$35","v":0},{"$f":"'Supply chains'!$AS$36","v":0}]
[null,"    Supply guarantee",{"$f":"'Supply chains'!$AT$26","v":4.9999999999999996E-2},{"$f":"'Supply chains'!$AT$27","v":9.9999999999999992E-2},{"$f":"'Supply chains'!$AT$28","v":0.16666666666666666},{"$f":"'Supply chains'!$AT$29","v":1.6666666666666666E-2},{"$f":"'Supply chains'!$AT$30","v":6.6666666666666666E-2},{"$f":"'Supply chains'!$AT$31","v":8.3333333333333329E-2},{"$f":"'Supply chains'!$AT$32","v":0.11666666666666665},{"$f":"'Supply chains'!$AT$33","v":0.15},{"$f":"'Supply chains'!$AT$34","v":3.3333333333333333E-2},{"$f":"'Supply chains'!$AT$35","v":8.3333333333333329E-2},{"$f":"'Supply chains'!$AT$36","v":0.13333333333333333}]
[null," SUM ECONOMY",{"$f":"SUM(C18:C19)","v":4.9999999999999996E-2},9.9999999999999992E-2,0.16666666666666666,0.17062579170855713,0.1703477822047279,0.10221892915085805,0.22226551091765867,0.18795541403735488,3.3333333333333333E-2,8.3333333333333329E-2,0.13333333333333333]
[null,"    Employment",{"$f":"'Supply chains'!$AU$26","v":0.1594472640835134},{"$f":"'Supply chains'!$AU$27","v":0.16666666666666666},{"$f":"'Supply chains'!$AU$28","v":0.16666666666666666},{"$f":"'Supply chains'!$AU$29","v":3.0751162849890133E-2},{"$f":"'Supply chains'!$AU$30","v":5.3561336783705074E-2},{"$f":"'Supply chains'!$AU$31","v":7.9435191043453451E-2},{"$f":"'Supply chains'!$AU$32","v":5.3521437518617057E-2},{"$f":"'Supply chains'!$AU$33","v":7.5324109409587531E-2},{"$f":"'Supply chains'!$AU$34","v":0.14955294668948377},{"$f":"'Supply chains'!$AU$35","v":0.16666666666666666},{"$f":"'Supply chains'!$AU$36","v":0.16666666666666666}]
[null,"    Working safety",{"$f":"'Supply chains'!$AV$26","v":1.6014194139194138E-2},{"$f":"'Supply chains'!$AV$27","v":1.6014194139194138E-2},{"$f":"'Supply chains'!$AV$28","v":1.6014194139194138E-2},{"$f":"'Supply chains'!$AV$29","v":2.4160561660561661E-2},{"$f":"'Supply chains'!$AV$30","v":2.4160561660561661E-2},{"$f":"'Supply chains'!$AV$31","v":2.4160561660561661E-2},{"$f":"'Supply chains'!$AV$32","v":2.4160561660561661E-2},{"$f":"'Supply chains'!$AV$33","v":2.4160561660561661E-2},{"$f":"'Supply chains'!$AV$34","v":2.4160561660561661E-2},{"$f":"'Supply chains'!$AV$35","v":2.4160561660561661E-2},{"$f":"'Supply chains'!$AV$36","v":2.4160561660561661E-2}]
[null," SUM SOCIAL",{"$f":"SUM(C21:C22)","v":0.17546145822270753},0.1826808608058608,0.1826808608058608,5.4911724510451794E-2,7.7721898444266732E-2,0.10359575270401511,7.7681999179178715E-2,9.9484671070149189E-2,0.17371350835004543,0.19082722832722832,0.19082722832722832]
[null,"    UTILITY VALUE",{"$f":"C17+C20+C23","v":0.46573159840387818},0.52132838564744055,0.58720931683367894,0.49553751621900888,0.51806968064899461,0.46507050142099121,0.56994751009683731,0.54487824812997965,0.40917944278079899,0.47276225762175139,0.51784189424860405]
[null,"    RANK",{"$f":"RANK(C24,$C$24:$M$24,0)","v":9},4,1,7,5,10,2,3,11,8,6]
[]
[]
[]
[]
[]
[]
[]
[]
[]
[]
[]
[]
[]
[]
[]
[]
[]
[]
[]
[]
[]
[]
[]
[null,null,"A utility value of 0 indicates that the system is technically not applicable. These restrictions are determined by the entered site & stand specification data."]
[]
[null,"Trade-offs",{"$f":"C25","v":9},{"$f":"D25","v":4},1,7,5,10,2,3,11,8,6]
[null,null,"Option 1","Option 2","Option 3","Option 4","Option 5","Option 6","Option 7","Option 8","Option 9","Option 10","Option 11"]
[null,"   Nutrient loss [kg/ha]",{"$f":"Values!$K$25","v":640},{"$f":"Values!$K$26","v":640},{"$f":"Values!$K$27","v":640},{"$f":"Values!$K$28","v":960},{"$f":"Values!$K$29","v":960},{"$f":"Values!$K$30","v":960},{"$f":"Values!$K$31","v":960},{"$f":"Values!$K$32","v":960},{"$f":"Values!$K$33","v":960},{"$f":"Values!$K$34","v":960},{"$f":"Values!$K$35","v":960}]
[null,"   Bearing pressure [kPa]",{"$f":"Values!$L$25","v":10},{"$f":"Values!$L$26","v":10},{"$f":"Values!$L$27","v":10},{"$f":"Values!$L$28","v":10},{"$f":"Values!$L$29","v":10},{"$f":"Values!$L$30","v":10},{"$f":"Values!$L$31","v":10},{"$f":"Values!$L$32","v":10},{"$f":"Values!$L$33","v":10},{"$f":"Values!$L$34","v":10},{"$f":"Values!$L$35","v":10}]
[null,"   Emissions [kg CO2/m³ loose]",{"$f":"Values!$M$25","v":4.4243949830325722},{"$f":"Values!$M$26","v":4.5361182502770339},{"$f":"Values!$M$27","v":4.5902191409326614},{"$f":"Values!$M$28","v":3.0015823599939191},{"$f":"Values!$M$29","v":3.24736864770902},{"$f":"Values!$M$30","v":4.5588387201524974},{"$f":"Values!$M$31","v":3.591939416051031},{"$f":"Values!$M$32","v":4.6839913196806195},{"$f":"Values!$M$33","v":5.6466130749260461},{"$f":"Values!$M$34","v":5.8897293875386127},{"$f":"Values!$M$35","v":6.228515209825134}]
[null,"   Energy demand [KWh/m³ loose]",{"$f":"Values!$X$25","v":17.792931266491951},{"$f":"Values!$X$26","v":18.233053228364074},{"$f":"Values!$X$27","v":18.446177949128664},{"$f":"Values!$X$28","v":11.848648456541699},{"$f":"Values!$X$29","v":12.816897468752705},{"$f":"Values!$X$30","v":17.983294723833069},{"$f":"Values!$X$31","v":14.174297465251534},{"$f":"Values!$X$32","v":18.476320115913555},{"$f":"Values!$X$33","v":22.486564315365232},{"$f":"Values!$X$34","v":23.44429524383898},{"$f":"Values!$X$35","v":24.778906058907086}]
[null,"   Energy efficiency [%]",{"$f":"1-Values!$Y$25","v":0.97638475046522144},{"$f":"1-Values!$Y$26","v":0.97580060894296872},{"$f":"1-Values!$Y$27","v":0.97551774417001447},{"$f":"1-Values!$Y$28","v":0.9842741600155539},{"$f":"1-Values!$Y$29","v":0.98298907428725535},{"$f":"1-Values!$Y$30","v":0.97613209504380249},{"$f":"1-Values!$Y$31","v":0.98118749706786845},{"$f":"1-Values!$Y$32","v":0.97547773868809118},{"$f":"1-Values!$Y$33","v":0.97015523639507129},{"$f":"1-Values!$Y$34","v":0.9688841105460283},{"$f":"1-Values!$Y$35","v":0.96711277973169518}]
[null,"   Damage on remaining stand [%]",{"$f":"Values!$N$25","v":0.29449999999999998},{"$f":"Values!$N$26","v":0.29449999999999998},{"$f":"Values!$N$27","v":0.29449999999999998},{"$f":"Values!$N$28","v":3.1744999999999995E-2},{"$f":"Values!$N$29","v":3.1744999999999995E-2},{"$f":"Values!$N$30","v":3.1744999999999995E-2},{"$f":"Values!$N$31","v":3.1744999999999995E-2},{"$f":"Values!$N$32","v":3.1744999999999995E-2},{"$f":"Values!$N$33","v":0.29449999999999998},{"$f":"Values!$N$34","v":0.29449999999999998},{"$f":"Values!$N$35","v":0.29449999999999998}]
[null,"      Purchase [€/m³ loose]",{"$f":"Values!$O$25","v":0.45207054637186034},{"$f":"Values!$O$26","v":0.45207054637186034},{"$f":"Values!$O$27","v":0.45207054637186034},{"$f":"Values!$O$28","v":0.45207054637186034},{"$f":"Values!$O$29","v":0.45207054637186034},{"$f":"Values!$O$30","v":0.45207054637186034},{"$f":"Values!$O$31","v":0.45207054637186034},{"$f":"Values!$O$32","v":0.45207054637186034},{"$f":"Values!$O$33","v":0.45207054637186034},{"$f":"Values!$O$34","v":0.45207054637186034},{"$f":"Values!$O$35","v":0.45207054637186034}]
[null,"      Felling and delimbing [€/m³ loose]",{"$f":"Values!$P$25","v":7.3840000000000012},{"$f":"Values!$P$26","v":7.3840000000000012},{"$f":"Values!$P$27","v":7.3840000000000012},{"$f":"Values!$P$28","v":0.94986666666666697},{"$f":"Values!$P$29","v":0.94986666666666697},{"$f":"Values!$P$30","v":0.94986666666666697},{"$f":"Values!$P$31","v":0.94986666666666697},{"$f":"Values!$P$32","v":0.94986666666666697},{"$f":"Values!$P$33","v":9.4986666666666686},{"$f":"Values!$P$34","v":9.4986666666666686},{"$f":"Values!$P$35","v":9.4986666666666686}]
[null,"      Extracting [€/m³ loose]",{"$f":"Values!$Q$25","v":11.675733333333334},{"$f":"Values!$Q$26","v":11.675733333333334},{"$f":"Values!$Q$27","v":11.675733333333334},{"$f":"Values!$Q$28","v":1.1675733333333334},{"$f":"Values!$Q$29","v":1.1675733333333334},{"$f":"Values!$Q$30","v":1.1675733333333334},{"$f":"Values!$Q$31","v":1.1675733333333334},{"$f":"Values!$Q$32","v":1.1675733333333334},{"$f":"Values!$Q$33","v":11.675733333333334},{"$f":"Values!$Q$34","v":11.675733333333334},{"$f":"Values!$Q$35","v":11.675733333333334}]
[null,"      Bundling [€/m³ loose]",{"$f":"Values!$R$25","v":0},{"$f":"Values!$R$26","v":0},{"$f":"Values!$R$27","v":0},{"$f":"Values!$R$28","v":0},{"$f":"Values!$R$29","v":0},{"$f":"Values!$R$30","v":10.187755102040818},{"$f":"Values!$R$31","v":0},{"$f":"Values!$R$32","v":10.187755102040818},{"$f":"Values!$R$33","v":0},{"$f":"Values!$R$34","v":0},{"$f":"Values!$R$35","v":0}]
[null,"      Chipping [€/m³ loose]",{"$f":"Values!$S$25","v":1.7074626865671643},{"$f":"Values!$S$26","v":1.7074626865671643},{"$f":"Values!$S$27","v":1.7074626865671643},{"$f":"Values!$S$28","v":4.4000000000000012},{"$f":"Values!$S$29","v":4.4000000000000012},{"$f":"Values!$S$30","v":2.1185185185185191},{"$f":"Values!$S$31","v":4.4000000000000012},{"$f":"Values!$S$32","v":2.1185185185185191},{"$f":"Values!$S$33","v":2.6917647058823531},{"$f":"Values!$S$34","v":2.6917647058823531},{"$f":"Values!$S$35","v":2.6917647058823531}]
[null,"      Transporting [€/m³ loose]",{"$f":"Values!$T$25","v":1.3139396168969573},{"$f":"Values!$T$26","v":4.0103051226708839},{"$f":"Values!$T$27","v":3.4106746091991589},{"$f":"Values!$T$28","v":1.3139396168969573},{"$f":"Values!$T$29","v":4.6597810622740896},{"$f":"Values!$T$30","v":4.4202188277045158},{"$f":"Values!$T$31","v":5.6863913288645698},{"$f":"Values!$T$32","v":3.89603819933438},{"$f":"Values!$T$33","v":1.3139396168969573},{"$f":"Values!$T$34","v":4.633924106420003},{"$f":"Values!$T$35","v":4.5863500463812015}]
[null,"      Storing [€/m³ loose]",{"$f":"Values!$U$25","v":0.4},{"$f":"Values!$U$26","v":1.6},{"$f":"Values!$U$27","v":0.4},{"$f":"Values!$U$28","v":0.4},{"$f":"Values!$U$29","v":1.6},{"$f":"Values!$U$30","v":1.6},{"$f":"Values!$U$31","v":0.4},{"$f":"Values!$U$32","v":0.4},{"$f":"Values!$U$33","v":0.4},{"$f":"Values!$U$34","v":1.6},{"$f":"Values!$U$35","v":0.4}]
[null,"   Supply costs [€/m³ loose]",{"$f":"SUM(C59:C65)","v":22.933206183169315},26.829571688943247,25.029941175471517,8.6834501632688195,13.229291608645951,20.896002994635715,13.055901875236431,{"$f":"SUM(J59:J65)","v":19.171822366265577},26.03217486915117,30.552159358674221,29.304585298635416]
[null,"   Contribution margin [€/m³ loose]",{"$f":"Values!$V$25","v":-7.8641879707739673},{"$f":"Values!$V$26","v":-11.760553476547896},{"$f":"Values!$V$27","v":-9.96092296307617},{"$f":"Values!$V$28","v":6.3855680491265261},{"$f":"Values!$V$29","v":1.8397266037493936},{"$f":"Values!$V$30","v":-5.826984782240368},{"$f":"Values!$V$31","v":2.013116337158916},{"$f":"Values!$V$32","v":-4.1028041538702311},{"$f":"Values!$V$33","v":-10.963156656755833},{"$f":"Values!$V$34","v":-15.483141146278875},{"$f":"Values!$V$35","v":-14.235567086240074}]
[null,"   Working hours [h/m³ loose]",{"$f":"Values!$W$25","v":0.3604070589586611},{"$f":"Values!$W$26","v":0.39366507068126233},{"$f":"Values!$W$27","v":0.38342945251548699},{"$f":"Values!$W$28","v":6.9508474955599434E-2},{"$f":"Values!$W$29","v":0.12106751392108388},{"$f":"Values!$W$30","v":0.17955155108083556},{"$f":"Values!$W$31","v":0.120977327508243},{"$f":"Values!$W$32","v":0.17025905647883013},{"$f":"Values!$W$33","v":0.33804241160718318},{"$f":"Values!$W$34","v":0.38920365125183548},{"$f":"Values!$W$35","v":0.40273461199103733}]

{"sheet":"3b Details D","index":22,"n_rows":68,"n_cols":13,"rows_kept":68,"cut":false,"hidden":true,"merged":[[3,1,3,12],[4,2,5,12],[48,2,48,12]]}
[]
[null,"(3b) Detailed analysis D"]
[]
[null,"The detailed analysis shows the utility values ​​and their ranking for different supply chain options. Graphs and tables give a better understanding of the calculation and show the composition of utility values ​​and the impacts on the evaluation criteria."]
[null,null,"Category D - Felling (and delimbing) with chain saw, extracting with skidder, (delimbing and crosscutting with processor)"]
[]
[null,null,"Option 1","Option 2","Option 3","Option 4","Option 5","Option 6","Option 7","Option 8","Option 9","Option 10","Option 11"]
[null,null,{"$f":"C25","v":6},{"$f":"D25","v":4},1,8,7,10,2,3,11,9,5]
[null,"    Working method","Tree-length","Tree-length","Tree-length","Whole-tree","Whole-tree","Whole-tree","Whole-tree","Whole-tree","Whole-tree","Whole-tree","Whole-tree"]
[null,"    Bundling","no","no","no","no","no","yes","no","yes","no","no","no"]
[null,"    Kind of energy wood","Logs","Logs","Logs","Residues","Residues","Residues","Residues","Residues","Logs & residues","Logs & residues","Logs & residues"]
[null,"    Chipping location","Forest road","Terminal","Plant","Forest road","Terminal","Terminal","Plant","Plant","Forest road","Terminal","Plant"]
[null,"    Nutrient loss",{"$f":"'Supply chains'!$AO$37","v":4.2499999999999996E-2},{"$f":"'Supply chains'!$AO$38","v":4.2499999999999996E-2},{"$f":"'Supply chains'!$AO$39","v":4.2499999999999996E-2},{"$f":"'Supply chains'!$AO$40","v":2.1666666666666667E-2},{"$f":"'Supply chains'!$AO$41","v":2.1666666666666667E-2},{"$f":"'Supply chains'!$AO$42","v":2.1666666666666667E-2},{"$f":"'Supply chains'!$AO$43","v":2.1666666666666667E-2},{"$f":"'Supply chains'!$AO$44","v":2.1666666666666667E-2},{"$f":"'Supply chains'!$AO$45","v":2.1666666666666667E-2},{"$f":"'Supply chains'!$AO$46","v":2.1666666666666667E-2},{"$f":"'Supply chains'!$AO$47","v":2.1666666666666667E-2}]
[null,"    Bearing pressure",{"$f":"'Supply chains'!$AP$37","v":4.4999999999999998E-2},{"$f":"'Supply chains'!$AP$38","v":4.4999999999999998E-2},{"$f":"'Supply chains'!$AP$39","v":4.4999999999999998E-2},{"$f":"'Supply chains'!$AP$40","v":4.4999999999999998E-2},{"$f":"'Supply chains'!$AP$41","v":4.4999999999999998E-2},{"$f":"'Supply chains'!$AP$42","v":4.4999999999999998E-2},{"$f":"'Supply chains'!$AP$43","v":4.4999999999999998E-2},{"$f":"'Supply chains'!$AP$44","v":4.4999999999999998E-2},{"$f":"'Supply chains'!$AP$45","v":4.4999999999999998E-2},{"$f":"'Supply chains'!$AP$46","v":4.4999999999999998E-2},{"$f":"'Supply chains'!$AP$47","v":4.4999999999999998E-2}]
[null,"    Energy efficiency",{"$f":"'Supply chains'!$AW$37","v":8.3333333333333329E-2},{"$f":"'Supply chains'!$AW$38","v":8.3333333333333329E-2},{"$f":"'Supply chains'!$AW$39","v":8.3333333333333329E-2},{"$f":"'Supply chains'!$AW$40","v":8.3333333333333329E-2},{"$f":"'Supply chains'!$AW$41","v":8.3333333333333329E-2},{"$f":"'Supply chains'!$AW$42","v":7.5556320080888389E-2},{"$f":"'Supply chains'!$AW$43","v":8.3333333333333329E-2},{"$f":"'Supply chains'!$AW$44","v":7.3738663537246008E-2},{"$f":"'Supply chains'!$AW$45","v":8.3333333333333329E-2},{"$f":"'Supply chains'!$AW$46","v":8.2127534442226674E-2},{"$f":"'Supply chains'!$AW$47","v":7.7207171069079233E-2}]
[null,"    Damage on remaining stand",{"$f":"'Supply chains'!$AR$37","v":4.2812500000000003E-2},{"$f":"'Supply chains'!$AR$38","v":4.2812500000000003E-2},{"$f":"'Supply chains'!$AR$39","v":4.2812500000000003E-2},{"$f":"'Supply chains'!$AR$40","v":8.3333333333333329E-2},{"$f":"'Supply chains'!$AR$41","v":8.3333333333333329E-2},{"$f":"'Supply chains'!$AR$42","v":8.3333333333333329E-2},{"$f":"'Supply chains'!$AR$43","v":8.3333333333333329E-2},{"$f":"'Supply chains'!$AR$44","v":8.3333333333333329E-2},{"$f":"'Supply chains'!$AR$45","v":4.2812500000000003E-2},{"$f":"'Supply chains'!$AR$46","v":4.2812500000000003E-2},{"$f":"'Supply chains'!$AR$47","v":4.2812500000000003E-2}]
[null," SUM ECOLOGY",{"$f":"SUM(C13:C16)","v":0.21364583333333334},0.21364583333333334,0.21364583333333334,0.23333333333333334,0.23333333333333334,0.22555632008088838,0.23333333333333334,0.22373866353724597,0.1928125,0.19160670110889336,0.18668633773574592]
[null,"    Contribution margin",{"$f":"'Supply chains'!$AS$37","v":8.5614083880797734E-2},{"$f":"'Supply chains'!$AS$38","v":4.2519421586996273E-2},{"$f":"'Supply chains'!$AS$39","v":6.2423732185362485E-2},{"$f":"'Supply chains'!$AS$40","v":0.16328392335157538},{"$f":"'Supply chains'!$AS$41","v":0.11300591384774619},{"$f":"'Supply chains'!$AS$42","v":2.8210394127209663E-2},{"$f":"'Supply chains'!$AS$43","v":0.11492364256067691},{"$f":"'Supply chains'!$AS$44","v":4.7280212347039836E-2},{"$f":"'Supply chains'!$AS$45","v":5.5326384597730927E-2},{"$f":"'Supply chains'!$AS$46","v":5.3343587314291343E-3},{"$f":"'Supply chains'!$AS$47","v":1.9132803134093022E-2}]
[null,"    Supply guarantee",{"$f":"'Supply chains'!$AT$37","v":4.9999999999999996E-2},{"$f":"'Supply chains'!$AT$38","v":9.9999999999999992E-2},{"$f":"'Supply chains'!$AT$39","v":0.16666666666666666},{"$f":"'Supply chains'!$AT$40","v":1.6666666666666666E-2},{"$f":"'Supply chains'!$AT$41","v":6.6666666666666666E-2},{"$f":"'Supply chains'!$AT$42","v":8.3333333333333329E-2},{"$f":"'Supply chains'!$AT$43","v":0.11666666666666665},{"$f":"'Supply chains'!$AT$44","v":0.15},{"$f":"'Supply chains'!$AT$45","v":3.3333333333333333E-2},{"$f":"'Supply chains'!$AT$46","v":8.3333333333333329E-2},{"$f":"'Supply chains'!$AT$47","v":0.13333333333333333}]
[null," SUM ECONOMY",{"$f":"SUM(C18:C19)","v":0.13561408388079774},0.14251942158699626,0.22909039885202914,0.17995059001824204,0.17967258051441287,0.11154372746054299,0.23159030922734358,0.19728021234703982,8.8659717931064252E-2,8.8667692064762466E-2,0.15246613646742635]
[null,"    Employment",{"$f":"'Supply chains'!$AU$37","v":0.12995334230439862},{"$f":"'Supply chains'!$AU$38","v":0.14466698024852787},{"$f":"'Supply chains'!$AU$39","v":0.14013865242539392},{"$f":"'Supply chains'!$AU$40","v":2.7506831454187509E-2},{"$f":"'Supply chains'!$AU$41","v":5.0317005388002448E-2},{"$f":"'Supply chains'!$AU$42","v":7.6190859647750853E-2},{"$f":"'Supply chains'!$AU$43","v":5.0277106122914444E-2},{"$f":"'Supply chains'!$AU$44","v":7.2079778013884932E-2},{"$f":"'Supply chains'!$AU$45","v":0.1171096327324575},{"$f":"'Supply chains'!$AU$46","v":0.13974381673548633},{"$f":"'Supply chains'!$AU$47","v":0.14573003320006073}]
[null,"    Working safety",{"$f":"'Supply chains'!$AV$37","v":1.6014194139194138E-2},{"$f":"'Supply chains'!$AV$38","v":1.6014194139194138E-2},{"$f":"'Supply chains'!$AV$39","v":1.6014194139194138E-2},{"$f":"'Supply chains'!$AV$40","v":2.4160561660561661E-2},{"$f":"'Supply chains'!$AV$41","v":2.4160561660561661E-2},{"$f":"'Supply chains'!$AV$42","v":2.4160561660561661E-2},{"$f":"'Supply chains'!$AV$43","v":2.4160561660561661E-2},{"$f":"'Supply chains'!$AV$44","v":2.4160561660561661E-2},{"$f":"'Supply chains'!$AV$45","v":2.4160561660561661E-2},{"$f":"'Supply chains'!$AV$46","v":2.4160561660561661E-2},{"$f":"'Supply chains'!$AV$47","v":2.4160561660561661E-2}]
[null," SUM SOCIAL",{"$f":"SUM(C21:C22)","v":0.14596753644359275},0.160681174387722,0.15615284656458805,5.1667393114749174E-2,7.4477567048564106E-2,0.10035142130831251,7.4437667783476102E-2,9.624033967444659E-2,0.14127019439301916,0.16390437839604799,0.16989059486062238]
[null,"    UTILITY VALUE",{"$f":"C17+C20+C23","v":0.4952274536577238},0.51684642930805158,0.59888907874995057,0.46495131646632454,0.48748348089631033,0.43745146884974384,0.53936131034415302,0.51725921555873233,0.42274241232408338,0.44417877156970381,0.50904306906379471]
[null,"    RANK",{"$f":"RANK(C24,$C$24:$M$24,0)","v":6},4,1,8,7,10,2,3,11,9,5]
[]
[]
[]
[]
[]
[]
[]
[]
[]
[]
[]
[]
[]
[]
[]
[]
[]
[]
[]
[]
[]
[]
[]
[null,null,"A utility value of 0 indicates that the system is technically not applicable. These restrictions are determined by the entered site & stand specification data."]
[]
[null,"Trade-offs",{"$f":"C25","v":6},{"$f":"D25","v":4},1,8,7,10,2,3,11,9,5]
[null,null,"Option 1","Option 2","Option 3","Option 4","Option 5","Option 6","Option 7","Option 8","Option 9","Option 10","Option 11"]
[null,"   Nutrient loss [kg/ha]",{"$f":"Values!$K$36","v":640},{"$f":"Values!$K$37","v":640},{"$f":"Values!$K$38","v":640},{"$f":"Values!$K$39","v":960},{"$f":"Values!$K$40","v":960},{"$f":"Values!$K$41","v":960},{"$f":"Values!$K$42","v":960},{"$f":"Values!$K$43","v":960},{"$f":"Values!$K$44","v":960},{"$f":"Values!$K$45","v":960},{"$f":"Values!$K$46","v":960}]
[null,"   Bearing pressure [kPa]",{"$f":"Values!$L$36","v":230},{"$f":"Values!$L$37","v":230},{"$f":"Values!$L$38","v":230},{"$f":"Values!$L$39","v":230},{"$f":"Values!$L$40","v":230},{"$f":"Values!$L$41","v":230},{"$f":"Values!$L$42","v":230},{"$f":"Values!$L$43","v":230},{"$f":"Values!$L$44","v":230},{"$f":"Values!$L$45","v":230},{"$f":"Values!$L$46","v":230}]
[null,"   Emissions [kg CO2/m³ loose]",{"$f":"Values!$M$36","v":2.4672749830325724},{"$f":"Values!$M$37","v":2.5789982502770341},{"$f":"Values!$M$38","v":2.6330991409326607},{"$f":"Values!$M$39","v":2.7972815599939191},{"$f":"Values!$M$40","v":3.0430678477090201},{"$f":"Values!$M$41","v":4.354537920152497},{"$f":"Values!$M$42","v":3.387638616051031},{"$f":"Values!$M$43","v":4.4796905196806192},{"$f":"Values!$M$44","v":3.6036050749260453},{"$f":"Values!$M$45","v":3.8467213875386124},{"$f":"Values!$M$46","v":4.1855072098251336}]
[null,"   Energy demand [KWh/m³ loose]",{"$f":"Values!$X$36","v":10.083064599825283},{"$f":"Values!$X$37","v":10.523186561697408},{"$f":"Values!$X$38","v":10.736311282461996},{"$f":"Values!$X$39","v":11.043827123208366},{"$f":"Values!$X$40","v":12.01207613541937},{"$f":"Values!$X$41","v":17.178473390499736},{"$f":"Values!$X$42","v":13.369476131918201},{"$f":"Values!$X$43","v":17.671498782580215},{"$f":"Values!$X$44","v":14.438350982031897},{"$f":"Values!$X$45","v":15.396081910505647},{"$f":"Values!$X$46","v":16.730692725573761}]
[null,"   Energy efficiency [%]",{"$f":"1-Values!$Y$36","v":0.98661748966295459},{"$f":"1-Values!$Y$37","v":0.98603334814070187},{"$f":"1-Values!$Y$38","v":0.98575048336774773},{"$f":"1-Values!$Y$39","v":0.98534234020087119},{"$f":"1-Values!$Y$40","v":0.98405725447257264},{"$f":"1-Values!$Y$41","v":0.97720027522911979},{"$f":"1-Values!$Y$42","v":0.98225567725318585},{"$f":"1-Values!$Y$43","v":0.97654591887340858},{"$f":"1-Values!$Y$44","v":0.98083703824824453},{"$f":"1-Values!$Y$45","v":0.97956591239920165},{"$f":"1-Values!$Y$46","v":0.97779458158486854}]
[null,"   Damage on remaining stand [%]",{"$f":"Values!$N$36","v":0.29449999999999998},{"$f":"Values!$N$37","v":0.29449999999999998},{"$f":"Values!$N$38","v":0.29449999999999998},{"$f":"Values!$N$39","v":3.1744999999999995E-2},{"$f":"Values!$N$40","v":3.1744999999999995E-2},{"$f":"Values!$N$41","v":3.1744999999999995E-2},{"$f":"Values!$N$42","v":3.1744999999999995E-2},{"$f":"Values!$N$43","v":3.1744999999999995E-2},{"$f":"Values!$N$44","v":0.29449999999999998},{"$f":"Values!$N$45","v":0.29449999999999998},{"$f":"Values!$N$46","v":0.29449999999999998}]
[null,"      Purchase [€/m³ loose]",{"$f":"Values!$O$36","v":0.45207054637186034},{"$f":"Values!$O$37","v":0.45207054637186034},{"$f":"Values!$O$38","v":0.45207054637186034},{"$f":"Values!$O$39","v":0.45207054637186034},{"$f":"Values!$O$40","v":0.45207054637186034},{"$f":"Values!$O$41","v":0.45207054637186034},{"$f":"Values!$O$42","v":0.45207054637186034},{"$f":"Values!$O$43","v":0.45207054637186034},{"$f":"Values!$O$44","v":0.45207054637186034},{"$f":"Values!$O$45","v":0.45207054637186034},{"$f":"Values!$O$46","v":0.45207054637186034}]
[null,"      Felling and delimbing [€/m³ loose]",{"$f":"Values!$P$36","v":7.3840000000000012},{"$f":"Values!$P$37","v":7.3840000000000012},{"$f":"Values!$P$38","v":7.3840000000000012},{"$f":"Values!$P$39","v":0.94986666666666697},{"$f":"Values!$P$40","v":0.94986666666666697},{"$f":"Values!$P$41","v":0.94986666666666697},{"$f":"Values!$P$42","v":0.94986666666666697},{"$f":"Values!$P$43","v":0.94986666666666697},{"$f":"Values!$P$44","v":9.4986666666666686},{"$f":"Values!$P$45","v":9.4986666666666686},{"$f":"Values!$P$46","v":9.4986666666666686}]
[null,"      Extracting [€/m³ loose]",{"$f":"Values!$Q$36","v":3.6053333333333337},{"$f":"Values!$Q$37","v":3.6053333333333337},{"$f":"Values!$Q$38","v":3.6053333333333337},{"$f":"Values!$Q$39","v":0.32448000000000005},{"$f":"Values!$Q$40","v":0.32448000000000005},{"$f":"Values!$Q$41","v":0.32448000000000005},{"$f":"Values!$Q$42","v":0.32448000000000005},{"$f":"Values!$Q$43","v":0.32448000000000005},{"$f":"Values!$Q$44","v":3.2448000000000006},{"$f":"Values!$Q$45","v":3.2448000000000006},{"$f":"Values!$Q$46","v":3.2448000000000006}]
[null,"      Bundling [€/m³ loose]",{"$f":"Values!$R$36","v":0},{"$f":"Values!$R$37","v":0},{"$f":"Values!$R$38","v":0},{"$f":"Values!$R$39","v":0},{"$f":"Values!$R$40","v":0},{"$f":"Values!$R$41","v":10.187755102040818},{"$f":"Values!$R$42","v":0},{"$f":"Values!$R$43","v":10.187755102040818},{"$f":"Values!$R$44","v":0},{"$f":"Values!$R$45","v":0},{"$f":"Values!$R$46","v":0}]
[null,"      Chipping [€/m³ loose]",{"$f":"Values!$S$36","v":1.7074626865671643},{"$f":"Values!$S$37","v":1.7074626865671643},{"$f":"Values!$S$38","v":1.7074626865671643},{"$f":"Values!$S$39","v":4.4000000000000012},{"$f":"Values!$S$40","v":4.4000000000000012},{"$f":"Values!$S$41","v":2.1185185185185191},{"$f":"Values!$S$42","v":4.4000000000000012},{"$f":"Values!$S$43","v":2.1185185185185191},{"$f":"Values!$S$44","v":2.6917647058823531},{"$f":"Values!$S$45","v":2.6917647058823531},{"$f":"Values!$S$46","v":2.6917647058823531}]
[null,"      Transporting [€/m³ loose]",{"$f":"Values!$T$36","v":1.3139396168969573},{"$f":"Values!$T$37","v":4.0103051226708839},{"$f":"Values!$T$38","v":3.4106746091991589},{"$f":"Values!$T$39","v":1.3139396168969573},{"$f":"Values!$T$40","v":4.6597810622740896},{"$f":"Values!$T$41","v":4.4202188277045158},{"$f":"Values!$T$42","v":5.6863913288645698},{"$f":"Values!$T$43","v":3.89603819933438},{"$f":"Values!$T$44","v":1.3139396168969573},{"$f":"Values!$T$45","v":4.633924106420003},{"$f":"Values!$T$46","v":4.5863500463812015}]
[null,"      Storing [€/m³ loose]",{"$f":"Values!$U$36","v":0.4},{"$f":"Values!$U$37","v":1.6},{"$f":"Values!$U$38","v":0.4},{"$f":"Values!$U$39","v":0.4},{"$f":"Values!$U$40","v":1.6},{"$f":"Values!$U$41","v":1.6},{"$f":"Values!$U$42","v":0.4},{"$f":"Values!$U$43","v":0.4},{"$f":"Values!$U$44","v":0.4},{"$f":"Values!$U$45","v":1.6},{"$f":"Values!$U$46","v":0.4}]
[null,"   Supply costs [€/m³ loose]",{"$f":"SUM(C59:C65)","v":14.862806183169317},18.759171688943244,16.959541175471514,7.8403568299354864,12.386198275312617,20.05290966130238,12.212808541903099,18.328729032932241,17.601241535817838,22.121226025340889,20.873651965302084]
[null,"   Contribution margin [€/m³ loose]",{"$f":"Values!$V$36","v":0.20621202922603032},{"$f":"Values!$V$37","v":-3.6901534765478963},{"$f":"Values!$V$38","v":-1.8905229630761717},{"$f":"Values!$V$39","v":7.2286613824598591},{"$f":"Values!$V$40","v":2.6828199370827277},{"$f":"Values!$V$41","v":-4.9838914489070341},{"$f":"Values!$V$42","v":2.8562096704922477},{"$f":"Values!$V$43","v":-3.2597108205368972},{"$f":"Values!$V$44","v":-2.5322233234224929},{"$f":"Values!$V$45","v":-7.0522078129455377},{"$f":"Values!$V$46","v":-5.8046337529067378}]
[null,"   Working hours [h/m³ loose]",{"$f":"Values!$W$36","v":0.29374039229199439},{"$f":"Values!$W$37","v":0.32699840401459562},{"$f":"Values!$W$38","v":0.31676278584882034},{"$f":"Values!$W$39","v":6.217514162226611E-2},{"$f":"Values!$W$40","v":0.11373418058775055},{"$f":"Values!$W$41","v":0.17221821774750229},{"$f":"Values!$W$42","v":0.1136439941749097},{"$f":"Values!$W$43","v":0.16292572314549683},{"$f":"Values!$W$44","v":0.26470907827384982},{"$f":"Values!$W$45","v":0.31587031791850217},{"$f":"Values!$W$46","v":0.32940127865770402}]

{"sheet":"3b Details F","index":23,"n_rows":67,"n_cols":5,"rows_kept":67,"cut":false,"hidden":true,"merged":[[4,2,5,4],[3,1,3,4],[48,2,48,4]]}
[]
[null,"(3b) Detailed analysis F"]
[]
[null,"The detailed analysis shows the utility values ​​and their ranking for different supply chain options. Graphs and tables give a better understanding of the calculation and show the composition of utility values ​​and the impacts on the evaluation criteria."]
[null,null,"Category F - Felling with feller-buncher, extracting with forwarder"]
[]
[null,null,"Option 1","Option 2","Option 3"]
[null,null,{"$f":"C25","v":3},{"$f":"D25","v":2},1]
[null,"    Working method","Whole-tree","Whole-tree","Whole-tree"]
[null,"    Bundling","no","no","no"]
[null,"    Kind of energy wood","Logs & residues","Logs & residues","Logs & residues"]
[null,"    Chipping location","Forest road","Terminal","Plant"]
[null,"    Nutrient loss",{"$f":"'Supply chains'!$AO$49","v":2.1666666666666667E-2},{"$f":"'Supply chains'!$AO$50","v":2.1666666666666667E-2},{"$f":"'Supply chains'!$AO$51","v":2.1666666666666667E-2}]
[null,"    Bearing pressure",{"$f":"'Supply chains'!$AP$49","v":3.3333333333333333E-2},{"$f":"'Supply chains'!$AP$50","v":3.3333333333333333E-2},{"$f":"'Supply chains'!$AP$51","v":3.3333333333333333E-2}]
[null,"    Energy efficiency",{"$f":"'Supply chains'!$AW$49","v":6.429886770662735E-2},{"$f":"'Supply chains'!$AW$50","v":6.0767962570396884E-2},{"$f":"'Supply chains'!$AW$51","v":5.5847599197249444E-2}]
[null,"    Damage on remaining stand",{"$f":"'Supply chains'!$AR$49","v":7.5833333333333322E-2},{"$f":"'Supply chains'!$AR$50","v":7.5833333333333322E-2},{"$f":"'Supply chains'!$AR$51","v":7.5833333333333322E-2}]
[null," SUM ECOLOGY",{"$f":"SUM(C13:C16)","v":0.19513220103996065},{"$f":"SUM(D13:D16)","v":0.19160129590373021},{"$f":"SUM(E13:E16)","v":0.18668093253058277}]
[null,"    Contribution margin",{"$f":"'Supply chains'!$AS$49","v":2.8730189781824872E-2},{"$f":"'Supply chains'!$AS$50","v":0},{"$f":"'Supply chains'!$AS$51","v":0}]
[null,"    Supply guarantee",{"$f":"'Supply chains'!$AT$49","v":3.3333333333333333E-2},{"$f":"'Supply chains'!$AT$50","v":8.3333333333333329E-2},{"$f":"'Supply chains'!$AT$51","v":0.13333333333333333}]
[null," SUM ECONOMY",{"$f":"SUM(C18:C19)","v":6.2063523115158205E-2},{"$f":"SUM(D18:D19)","v":8.3333333333333329E-2},{"$f":"SUM(E18:E19)","v":0.13333333333333333}]
[null,"    Employment",{"$f":"'Supply chains'!$AU$49","v":7.6567047465555205E-2},{"$f":"'Supply chains'!$AU$50","v":9.9201231468584061E-2},{"$f":"'Supply chains'!$AU$51","v":0.10518744793315844}]
[null,"    Working safety",{"$f":"'Supply chains'!$AV$49","v":0.15224358974358973},{"$f":"'Supply chains'!$AV$50","v":0.15224358974358973},{"$f":"'Supply chains'!$AV$51","v":0.15224358974358973}]
[null," SUM SOCIAL",{"$f":"SUM(C21:C22)","v":0.22881063720914493},{"$f":"SUM(D21:D22)","v":0.25144482121217382},{"$f":"SUM(E21:E22)","v":0.25743103767674819}]
[null,"    UTILITY VALUE",{"$f":"C17+C20+C23","v":0.48600636136426378},{"$f":"D17+D20+D23","v":0.5263794504492374},{"$f":"E17+E20+E23","v":0.57744530354066437}]
[null,"    RANK",{"$f":"RANK(C24,$C$24:$E$24,0)","v":3},{"$f":"RANK(D24,$C$24:$E$24,0)","v":2},{"$f":"RANK(E24,$C$24:$E$24,0)","v":1}]
[]
[]
[]
[]
[]
[]
[]
[]
[]
[]
[]
[]
[]
[]
[]
[]
[]
[]
[]
[]
[]
[]
[]
[null,null,"A utility value of 0 indicates that the system is technically not applicable. These restrictions are determined by the entered site & stand specification data."]
[null,"Trade-offs",{"$f":"C25","v":3},{"$f":"D25","v":2},1]
[null,null,"Option 1","Option 2","Option 3"]
[null,"   Nutrient loss [kg/ha]",{"$f":"Values!$K$47","v":960},{"$f":"Values!$K$48","v":960},{"$f":"Values!$K$49","v":960}]
[null,"   Bearing pressure [kPa]",{"$f":"Values!$L$47","v":320},{"$f":"Values!$L$48","v":300},{"$f":"Values!$L$49","v":300}]
[null,"   Emissions [kg CO2/m³ loose]",{"$f":"Values!$M$47","v":6.7131259947509641},{"$f":"Values!$M$48","v":5.1358080174547815},{"$f":"Values!$M$49","v":5.378924330067349}]
[null,"   Energy demand [KWh/m³ loose]",{"$f":"Values!$X$47","v":26.445647858109851},{"$f":"Values!$X$48","v":20.231970977852168},{"$f":"Values!$X$49","v":21.189701906325919}]
[null,"   Energy efficiency [%]",{"$f":"1-Values!$Y$47","v":0.96490063588037023},{"$f":"1-Values!$Y$48","v":0.97314759237438586},{"$f":"1-Values!$Y$49","v":0.97187646652534287}]
[null,"   Damage on remaining stand [%]",{"$f":"Values!$N$47","v":0.24651999999999999},{"$f":"Values!$N$48","v":0.13600000000000001},{"$f":"Values!$N$49","v":0.13600000000000001}]
[null,"      Purchase [€/m³ loose]",{"$f":"Values!$O$47","v":0.45207054637186034},{"$f":"Values!$O$48","v":0.45207054637186034},{"$f":"Values!$O$49","v":0.45207054637186034}]
[null,"      Felling and delimbing [€/m³ loose]",{"$f":"Values!$P$47","v":9.3241379310344854},{"$f":"Values!$P$48","v":9.3241379310344854},{"$f":"Values!$P$49","v":9.3241379310344854}]
[null,"      Extracting [€/m³ loose]",{"$f":"Values!$Q$47","v":2.140818713450293},{"$f":"Values!$Q$48","v":5.8240000000000007},{"$f":"Values!$Q$49","v":5.8240000000000007}]
[null,"      Bundling [€/m³ loose]",{"$f":"Values!$R$47","v":0},{"$f":"Values!$R$48","v":0},{"$f":"Values!$R$49","v":0}]
[null,"      Chipping [€/m³ loose]",{"$f":"Values!$S$47","v":9.4823529411764707},{"$f":"Values!$S$48","v":2.6917647058823531},{"$f":"Values!$S$49","v":2.6917647058823531}]
[null,"      Transporting [€/m³ loose]",{"$f":"Values!$T$47","v":1.3139396168969573},{"$f":"Values!$T$48","v":1.3139396168969573},{"$f":"Values!$T$49","v":4.633924106420003}]
[null,"      Storing [€/m³ loose]",{"$f":"Values!$U$47","v":0.4},{"$f":"Values!$U$48","v":0.4},{"$f":"Values!$U$49","v":1.6}]
[null,"   Supply costs [€/m³ loose]",{"$f":"SUM(C58:C64)","v":23.113319748930063},{"$f":"SUM(D58:D64)","v":20.005912800185655},{"$f":"SUM(E58:E64)","v":24.525897289708706}]
[null,"   Contribution margin [€/m³ loose]",{"$f":"Values!$V$47","v":-8.0443015365347197},{"$f":"Values!$V$48","v":-4.9368945877903103},{"$f":"Values!$V$49","v":-9.4568790773133582}]
[null,"   Working hours [h/m³ loose]",{"$f":"Values!$W$47","v":0.17079189857680463},{"$f":"Values!$W$48","v":0.17306853490916854},{"$f":"Values!$W$49","v":0.22422977455382093}]

{"sheet":"Specifications","index":24,"n_rows":41,"n_cols":9,"rows_kept":41,"cut":false,"hidden":true,"merged":[]}
[null,"Morphology",null,"Tree species",null,"Wertschöpfung"]
[null,null,null,null,null,null,null,"Option button 3a System comparison",true]
[null,"no restrictions",null,"no restrictions",null,"keine Voreinstellungen",null,"Option button System category A",true]
[null,"uniform",null,"Softwood",null,"ja",null,"Option button System category B",true]
[null,"non-uniform",null,"Norway Spruce",null,"nein",null,"Option button System category C",true]
[null,null,null,"Larch",null,null,null,"Option button System category D",true]
[null,"Bearing capacity",null,"Fir",null,"Extraction distance",null,"Option button System category F",true]
[null,null,null,"Pine",null,null,null,"Felling with chain saw*",false]
[null,"no restrictions",null,"Softwood & Hardwood",null,"no restrictions",null,"Felling and delimbing with chain saw",false]
[null,"high",null,"Hardwood",null,"< 80 m",null,"Felling, delimbing and crosscutting with chain saw",false]
[null,"low",null,"Beech",null,"80 to 800 m",null,"Felling with feller-buncher",true]
[null,null,null,"Oak",null,"> 800 m",null,"Felling, delimbing and crosscutting with harvester",false]
[null,"Slope",null,"Maple",null,null,null,"Chipping of trees with mobile chipper in stand",false]
[null,null,null,"Birch",null,"Chipping location",null,"Extracting of logs with forwarder ",false]
[null,"no restrictions",null,"Alder",null,null,null,"Extracting of residues with forwarder",false]
[null,"0 to 35 %",null,"Ash",null,"no restrictions",null,"Extracting of logs & residues with forwarder",true]
[null,"35 to 60 %",null,"Hazel",null,"possible",null,"Extracting of stems with skidder",false]
[null,"> 60 %",null,"Poplar",null,"not possible",null,"Extracting of trees with skidder*",false]
[null,null,null,"Locust",null,null,null,"Extracting of stems with tower yarder",false]
[null,"BHD",null,"Meadow",null,"Soil type",null,"Extracting of trees with tower yarder*",false]
[null,null,null,"Hornbeam",null,null,null,"Extracting of chips with shuttle",false]
[null,"keine Voreinstellungen",null,"Turkey Oak",null,"no restrictions",null,"Delimbing and crosscutting with processor*",false]
[null,"< 20 cm",null,null,null,"soil depth less than 30 cm",null,"Bundling of residues",false]
[null,"< 40 cm",null,"Einheiten",null,"immature soil",null,"Pre-transport of logs",false]
[null,"> 40 cm",null,null,null,"substrat-induced podzol",null,"Pre-transport of residues",false]
[null,null,null,"€/m³ loose",1,"rendzina",null,"Pre-transport of bundles",false]
[null,null,null,"€/MWh",2,"Terra fusca",null,"Pre-transport of logs & residues",false]
[null,null,null,"€/m³ solid",3,"low moor",null,"Chipping of logs with chipper mounted on tractor",false]
[null,null,null,"€/dry-ton",4,"highmoor",null,"Chipping of residues with chipper mounted on tractor",false]
[null,null,null,null,null,"other soil types",null,"Chipping of bundles with chipper mounted on tractor",false]
[null,null,null,null,null,null,null,"Chipping of logs & trees with chipper mounted on tractor",true]
[null,null,null,null,null,null,null,"Chipping of logs with chippertruck",false]
[null,null,null,null,null,null,null,"Chipping of residues with chippertruck",false]
[null,null,null,null,null,null,null,"Chipping of bundles with chippertruck",false]
[null,null,null,null,null,null,null,"Chipping of logs & trees with chippertruck",false]
[null,null,null,null,null,null,null,"Direkt transport of logs",false]
[null,null,null,null,null,null,null,"Direct transport of residues",false]
[null,null,null,null,null,null,null,"Direct transport of bundles",false]
[null,null,null,null,null,null,null,"Direct transport of logs & residues",false]
[null,null,null,null,null,null,null,"Main transport of chips",false]
[null,null,null,null,null,null,null,"Direct transport of chips",true]

{"sheet":"Energy content","index":25,"n_rows":131,"n_cols":15,"rows_kept":131,"cut":false,"hidden":true,"merged":[]}
[null,null,null,null,null,null,null,null,null,null,"Chips","Logs","Residues","Bundles","Trees"]
["Density kg/m³ loose",null,null,null,null,null,null,null,null,null,"kg/m³ loose","kg/m³ stacked","kg/m³ stacked","kg/m³ stacked","kg/m³ stacked"]
["Tree species/water content in %",null,0,17.5,22.5,27.5,32.5,37.5,45,null,{"$f":"'2b Environment'!D13","v":55}]
["no restrictions",null,null,null,null,null,null,null,null,"no restrictions",{"$f":"K10","v":377.96015957304246},{"$f":"K4/0.59","v":640.6104399543093},{"$f":"K4/0.4*0.35","v":330.71513962641211},{"$f":"K4","v":377.96015957304246},{"$f":"L4*0.63+M4*0.37","v":525.94917883298729}]
["Softwood",null,null,null,null,null,null,null,null,"Softwood",{"$f":"(K6+K7+K8+K9)/4","v":332.53732338844156},563.6225820143078,290.97015796488637,332.53732338844156,{"$f":"L5*0.63+M5*0.37","v":462.74118511602182}]
["Norway Spruce",null,156,189,196,209,225,243,276,"Norway Spruce",{"$f":"152.01*EXP(0.0125*K3)","v":302.30798275120418},512.38641144271901,264.51948490730359,302.30798275120418,420.67564862461535]
["Larch",null,200,243,252,269,289,312,354,"Larch",{"$f":"195.19*EXP(0.0123*K3)","v":383.93506746969058},650.73740249100103,335.94318403597924,383.93506746969058,534.26354166264298]
["Fir",null,149,181,188,200,215,232,264,"Fir",{"$f":"145.43*EXP(0.0125*K3)","v":289.22209020135273},490.20693254466568,253.0693289261836,289.22209020135273,402.46601920582731]
["Pine",null,184,223,231,246,264,286,325,"Pine",{"$f":"179.33*EXP(0.0124*K3)","v":354.68415313151877},601.1595815788454,310.34863399007889,354.68415313151877,493.55953097100178]
["Softwood & Hardwood",null,null,null,null,null,null,null,null,"Softwood & Hardwood",{"$f":"(K5+K11)/2","v":377.96015957304246},640.6104399543093,330.71513962641211,377.96015957304246,525.94917883298729]
["Hardwood",null,null,null,null,null,null,null,null,"Hardwood",{"$f":"SUM(K12:K23)/12","v":423.3829957576433},717.59829789431069,370.46012128793785,423.3829957576433,589.15717254995275]
["Beech",null,231,280,287,306,328,355,403,"Beech",{"$f":"225.25*EXP(0.0121*K3)","v":438.21554293477402},742.73820836402376,383.43860006792727,438.21554293477402,609.79735329446805]
["Oak",null,242,294,303,323,347,375,426,"Oak",{"$f":"236.1*EXP(0.0123*K3)","v":464.40426983756311},787.1258810806155,406.35373610786763,464.40426983756311,646.24018744069883]
["Maple",null,218,265,275,293,315,340,386,"Maple",{"$f":"212.85*EXP(0.0125*K3)","v":423.30277040059082},717.46232271286578,370.38992410051696,423.30277040059082,589.04553522629681]
["Birch",null,228,277,286,305,327,353,402,"Birch",{"$f":"222.52*EXP(0.0123*K3)","v":437.69266465164998},741.85197398584751,382.98108157019368,437.69266465164998,609.06974379205553]
["Alder",null,174,211,218,232,249,269,306,"Alder",{"$f":"169.73*EXP(0.0123*K3)","v":333.8557251991935},565.85716135456528,292.12375954929428,333.8557251991935,464.57580268661502]
["Ash",null,240,291,301,321,345,372,423,"Ash",{"$f":"234.08*EXP(0.0123*K3)","v":460.43096774068948},780.39147074693142,402.87709677310323,460.43096774068948,640.71115237661502]
["Hazel",null,200,243,251,268,287,310,353,"Hazel",{"$f":"195.22*EXP(0.0125*K3)","v":388.241328811855},658.03615052856787,339.71116271037306,388.241328811855,540.25590503583578]
["Poplar",null,147,178,184,196,210,227,258,"Poplar",{"$f":"143.38*EXP(0.0122*K3)","v":280.4788857257987},475.38794190813343,245.41902501007382,280.4788857257987,390.29944265585141]
["Locust",null,265,321,331,353,379,410,466,"Locust",{"$f":"258.2*EXP(0.0123*K3)","v":507.87455515484453},860.804330770923,444.39023576048896,507.87455515484453,706.73111561706241]
["Meadow",null,189,229,238,254,273,295,335,"Meadow",{"$f":"184.21*EXP(0.0125*K3)","v":366.345329271754},620.92428690127804,320.55216311278468,366.345329271754,509.78660109953552]
["Hornbeam",null,255,309,316,336,361,390,443,"Hornbeam",{"$f":"248.69*EXP(0.012*K3)","v":481.16350564244124},815.53136549566318,421.01806743713604,481.16350564244124,669.56144521400813]
["Turkey Oak",null,260,315,325,347,372,402,457,"Turkey Oak",{"$f":"253.48*EXP(0.0123*K3)","v":498.59040372056546},845.06848088231436,436.26660325549472,498.59040372056546,693.81178616039108]
["Energy MWh/m³ loose",null,null,null,null,null,null,null,null,null,"kWh/m³ loose","kWh/m³ stacked","kWh/m³ stacked","kWh/m³ stacked","kWh/m³ stacked"]
["Tree species/water content in %",null,0,17.5,22.5,27.5,32.5,37.5,45,null,{"$f":"'2b Environment'!D13","v":55}]
["no restrictions",null,null,null,null,null,null,null,null,"no restrictions",{"$f":"K32","v":860.12089989372521},{"$f":"K26/0.59","v":1457.8320337181783},{"$f":"K26/0.4*0.35","v":752.60578740700942},{"$f":"K26","v":860.12089989372521},{"$f":"L26*0.63+M26*0.37","v":1196.8983225830459}]
["Softwood",null,null,null,null,null,null,null,null,"Softwood",{"$f":"(K28+K29+K30+K31)/4","v":777.17769784544748},1317.250335331267,680.03048561476646,777.17769784544748,1081.4789909361618]
["Norway Spruce",null,null,801,773,762,751,739,717,"Norway Spruce",{"$f":"-83.162*LN(K25)+1037.2","v":703.94215764969726},1193.1223011011818,615.94938794348502,703.94215764969726,979.56832323283402]
["Larch",null,null,1029,993,979,965,949,921,"Larch",{"$f":"-107*LN(K25)+1333","v":904.2153491801256},1532.5683884408909,791.1884305326098,904.2153491801256,1258.2578040148269]
["Fir",null,null,766,739,729,719,707,686,"Fir",{"$f":"-78.933*LN(K25)+990.1","v":673.78916969004536},1142.0155418475345,589.5655234787896,673.78916969004536,937.60903505109877]
["Pine",null,null,945,909,896,884,869,843,"Pine",{"$f":"-100.35*LN(K25)+1228.9","v":826.7641148619216},1401.2951099354605,723.41860050418131,826.7641148619216,1150.4808014458872]
["Softwood & Hardwood",null,null,null,null,null,null,null,null,"Softwood & Hardwood",{"$f":"(K27+K33)/2","v":860.12089989372521},1457.8320337181783,752.60578740700942,860.12089989372521,1196.8983225830459]
["Hardwood",null,null,null,null,null,null,null,null,"Hardwood",{"$f":"SUM(K34:K45)/12","v":943.06410194200305},1598.41373210509,825.1810891992526,943.06410194200305,1312.3176542299302]
["Beech",null,null,1123,1069,1051,1036,1018,985,"Beech",{"$f":"-134.8*LN(K25)+1500.9","v":960.71148663066288},1628.3245536112931,840.62255080183002,960.71148663066288,1336.8748125717916]
["Oak",null,null,1176,1128,1111,1095,1076,1041,"Oak",{"$f":"-132.45*LN(K25)+1550.4","v":1019.6287196159593},1728.1842705355243,892.1751296639643,1019.6287196159593,1418.8608884130472]
["Maple",null,null,1061,1023,1007,993,976,944,"Maple",{"$f":"-115.38*LN(K25)+1389.2","v":926.83389708787752},1570.9049103184366,810.9796599518927,926.83389708787752,1289.7325676828154]
["Birch",null,null,1109,1064,1048,1033,1015,982,"Birch",{"$f":"-124.61*LN(K25)+1461.4","v":962.04621178818184},1630.5867996409863,841.79043531465902,962.04621178818184,1338.7321448402454]
["Alder",null,null,845,810,798,786,772,748,"Alder",{"$f":"-107*LN(K25)+1333","v":904.2153491801256},1532.5683884408909,791.1884305326098,904.2153491801256,1258.2578040148269]
["Ash",null,null,1166,1121,1103,1087,1069,1034,"Ash",{"$f":"-130*LN(K25)+1534.4","v":1013.4466859197788},1717.706247321659,886.76585017980642,1013.4466859197788,1410.2583003791735]
["Hazel",null,null,973,934,920,907,891,862,"Hazel",{"$f":"-108.93*LN(K25)+1281.3","v":844.78119613262686},1431.8325358180116,739.18354661604837,844.78119613262686,1175.5524098132853]
["Poplar",null,null,713,684,674,664,652,631,"Poplar",{"$f":"-80.631*LN(K25)+941.15","v":618.03471794152051},1047.516471087323,540.78037819883036,618.03471794152051,860.02411671858079]
["Locust",null,null,1285,1233,1214,1197,1176,1138,"Locust",{"$f":"-144.32*LN(K25)+1693.1","v":1114.7616747072498},1889.4265673004234,975.41646536884343,1114.7616747072498,1551.2428295857387]
["Meadow",null,null,919,886,873,860,846,818,"Meadow",{"$f":"-99.471*LN(K25)+1201.9","v":803.28656073174102},1361.5026453080357,702.87574064027331,803.28656073174102,1117.8106905809636]
["Hornbeam",null,null,1239,1175,1155,1139,1119,1083,"Hornbeam",{"$f":"-151.77*LN(K25)+1662.7","v":1054.507042477268},1787.3000719953695,922.69366216760932,1054.507042477268,1467.3957003590983]
["Turkey Oak",null,null,1263,1211,1192,1175,1155,1118,"Turkey Oak",{"$f":"-142.41*LN(K25)+1665.2","v":1094.5156810910439},1855.1113238831254,957.70122095466331,1094.5156810910439,1523.0695857995943]
[]
[null,null,null,null,null,null,null,null,null,null,"Chips"]
["Density kg/m³ loose",null,null,null,null,null,null,null,null,null,"kg/m³ loose"]
["Tree species/water content in %",null,0,17.5,22.5,27.5,32.5,37.5,45,null,{"$f":"'2b Environment'!D14","v":30}]
["no restrictions",null,null,null,null,null,null,null,null,"no restrictions",{"$f":"K56","v":277.57487062542918}]
["Softwood",null,null,null,null,null,null,null,null,"Softwood",{"$f":"(K52+K53+K54+K55)/4","v":243.80388406515311}]
["Norway Spruce",null,156,189,196,209,225,243,276,"Norway Spruce",{"$f":"152.01*EXP(0.0125*K49)","v":221.17324493611275}]
["Larch",null,200,243,252,269,289,312,354,"Larch",{"$f":"195.19*EXP(0.0123*K49)","v":282.3008773612724}]
["Fir",null,149,181,188,200,215,232,264,"Fir",{"$f":"145.43*EXP(0.0125*K49)","v":211.59940142792502}]
["Pine",null,184,223,231,246,264,286,325,"Pine",{"$f":"179.33*EXP(0.0124*K49)","v":260.14201253530217}]
["Softwood & Hardwood",null,null,null,null,null,null,null,null,"Softwood & Hardwood",{"$f":"(K51+K57)/2","v":277.57487062542918}]
["Hardwood",null,null,null,null,null,null,null,null,"Hardwood",{"$f":"SUM(K58:K69)/12","v":311.3458571857052}]
["Beech",null,231,280,287,306,328,355,403,"Beech",{"$f":"225.25*EXP(0.0121*K49)","v":323.82747729408243}]
["Oak",null,242,294,303,323,347,375,426,"Oak",{"$f":"236.1*EXP(0.0123*K49)","v":341.46850322760599}]
["Maple",null,218,265,275,293,315,340,386,"Maple",{"$f":"212.85*EXP(0.0125*K49)","v":309.69492260148411}]
["Birch",null,228,277,286,305,327,353,402,"Birch",{"$f":"222.52*EXP(0.0123*K49)","v":321.82791756970306}]
["Alder",null,174,211,218,232,249,269,306,"Alder",{"$f":"169.73*EXP(0.0123*K49)","v":245.47839497171356}]
["Ash",null,240,291,301,321,345,372,423,"Ash",{"$f":"234.08*EXP(0.0123*K49)","v":338.54700226818306}]
["Hazel",null,200,243,251,268,287,310,353,"Hazel",{"$f":"195.22*EXP(0.0125*K49)","v":284.04342396176526}]
["Poplar",null,147,178,184,196,210,227,258,"Poplar",{"$f":"143.38*EXP(0.0122*K49)","v":206.74754269180451}]
["Locust",null,265,321,331,353,379,410,466,"Locust",{"$f":"258.2*EXP(0.0123*K49)","v":373.43145926881778}]
["Meadow",null,189,229,238,254,273,295,335,"Meadow",{"$f":"184.21*EXP(0.0125*K49)","v":268.02396848681889}]
["Hornbeam",null,255,309,316,336,361,390,443,"Hornbeam",{"$f":"248.69*EXP(0.012*K49)","v":356.454692107011}]
["Turkey Oak",null,260,315,325,347,372,402,457,"Turkey Oak",{"$f":"253.48*EXP(0.0123*K49)","v":366.60498177947301}]
["Energy MWh/m³ loose",null,null,null,null,null,null,null,null,null,"MWh/m³ loose"]
["Tree species/water content in %",null,0,17.5,22.5,27.5,32.5,37.5,45,null,{"$f":"'2b Environment'!D14","v":30}]
["no restrictions",null,null,null,null,null,null,null,null,"no restrictions",{"$f":"K78","v":925.28320113299173}]
["Softwood",null,null,null,null,null,null,null,null,"Softwood",{"$f":"(K74+K75+K76+K77)/4","v":833.16115833295623}]
["Norway Spruce",null,null,801,773,762,751,739,717,"Norway Spruce",{"$f":"-83.162*LN(K71)+1037.2","v":754.34962334621184}]
["Larch",null,null,1029,993,979,965,949,921,"Larch",{"$f":"-107*LN(K71)+1333","v":969.07188016214934}]
["Fir",null,null,766,739,729,719,707,686,"Fir",{"$f":"-78.933*LN(K71)+990.1","v":721.63328707326104}]
["Pine",null,null,945,909,896,884,869,843,"Pine",{"$f":"-100.35*LN(K71)+1228.9","v":887.58984275020282}]
["Softwood & Hardwood",null,null,null,null,null,null,null,null,"Softwood & Hardwood",{"$f":"(K73+K79)/2","v":925.28320113299173}]
["Hardwood",null,null,null,null,null,null,null,null,"Hardwood",{"$f":"SUM(K80:K91)/12","v":1017.4052439330272}]
["Beech",null,null,1123,1069,1051,1036,1018,985,"Beech",{"$f":"-134.8*LN(K71)+1500.9","v":1042.4185929519415}]
["Oak",null,null,1176,1128,1111,1095,1076,1041,"Oak",{"$f":"-132.45*LN(K71)+1550.4","v":1099.9114067988476}]
["Maple",null,null,1061,1023,1007,993,976,944,"Maple",{"$f":"-115.38*LN(K71)+1389.2","v":996.76984610382056}]
["Birch",null,null,1109,1064,1048,1033,1015,982,"Birch",{"$f":"-124.61*LN(K71)+1461.4","v":1037.5767942710788}]
["Alder",null,null,845,810,798,786,772,748,"Alder",{"$f":"-107*LN(K71)+1333","v":969.07188016214934}]
["Ash",null,null,1166,1121,1103,1087,1069,1034,"Ash",{"$f":"-130*LN(K71)+1534.4","v":1092.24434038392}]
["Hazel",null,null,973,934,920,907,891,862,"Hazel",{"$f":"-108.93*LN(K71)+1281.3","v":910.80756921554132}]
["Poplar",null,null,713,684,674,664,652,631,"Poplar",{"$f":"-80.631*LN(K71)+941.15","v":666.90805391919866}]
["Locust",null,null,1285,1233,1214,1197,1176,1138,"Locust",{"$f":"-144.32*LN(K71)+1693.1","v":1202.2391938785177}]
["Meadow",null,null,919,886,873,860,846,818,"Meadow",{"$f":"-99.471*LN(K71)+1201.9","v":863.57949524868377}]
["Hornbeam",null,null,1239,1175,1155,1139,1119,1083,"Hornbeam",{"$f":"-151.77*LN(K71)+1662.7","v":1146.5002733851347}]
["Turkey Oak",null,null,1263,1211,1192,1175,1155,1118,"Turkey Oak",{"$f":"-142.41*LN(K71)+1665.2","v":1180.8354808774925}]
[]
[]
[]
[null,"Darrdichte"]
[null,"kg/m³","dry ton/m³"]
["no restrictions",{"$f":"B103","v":548.54166666666674},{"$f":"B97/1000","v":0.54854166666666671}]
["Softwood",{"$f":"AVERAGE(B99:B102)","v":476.25},{"$f":"B98/1000","v":0.47625000000000001}]
["Norway Spruce",410,0.41]
["Larch",550,0.55000000000000004]
["Fir",410,0.41]
["Pine",535,0.53500000000000003]
["Softwood & Hardwood",{"$f":"(B98+B104)/2","v":548.54166666666674},0.54854166666666671]
["Hardwood",{"$f":"AVERAGE(B105:B116)","v":620.83333333333337},0.62083333333333335]
["Beech",680,0.68]
["Oak",670,0.67]
["Maple",590,0.59]
["Birch",640,0.64]
["Alder",490,0.49]
["Ash",670,0.67]
["Hazel",560,0.56000000000000005]
["Poplar",410,0.41]
["Locust",730,0.73]
["Meadow",520,0.52]
["Hornbeam",750,0.75]
["Turkey Oak",740,0.74]
[]
[]
[null,null,{"$f":"\"Conversion factor for \" & 'Contribution margin'!$B$92 & \" \" & 'Contribution margin'!$C$92& \", \" & 'Contribution margin'!$B$99 & \" \" &'Contribution margin'!$C$99 & \", \" & 'Contribution margin'!$B$106 & \" \" & 'Contribution margin'!$C$106 & \" and \" &'2b Environment'!$D$13 & \"% Water content\"","v":"Conversion factor for 0.75 Norway Spruce, 0.2 Beech, 0.05 Ash and 55% Water content"}]
[null,null,"m³ loose","MWh","m³","dry-ton"]
[null,null,1,{"$f":"'Contribution margin'!K116","v":0.75345091061976721},{"$f":"1/2.5","v":0.4},{"$f":"E121*'Contribution margin'!N113","v":0.1908}]
[null,null,{"$f":"C121/D121","v":1.3272264800601654},1,{"$f":"C122*E121","v":0.53089059202406619},{"$f":"F121/E121*E122","v":0.25323481239547957}]
[null,null,{"$f":"E123/E121","v":2.5},{"$f":"D122/E122","v":1.883627276549418},1,{"$f":"'Contribution margin'!$N$113","v":0.47699999999999998}]
[null,null,{"$f":"E124/E121","v":5.2410901467505244},{"$f":"E124/E122","v":3.9489041437094721},{"$f":"E123/F123","v":2.0964360587002098},1]
[]
[null,null,{"$f":"\"Conversion factor for \" & 'Contribution margin'!$B$92 & \" \" & 'Contribution margin'!$C$92& \", \" & 'Contribution margin'!$B$99 & \" \" &'Contribution margin'!$C$99 & \", \" & 'Contribution margin'!$B$106 & \" \" & 'Contribution margin'!$C$106 & \" and \" &'2b Environment'!$D$14 & \"% Water content\"","v":"Conversion factor for 0.75 Norway Spruce, 0.2 Beech, 0.05 Ash and 30% Water content"}]
[null,null,"m³ loose","MWh","m³","dry-ton"]
[null,null,1,{"$f":"'Contribution margin'!H116","v":0.80937428280810031},{"$f":"1/2.5","v":0.4},{"$f":"'Contribution margin'!N113*'Energy content'!E128","v":0.1908}]
[null,null,{"$f":"C128/D128","v":1.2355223303247655},1,{"$f":"C129*E128","v":0.49420893212990624},{"$f":"F128/E128*E129","v":0.23573766062596527}]
[null,null,{"$f":"E130/E128","v":2.5},{"$f":"D129/E129","v":2.0234357070202509},1,{"$f":"'Contribution margin'!$N$113","v":0.47699999999999998}]
[null,null,{"$f":"E131/E128","v":5.2410901467505244},{"$f":"E131/E129","v":4.2420035786588066},{"$f":"E130/F130","v":2.0964360587002098},1]

{"sheet":"Energy efficiency","index":26,"n_rows":88,"n_cols":25,"rows_kept":88,"cut":false,"hidden":true,"merged":[]}
[null,"Productivity","Fuel","Consumption","Efficiency"]
[null,"MWh/h","l/h","kWh/MWh","MWh/MWh",null,null,"kwh/l"]
["Chain Saw - Felling",{"$f":"'2ca Felling and processing'!$C$13*'Energy content'!$D$123","v":5.6508818296482541},{"$f":"'2ca Felling and processing'!C7","v":0.53},{"$f":"C3*H3/B3","v":1.1825127832156321},{"$f":"D3/1000","v":1.182512783215632E-3},{"$f":"E3","v":1.182512783215632E-3},null,12.608000000000001]
["Chain Saw - Felling and Delimbing",{"$f":"'2ca Felling and processing'!$C$16*'Energy content'!$D$123","v":3.7672545530988359},{"$f":"'2ca Felling and processing'!C7","v":0.53},{"$f":"C4*H4/B4","v":1.7737691748234481},{"$f":"D4/1000","v":1.7737691748234482E-3},{"$f":"E4","v":1.7737691748234482E-3},null,12.608000000000001]
["Chain Saw - Felling and Processing",{"$f":"'2ca Felling and processing'!$C$19*'Energy content'!$D$123","v":2.8254409148241271},{"$f":"'2ca Felling and processing'!C7","v":0.53},2.3650255664312643,2.3650255664312641E-3,2.3650255664312641E-3,null,12.608000000000001]
["Harvester",{"$f":"'2ca Felling and processing'!$C$39*'Energy content'!$D$123","v":16.387557305979936},{"$f":"'2ca Felling and processing'!C33","v":15.6},9.9001942126418978,9.9001942126418982E-3,9.9001942126418982E-3,null,10.4]
["Feller buncher",{"$f":"'2ca Felling and processing'!$C$29*'Energy content'!$D$123","v":10.925038203986624},{"$f":"'2ca Felling and processing'!C23","v":6.5},6.1876213829011864,6.1876213829011864E-3,6.1876213829011864E-3,null,10.4]
["Processor",{"$f":"'2ca Felling and processing'!$C$49*'Energy content'!$D$123","v":18.836272765494179},{"$f":"'2ca Felling and processing'!C43","v":8},4.4170097256402308,4.4170097256402306E-3,4.4170097256402306E-3,null,10.4]
["Forwarder - logs",{"$f":"'2cb Extracting'!$C$14*'Energy content'!$D$123","v":20.154811859078769},{"$f":"'2cb Extracting'!$C$8","v":11.1},5.7276644806783379,5.7276644806783378E-3,5.7276644806783378E-3,null,10.4]
["Forwarder - residues",{"$f":"'2cb Extracting'!$C$17*'Energy content'!$D$123","v":5.6508818296482541},{"$f":"'2cb Extracting'!$C$8","v":11.1},20.428669981086067,2.0428669981086067E-2,2.0428669981086067E-2,null,10.4]
["Forwarder - trees",{"$f":"'2cb Extracting'!$C$20*'Energy content'!$D$123","v":10.359950021021799},{"$f":"'2cb Extracting'!$C$8","v":11.1},11.142910898774218,1.1142910898774219E-2,1.1142910898774219E-2,null,10.4]
["Skidder - TL",{"$f":"'2cb Extracting'!$C$30*'Energy content'!$D$123","v":16.952645488944761},{"$f":"'2cb Extracting'!$C$24","v":7.32},4.4906265544009019,4.4906265544009021E-3,4.4906265544009021E-3,null,10.4]
["Skidder - WT",{"$f":"'2cb Extracting'!$C$33*'Energy content'!$D$123","v":18.836272765494179},{"$f":"'2cb Extracting'!$C$24","v":7.32},4.0415638989608116,4.0415638989608118E-3,4.0415638989608118E-3,null,10.4]
["Tower yarder - TL",{"$f":"'2cb Extracting'!$C$46*'Energy content'!$D$123","v":11.301763659296508},{"$f":"'2cb Extracting'!$C$37","v":16},14.723365752134104,1.4723365752134104E-2,1.4723365752134104E-2,null,10.4]
["Tower yarder - WT",{"$f":"'2cb Extracting'!$C$49*'Energy content'!$D$123","v":11.301763659296508},{"$f":"'2cb Extracting'!$C$37","v":16},14.723365752134104,1.4723365752134104E-2,1.4723365752134104E-2,null,10.4]
["Shuttle",{"$f":"'2cb Extracting'!$C$59*'Energy content'!$D$123","v":32.21002642899505},{"$f":"'2cb Extracting'!$C$53","v":10},3.2288082789767767,3.2288082789767767E-3,3.2288082789767767E-3,null,10.4]
["Bundler",{"$f":"'2cc Bundling'!$C$13*'Energy content'!$D$123","v":9.2297736550921492},{"$f":"'2cc Bundling'!C7","v":11.5},12.958064246138433,1.2958064246138433E-2,1.2958064246138433E-2,null,10.4]
["Tractor & chipper - logs",{"$f":"'2cd Chipping'!$C$14*'Energy content'!$D$121","v":50.481211011524401},{"$f":"'2cd Chipping'!$C$8","v":34.799999999999997},7.1694001143787318,7.1694001143787316E-3,7.1694001143787316E-3,null,10.4]
["Tractor & chipper - residues",{"$f":"'2cd Chipping'!$C$17*'Energy content'!$D$121","v":19.589723676113948},{"$f":"'2cd Chipping'!$C$8","v":34.799999999999997},18.474992602437499,1.8474992602437498E-2,1.8474992602437498E-2,null,10.4]
["Tractor & chipper - bundles",{"$f":"'2cd Chipping'!$C$20*'Energy content'!$D$121","v":40.686349173467427},{"$f":"'2cd Chipping'!$C$8","v":34.799999999999997},8.89536680858102,8.8953668085810199E-3,8.8953668085810199E-3,null,10.4]
["Tractor & chipper - trees",{"$f":"'2cd Chipping'!$C$23*'Energy content'!$D$121","v":21.850076407973248},{"$f":"'2cd Chipping'!$C$8","v":34.799999999999997},16.563786471150866,1.6563786471150865E-2,1.6563786471150865E-2,null,10.4]
["Chippertruck - logs",{"$f":"'2cd Chipping'!$C$33*'Energy content'!$D$121","v":100.9624220230488},{"$f":"'2cd Chipping'!$C$27","v":40.479999999999997},4.1697890320409643,4.1697890320409646E-3,4.1697890320409646E-3,null,10.4]
["Chippertruck - residues",{"$f":"'2cd Chipping'!$C$36*'Energy content'!$D$121","v":39.179447352227896},{"$f":"'2cd Chipping'!$C$27","v":40.479999999999997},10.745225582567098,1.0745225582567098E-2,1.0745225582567098E-2,null,10.4]
["Chippertruck - bundles",{"$f":"'2cd Chipping'!$C$39*'Energy content'!$D$121","v":81.372698346934854},{"$f":"'2cd Chipping'!$C$27","v":40.479999999999997},5.1736271323471223,5.1736271323471221E-3,5.1736271323471221E-3,null,10.4]
["Chippertruck - trees",{"$f":"'2cd Chipping'!$C$42*'Energy content'!$D$121","v":64.04332740268022},{"$f":"'2cd Chipping'!$C$27","v":40.479999999999997},6.5735497681586947,6.5735497681586944E-3,6.5735497681586944E-3,null,10.4]
["Mobile chipper",{"$f":"'2cd Chipping'!$C$52*'Energy content'!$D$121","v":12.808665480536042},{"$f":"'2cd Chipping'!C46","v":28},22.734608881971774,2.2734608881971773E-2,2.2734608881971773E-2,null,10.4]
[]
[null,"km","l/km","MWh","MWh/MWh"]
["Pre-transport - logs",{"$f":"'2b Environment'!$D$10","v":12},{"$f":"'2ce Transporting'!B10/100","v":0.4},{"$f":"RH_MW_T","v":41.432830837624465},{"$f":"C29*B29*H29/1000/D29","v":1.2048416434695668E-3},{"$f":"E29","v":1.2048416434695668E-3},null,10.4]
["Pre-transport - residues",{"$f":"'2b Environment'!$D$10","v":12},{"$f":"'2ce Transporting'!B21/100","v":0.25},{"$f":"SA_MW_T","v":16.371199318083676},{"$f":"C30*B30*H30/1000/D30","v":1.905785849515398E-3},1.905785849515398E-3,null,10.4]
["Pre-transport - bundles",{"$f":"'2b Environment'!$D$10","v":12},{"$f":"'2ce Transporting'!B32/100","v":0.4},{"$f":"Bün_MW_T","v":36.271180336289447},1.3762992970497534E-3,1.3762992970497534E-3,null,10.4]
["Pre-transport - trees",{"$f":"'2b Environment'!$D$10","v":12},{"$f":"'2ce Transporting'!B43/100","v":0.25},{"$f":"'Contribution margin'!G115","v":16.492003223591972},1.8918259702598225E-3,1.8918259702598225E-3,null,10.4]
["Main transport - chips",{"$f":"'2b Environment'!D11","v":30},{"$f":"'2ce Transporting'!B54/100","v":0.5},{"$f":"HG_MW_T","v":67.02109211521514},2.3276254545632038E-3,2.3276254545632038E-3,null,10.4]
["Direct transport - logs",{"$f":"'2b Environment'!$D$9","v":38},{"$f":"C29","v":0.4},{"$f":"RH_MW_T","v":41.432830837624465},3.8153318709869617E-3,3.8153318709869617E-3,null,10.4]
["Direct transport - residues",{"$f":"'2b Environment'!$D$9","v":38},{"$f":"C30","v":0.25},{"$f":"SA_MW_T","v":16.371199318083676},6.0349885234654262E-3,6.0349885234654262E-3,null,10.4]
["Direct transport - bundles",{"$f":"'2b Environment'!$D$9","v":38},{"$f":"C31","v":0.4},{"$f":"Bün_MW_T","v":36.271180336289447},4.3582811073242193E-3,4.3582811073242193E-3,null,10.4]
["Direct transport - trees",{"$f":"'2b Environment'!$D$9","v":38},{"$f":"C32","v":0.25},{"$f":"'Contribution margin'!G115","v":16.492003223591972},5.9907822391561038E-3,5.9907822391561038E-3,null,10.4]
["Direct transport - chips",{"$f":"'2b Environment'!$D$9","v":38},{"$f":"C33","v":0.5},{"$f":"HG_MW_T","v":67.02109211521514},2.9483255757800581E-3,2.9483255757800581E-3,null,10.4]
[]
[null,null,null,null,null,null,null,null,"Chain Saw","Feller buncher","Harvester","Processor","Forwarder","Skidder","Tower Yarder","Shuttle","Bundler","Tractor & Chipper","Chippertruck","Mobile chipper","Pre-transport","Main-transport","Direct transport","SUM","Efficiency"]
[1,"Chain Saw",null,"Forwarder",null,"CTL","Logs","Forest road",{"$f":"$E$5","v":2.3650255664312641E-3},null,null,null,{"$f":"$E$9","v":5.7276644806783378E-3},null,null,null,null,null,{"$f":"$E$22","v":4.1697890320409646E-3},null,null,null,{"$f":"$E$38","v":2.9483255757800581E-3},{"$f":"SUM(I41:W41)","v":1.5210804654930625E-2},{"$f":"X41","v":1.5210804654930625E-2}]
[2,"Chain Saw",null,"Forwarder",null,"CTL","Logs","Terminal",{"$f":"$E$5","v":2.3650255664312641E-3},null,null,null,{"$f":"$E$9","v":5.7276644806783378E-3},null,null,null,null,null,{"$f":"$E$22","v":4.1697890320409646E-3},null,{"$f":"$E$29","v":1.2048416434695668E-3},{"$f":"$E$33","v":2.3276254545632038E-3},null,{"$f":"SUM(I42:W42)","v":1.5794946177183338E-2},1.5794946177183338E-2]
[3,"Chain Saw",null,"Forwarder",null,"CTL","Logs","Plant",2.3650255664312641E-3,null,null,null,5.7276644806783378E-3,null,null,null,null,null,4.1697890320409646E-3,null,null,null,{"$f":"$E$34","v":3.8153318709869617E-3},1.6077810950137529E-2,1.6077810950137529E-2]
[4,"Chain Saw",null,"Forwarder",null,"CTL","Residues","Forest road",{"$f":"$E$5*'2b Environment'!$D$23","v":2.3650255664312643E-4},null,null,null,{"$f":"$E$10","v":2.0428669981086067E-2},null,null,null,null,null,{"$f":"$E$23","v":1.0745225582567098E-2},null,null,null,{"$f":"$E$38","v":2.9483255757800581E-3},3.435872369607635E-2,3.435872369607635E-2]
[5,"Chain Saw",null,"Forwarder",null,"CTL","Residues","Terminal",{"$f":"$E$5*'2b Environment'!$D$23","v":2.3650255664312643E-4},null,null,null,{"$f":"$E$10","v":2.0428669981086067E-2},null,null,null,null,null,{"$f":"$E$23","v":1.0745225582567098E-2},null,{"$f":"$E$30","v":1.905785849515398E-3},{"$f":"$E$33","v":2.3276254545632038E-3},null,3.5643809424374895E-2,3.5643809424374895E-2]
[6,"Chain Saw",null,"Forwarder","Bundler","CTL","Residues","Terminal",{"$f":"$E$5*'2b Environment'!$D$23","v":2.3650255664312643E-4},null,null,null,2.0428669981086067E-2,null,null,null,{"$f":"$E$17","v":1.2958064246138433E-2},null,{"$f":"$E$24","v":5.1736271323471221E-3},null,{"$f":"$E$31","v":1.3762992970497534E-3},2.3276254545632038E-3,null,4.2500788667827701E-2,4.2500788667827701E-2]
[7,"Chain Saw",null,"Forwarder",null,"CTL","Residues","Plant",{"$f":"$E$5*'2b Environment'!$D$23","v":2.3650255664312643E-4},null,null,null,2.0428669981086067E-2,null,null,null,null,null,{"$f":"$E$23","v":1.0745225582567098E-2},null,null,null,{"$f":"$E$35","v":6.0349885234654262E-3},3.7445386643761722E-2,3.7445386643761722E-2]
[8,"Chain Saw",null,"Forwarder","Bundler","CTL","Residues","Plant",{"$f":"$E$5*'2b Environment'!$D$23","v":2.3650255664312643E-4},null,null,null,2.0428669981086067E-2,null,null,null,{"$f":"$E$17","v":1.2958064246138433E-2},null,{"$f":"$E$24","v":5.1736271323471221E-3},null,null,null,{"$f":"$E$36","v":4.3582811073242193E-3},4.3155145023538961E-2,4.3155145023538961E-2]
[9,"Chain Saw",null,"Forwarder",null,"CTL","Logs & residues","Forest road",2.3650255664312641E-3,null,null,null,{"$f":"$E$11","v":1.1142910898774219E-2},null,null,null,null,null,{"$f":"$E$25","v":6.5735497681586944E-3},null,null,null,{"$f":"$E$38","v":2.9483255757800581E-3},2.3029811809144235E-2,2.3029811809144235E-2]
[10,"Chain Saw",null,"Forwarder",null,"CTL","Logs & residues","Terminal",2.3650255664312641E-3,null,null,null,{"$f":"$E$11","v":1.1142910898774219E-2},null,null,null,null,null,{"$f":"$E$25","v":6.5735497681586944E-3},null,{"$f":"$E$32","v":1.8918259702598225E-3},{"$f":"$E$33","v":2.3276254545632038E-3},null,2.4300937658187204E-2,2.4300937658187204E-2]
[11,"Chain Saw",null,"Forwarder",null,"CTL","Logs & residues","Plant",2.3650255664312641E-3,null,null,null,1.1142910898774219E-2,null,null,null,null,null,6.5735497681586944E-3,null,null,null,{"$f":"$E$37","v":5.9907822391561038E-3},2.6072268472520282E-2,2.6072268472520282E-2]
[12,"Harvester",null,"Forwarder",null,"CTL","Logs","Forest road",null,null,{"$f":"$E$6","v":9.9001942126418982E-3},null,{"$f":"$E$9","v":5.7276644806783378E-3},null,null,null,null,null,{"$f":"$E$22","v":4.1697890320409646E-3},null,null,null,{"$f":"$E$38","v":2.9483255757800581E-3},2.2745973301141257E-2,2.2745973301141257E-2]
[13,"Harvester",null,"Forwarder",null,"CTL","Logs","Terminal",null,null,{"$f":"$E$6","v":9.9001942126418982E-3},null,{"$f":"$E$9","v":5.7276644806783378E-3},null,null,null,null,null,4.1697890320409646E-3,null,{"$f":"$E$29","v":1.2048416434695668E-3},{"$f":"$E$33","v":2.3276254545632038E-3},null,2.333011482339397E-2,2.333011482339397E-2]
[14,"Harvester",null,"Forwarder",null,"CTL","Logs","Plant",null,null,9.9001942126418982E-3,null,5.7276644806783378E-3,null,null,null,null,null,4.1697890320409646E-3,null,null,null,{"$f":"$E$34","v":3.8153318709869617E-3},2.3612979596348161E-2,2.3612979596348161E-2]
[15,"Harvester",null,"Forwarder",null,"CTL","Residues","Forest road",null,null,{"$f":"$E$6*'2b Environment'!$D$23","v":9.9001942126418995E-4},null,{"$f":"$E$10","v":2.0428669981086067E-2},null,null,null,null,null,{"$f":"$E$23","v":1.0745225582567098E-2},null,null,null,{"$f":"$E$38","v":2.9483255757800581E-3},3.5112240560697408E-2,3.5112240560697408E-2]
[16,"Harvester",null,"Forwarder",null,"CTL","Residues","Terminal",null,null,{"$f":"$E$6*'2b Environment'!$D$23","v":9.9001942126418995E-4},null,2.0428669981086067E-2,null,null,null,null,null,{"$f":"$E$23","v":1.0745225582567098E-2},null,{"$f":"$E$30","v":1.905785849515398E-3},{"$f":"$E$33","v":2.3276254545632038E-3},null,3.6397326288995953E-2,3.6397326288995953E-2]
[17,"Harvester",null,"Forwarder","Bundler","CTL","Residues","Terminal",null,null,{"$f":"$E$6*'2b Environment'!$D$23","v":9.9001942126418995E-4},null,2.0428669981086067E-2,null,null,null,{"$f":"$E$17","v":1.2958064246138433E-2},null,{"$f":"$E$24","v":5.1736271323471221E-3},null,{"$f":"$E$31","v":1.3762992970497534E-3},2.3276254545632038E-3,null,4.3254305532448765E-2,4.3254305532448765E-2]
[18,"Harvester",null,"Forwarder",null,"CTL","Residues","Plant",null,null,{"$f":"$E$6*'2b Environment'!$D$23","v":9.9001942126418995E-4},null,2.0428669981086067E-2,null,null,null,null,null,{"$f":"$E$23","v":1.0745225582567098E-2},null,null,null,{"$f":"$E$35","v":6.0349885234654262E-3},3.819890350838278E-2,3.819890350838278E-2]
[19,"Harvester",null,"Forwarder","Bundler","CTL","Residues","Plant",null,null,{"$f":"$E$6*'2b Environment'!$D$23","v":9.9001942126418995E-4},null,2.0428669981086067E-2,null,null,null,{"$f":"$E$17","v":1.2958064246138433E-2},null,{"$f":"$E$24","v":5.1736271323471221E-3},null,null,null,{"$f":"$E$36","v":4.3582811073242193E-3},4.3908661888160026E-2,4.3908661888160026E-2]
[20,"Harvester",null,"Forwarder",null,"CTL","Logs & residues","Forest road",null,null,9.9001942126418982E-3,null,{"$f":"$E$11","v":1.1142910898774219E-2},null,null,null,null,null,{"$f":"$E$25","v":6.5735497681586944E-3},null,null,null,{"$f":"$E$38","v":2.9483255757800581E-3},3.056498045535487E-2,3.056498045535487E-2]
[21,"Harvester",null,"Forwarder",null,"CTL","Logs & residues","Terminal",null,null,9.9001942126418982E-3,null,1.1142910898774219E-2,null,null,null,null,null,6.5735497681586944E-3,null,{"$f":"$E$32","v":1.8918259702598225E-3},{"$f":"$E$33","v":2.3276254545632038E-3},null,3.1836106304397843E-2,3.1836106304397843E-2]
[22,"Harvester",null,"Forwarder",null,"CTL","Logs & residues","Plant",null,null,9.9001942126418982E-3,null,1.1142910898774219E-2,null,null,null,null,null,6.5735497681586944E-3,null,null,null,{"$f":"$E$37","v":5.9907822391561038E-3},3.3607437118730918E-2,3.3607437118730918E-2]
[23,"Chain Saw",null,"Tower Yarder",null,"TL","Logs","Forest road",{"$f":"$E$4","v":1.7737691748234482E-3},null,null,null,null,null,{"$f":"$E$14","v":1.4723365752134104E-2},null,null,null,{"$f":"$E$22","v":4.1697890320409646E-3},null,null,null,{"$f":"$E$38","v":2.9483255757800581E-3},2.3615249534778573E-2,2.3615249534778573E-2]
[24,"Chain Saw",null,"Tower Yarder",null,"TL","Logs","Terminal",{"$f":"$E$4","v":1.7737691748234482E-3},null,null,null,null,null,{"$f":"$E$14","v":1.4723365752134104E-2},null,null,null,4.1697890320409646E-3,null,{"$f":"$E$29","v":1.2048416434695668E-3},{"$f":"$E$33","v":2.3276254545632038E-3},null,2.4199391057031287E-2,2.4199391057031287E-2]
[25,"Chain Saw",null,"Tower Yarder",null,"TL","Logs","Plant",1.7737691748234482E-3,null,null,null,null,null,1.4723365752134104E-2,null,null,null,4.1697890320409646E-3,null,null,null,{"$f":"$E$34","v":3.8153318709869617E-3},2.4482255829985478E-2,2.4482255829985478E-2]
[26,"Chain Saw","Processor","Tower Yarder",null,"WT","Residues","Forest road",{"$f":"$E$3*'2b Environment'!$D$23","v":1.1825127832156321E-4},null,null,{"$f":"$E$8*'2b Environment'!$D$23","v":4.4170097256402308E-4},null,null,{"$f":"$E$15*'2b Environment'!$D$23","v":1.4723365752134104E-3},null,null,null,{"$f":"$E$23","v":1.0745225582567098E-2},null,null,null,{"$f":"$E$38","v":2.9483255757800581E-3},1.5725839984446151E-2,1.5725839984446151E-2]
[27,"Chain Saw","Processor","Tower Yarder",null,"WT","Residues","Terminal",{"$f":"$E$3*'2b Environment'!$D$23","v":1.1825127832156321E-4},null,null,{"$f":"$E$8*'2b Environment'!$D$23","v":4.4170097256402308E-4},null,null,{"$f":"$E$15*'2b Environment'!$D$23","v":1.4723365752134104E-3},null,null,null,{"$f":"$E$23","v":1.0745225582567098E-2},null,{"$f":"$E$30","v":1.905785849515398E-3},{"$f":"$E$33","v":2.3276254545632038E-3},null,1.7010925712744696E-2,1.7010925712744696E-2]
[28,"Chain Saw","Processor","Tower Yarder","Bundler","WT","Residues","Terminal",{"$f":"$E$3*'2b Environment'!$D$23","v":1.1825127832156321E-4},null,null,{"$f":"$E$8*'2b Environment'!$D$23","v":4.4170097256402308E-4},null,null,{"$f":"$E$15*'2b Environment'!$D$23","v":1.4723365752134104E-3},null,{"$f":"$E$17","v":1.2958064246138433E-2},null,{"$f":"$E$24","v":5.1736271323471221E-3},null,{"$f":"$E$31","v":1.3762992970497534E-3},2.3276254545632038E-3,null,2.3867904956197509E-2,2.3867904956197509E-2]
[29,"Chain Saw","Processor","Tower Yarder",null,"WT","Residues","Plant",{"$f":"$E$3*'2b Environment'!$D$23","v":1.1825127832156321E-4},null,null,{"$f":"$E$8*'2b Environment'!$D$23","v":4.4170097256402308E-4},null,null,{"$f":"$E$15*'2b Environment'!$D$23","v":1.4723365752134104E-3},null,null,null,{"$f":"$E$23","v":1.0745225582567098E-2},null,null,null,{"$f":"$E$35","v":6.0349885234654262E-3},1.881250293213152E-2,1.881250293213152E-2]
[30,"Chain Saw","Processor","Tower Yarder","Bundler","WT","Residues","Plant",{"$f":"$E$3*'2b Environment'!$D$23","v":1.1825127832156321E-4},null,null,{"$f":"$E$8*'2b Environment'!$D$23","v":4.4170097256402308E-4},null,null,{"$f":"$E$15*'2b Environment'!$D$23","v":1.4723365752134104E-3},null,{"$f":"$E$17","v":1.2958064246138433E-2},null,{"$f":"$E$24","v":5.1736271323471221E-3},null,null,null,{"$f":"$E$36","v":4.3582811073242193E-3},2.4522261311908773E-2,2.4522261311908773E-2]
[31,"Chain Saw","Processor","Tower Yarder",null,"WT","Logs & residues","Forest road",{"$f":"$E$3","v":1.182512783215632E-3},null,null,{"$f":"$E$8","v":4.4170097256402306E-3},null,null,{"$f":"$E$15","v":1.4723365752134104E-2},null,null,null,{"$f":"$E$25","v":6.5735497681586944E-3},null,null,null,{"$f":"$E$38","v":2.9483255757800581E-3},2.9844763604928718E-2,2.9844763604928718E-2]
[32,"Chain Saw","Processor","Tower Yarder",null,"WT","Logs & residues","Terminal",1.182512783215632E-3,null,null,4.4170097256402306E-3,null,null,1.4723365752134104E-2,null,null,null,6.5735497681586944E-3,null,{"$f":"$E$32","v":1.8918259702598225E-3},{"$f":"$E$33","v":2.3276254545632038E-3},null,3.1115889453971687E-2,3.1115889453971687E-2]
[33,"Chain Saw","Processor","Tower Yarder",null,"WT","Logs & residues","Plant",1.182512783215632E-3,null,null,4.4170097256402306E-3,null,null,1.4723365752134104E-2,null,null,null,6.5735497681586944E-3,null,null,null,{"$f":"$E$37","v":5.9907822391561038E-3},3.2887220268304762E-2,3.2887220268304762E-2]
[34,"Chain Saw",null,"Skidder",null,"TL","Logs","Forest road",{"$f":"$E$4","v":1.7737691748234482E-3},null,null,null,null,{"$f":"$E$12","v":4.4906265544009021E-3},null,null,null,null,{"$f":"$E$22","v":4.1697890320409646E-3},null,null,null,{"$f":"$E$38","v":2.9483255757800581E-3},1.3382510337045371E-2,1.3382510337045371E-2]
[35,"Chain Saw",null,"Skidder",null,"TL","Logs","Terminal",1.7737691748234482E-3,null,null,null,null,{"$f":"$E$12","v":4.4906265544009021E-3},null,null,null,null,4.1697890320409646E-3,null,{"$f":"$E$29","v":1.2048416434695668E-3},{"$f":"$E$33","v":2.3276254545632038E-3},null,1.3966651859298084E-2,1.3966651859298084E-2]
[36,"Chain Saw",null,"Skidder",null,"TL","Logs","Plant",1.7737691748234482E-3,null,null,null,null,4.4906265544009021E-3,null,null,null,null,4.1697890320409646E-3,null,null,null,{"$f":"$E$34","v":3.8153318709869617E-3},1.4249516632252275E-2,1.4249516632252275E-2]
[37,"Chain Saw","Skidder","Processor",null,"WT","Residues","Forest road",{"$f":"$E$3*'2b Environment'!$D$23","v":1.1825127832156321E-4},null,null,{"$f":"$E$8*'2b Environment'!$D$23","v":4.4170097256402308E-4},null,{"$f":"$E$13*'2b Environment'!$D$23","v":4.0415638989608121E-4},null,null,null,null,{"$f":"$E$23","v":1.0745225582567098E-2},null,null,null,{"$f":"$E$38","v":2.9483255757800581E-3},1.4657659799128822E-2,1.4657659799128822E-2]
[38,"Chain Saw","Skidder","Processor",null,"WT","Residues","Terminal",{"$f":"$E$3*'2b Environment'!$D$23","v":1.1825127832156321E-4},null,null,{"$f":"$E$8*'2b Environment'!$D$23","v":4.4170097256402308E-4},null,{"$f":"$E$13*'2b Environment'!$D$23","v":4.0415638989608121E-4},null,null,null,null,{"$f":"$E$23","v":1.0745225582567098E-2},null,{"$f":"$E$30","v":1.905785849515398E-3},{"$f":"$E$33","v":2.3276254545632038E-3},null,1.5942745527427367E-2,1.5942745527427367E-2]
[39,"Chain Saw","Skidder","Processor","Bundler","WT","Residues","Terminal",{"$f":"$E$3*'2b Environment'!$D$23","v":1.1825127832156321E-4},null,null,{"$f":"$E$8*'2b Environment'!$D$23","v":4.4170097256402308E-4},null,{"$f":"$E$13*'2b Environment'!$D$23","v":4.0415638989608121E-4},null,null,{"$f":"$E$17","v":1.2958064246138433E-2},null,{"$f":"$E$24","v":5.1736271323471221E-3},null,{"$f":"$E$31","v":1.3762992970497534E-3},2.3276254545632038E-3,null,2.279972477088018E-2,2.279972477088018E-2]
[40,"Chain Saw","Skidder","Processor",null,"WT","Residues","Plant",{"$f":"$E$3*'2b Environment'!$D$23","v":1.1825127832156321E-4},null,null,{"$f":"$E$8*'2b Environment'!$D$23","v":4.4170097256402308E-4},null,{"$f":"$E$13*'2b Environment'!$D$23","v":4.0415638989608121E-4},null,null,null,null,{"$f":"$E$23","v":1.0745225582567098E-2},null,null,null,{"$f":"$E$35","v":6.0349885234654262E-3},1.774432274681419E-2,1.774432274681419E-2]
[41,"Chain Saw","Skidder","Processor","Bundler","WT","Residues","Plant",{"$f":"$E$3*'2b Environment'!$D$23","v":1.1825127832156321E-4},null,null,{"$f":"$E$8*'2b Environment'!$D$23","v":4.4170097256402308E-4},null,{"$f":"$E$13*'2b Environment'!$D$23","v":4.0415638989608121E-4},null,null,{"$f":"$E$17","v":1.2958064246138433E-2},null,{"$f":"$E$24","v":5.1736271323471221E-3},null,null,null,{"$f":"$E$36","v":4.3582811073242193E-3},2.345408112659144E-2,2.345408112659144E-2]
[42,"Chain Saw","Skidder","Processor",null,"WT","Logs & residues","Forest road",{"$f":"$E$3","v":1.182512783215632E-3},null,null,{"$f":"$E$8","v":4.4170097256402306E-3},null,{"$f":"$E$13","v":4.0415638989608118E-3},null,null,null,null,{"$f":"$E$25","v":6.5735497681586944E-3},null,null,null,{"$f":"$E$38","v":2.9483255757800581E-3},1.9162961751755428E-2,1.9162961751755428E-2]
[43,"Chain Saw","Skidder","Processor",null,"WT","Logs & residues","Terminal",1.182512783215632E-3,null,null,4.4170097256402306E-3,null,4.0415638989608118E-3,null,null,null,null,6.5735497681586944E-3,null,{"$f":"$E$32","v":1.8918259702598225E-3},{"$f":"$E$33","v":2.3276254545632038E-3},null,2.0434087600798397E-2,2.0434087600798397E-2]
[44,"Chain Saw","Skidder","Processor",null,"WT","Logs & residues","Plant",1.182512783215632E-3,null,null,4.4170097256402306E-3,null,4.0415638989608118E-3,null,null,null,null,6.5735497681586944E-3,null,null,null,{"$f":"$E$37","v":5.9907822391561038E-3},2.2205418415131475E-2,2.2205418415131475E-2]
[45,"Feller-buncher","Chipper","Shuttle",null,"CHIPS","Logs & residues","Stand",null,{"$f":"$E$7","v":6.1876213829011864E-3},null,null,null,null,null,{"$f":"E16","v":3.2288082789767767E-3},null,null,null,{"$f":"E26","v":2.2734608881971773E-2},null,null,{"$f":"$E$38","v":2.9483255757800581E-3},3.5099364119629793E-2,3.5099364119629793E-2]
[46,"Feller-buncher",null,"Forwarder",null,"WT","Logs & residues","Forest road",null,{"$f":"$E$7","v":6.1876213829011864E-3},null,null,{"$f":"$E$11","v":1.1142910898774219E-2},null,null,null,null,null,{"$f":"$E$25","v":6.5735497681586944E-3},null,null,null,{"$f":"$E$38","v":2.9483255757800581E-3},2.6852407625614156E-2,2.6852407625614156E-2]
[47,"Feller-buncher",null,"Forwarder",null,"WT","Logs & residues","Terminal",null,6.1876213829011864E-3,null,null,1.1142910898774219E-2,null,null,null,null,null,6.5735497681586944E-3,null,{"$f":"$E$32","v":1.8918259702598225E-3},{"$f":"$E$33","v":2.3276254545632038E-3},null,2.8123533474657125E-2,2.8123533474657125E-2]
[48,"Feller-buncher",null,"Forwarder",null,"WT","Logs & residues","Plant",null,6.1876213829011864E-3,null,null,1.1142910898774219E-2,null,null,null,null,null,6.5735497681586944E-3,null,null,null,{"$f":"$E$37","v":5.9907822391561038E-3},2.9894864288990203E-2,2.9894864288990203E-2]

{"sheet":"3c Costs","index":27,"n_rows":80,"n_cols":12,"rows_kept":80,"cut":false,"hidden":true,"merged":[[3,1,3,6],[65,1,65,4],[67,1,67,5],[40,3,40,4],[40,5,40,6],[41,3,41,4],[41,5,41,6],[42,3,42,4],[34,5,34,6],[35,5,35,6],[36,5,36,6],[37,5,37,6],[39,5,39,6],[38,5,38,6],[29,5,29,6],[30,5,30,6],[31,5,31,6],[32,5,32,6],[33,5,33,6],[24,5,24,6],[25,5,25,6],[26,5,26,6],[27,5,27,6],[28,5,28,6],[19,5,19,6],[20,5,20,6],[21,5,21,6],[22,5,22,6],[23,5,23,6],[26,1,33,1],[34,1,39,1],[6,5,6,6],[7,5,7,6],[8,5,8,6],[9,5,9,6],[10,5,10,6],[11,5,11,6],[12,5,12,6],[13,5,13,6],[14,5,14,6],[15,5,15,6],[16,5,16,6],[17,5,17,6],[18,5,18,6],[21,3,21,4],[6,1,10,1],[12,1,19,1],[22,1,25,1],[34,3,34,4],[35,3,35,4],[22,3,22,4],[23,3,23,4],[24,3,24,4],[25,3,25,4],[6,3,6,4],[7,3,7,4],[8,3,8,4],[9,3,9,4],[17,3,17,4],[18,3,18,4],[19,3,19,4],[36,3,36,4],[37,3,37,4],[39,3,39,4],[31,3,31,4],[32,3,32,4],[33,3,33,4],[29,3,29,4],[30,3,30,4],[16,3,16,4],[10,3,10,4],[12,3,12,4],[13,3,13,4],[14,3,14,4],[15,3,15,4],[11,3,11,4],[20,3,20,4],[26,3,26,4],[27,3,27,4],[28,3,28,4]]}
[]
[null,"(3c) Costs"]
[]
[null,"This comparison shows the breakdown of energy wood supply costs for an individually compiled supply chain. In addition to the harvesting and transportation costs, purchase price, storage costs as well as overheads for administration and profit are taken into account."]
[null,null,null,null,null,null,{"$f":"VLOOKUP(G6,Specifications!D26:E29,2,FALSE)","v":3}]
[null,"Process",null,"Machines & working method",null,"Costs in","€/m³ solid"]
[null,"Felling, delimbing and crosscutting",null,"Felling with chain saw*",null,{"$f":"IF(Specifications!I8=FALSE,0,IF($G$5=1,'2ca Felling and processing'!F13*'Energy content'!$E$121,IF($G$5=2,'2ca Felling and processing'!F13*'Energy content'!$E$122,IF($G$5=4,'2ca Felling and processing'!F13*'Energy content'!$E$124,'2ca Felling and processing'!F13))))*'2b Environment'!D23/(1+'2b Environment'!$D$27)","v":0},null,null,"Purchasing",{"$f":"IF($G$5=1,'2b Environment'!D25*'Energy content'!$E$121,IF($G$5=2,'2b Environment'!D25*'Energy content'!$E$122,IF($G$5=3,'2b Environment'!D25*'Energy content'!$E$123,IF($G$5=4,'2b Environment'!D25*'Energy content'!$E$124))))","v":1.5},{"$f":"J7/$J$15","v":2.6639710591037594E-2}]
[null,null,null,"Felling and delimbing with chain saw",null,{"$f":"IF(Specifications!I9=FALSE,0,IF($G$5=1,'2ca Felling and processing'!F16*'Energy content'!$E$121,IF($G$5=2,'2ca Felling and processing'!F16*'Energy content'!$E$122,IF($G$5=4,'2ca Felling and processing'!F16*'Energy content'!$E$124,'2ca Felling and processing'!F16))))/(1+'2b Environment'!$D$27)","v":0},null,null,"Felling & Processing",{"$f":"F7+F8+F9+F10+F11+F21","v":22.413793103448278},0.39806464101550432]
[null,null,null,"Felling, delimbing and crosscutting with chain saw",null,{"$f":"IF(Specifications!I10=FALSE,0,IF($G$5=1,'2ca Felling and processing'!F19*'Energy content'!$E$121,IF($G$5=2,'2ca Felling and processing'!F19*'Energy content'!$E$122,IF($G$5=4,'2ca Felling and processing'!F19*'Energy content'!$E$124,'2ca Felling and processing'!F19))))/(1+'2b Environment'!$D$27)","v":0},null,null,"Extracting",{"$f":"F13+F14+F15+F16+F17+F18+F19+F20","v":14},0.24863729884968422]
[null,null,null,"Felling with feller buncher",null,{"$f":"IF(Specifications!I11=FALSE,0,IF($G$5=1,'2ca Felling and processing'!F29*'Energy content'!$E$121,IF($G$5=2,'2ca Felling and processing'!F29*'Energy content'!$E$122,IF($G$5=4,'2ca Felling and processing'!F29*'Energy content'!$E$124,'2ca Felling and processing'!F29))))/(1+'2b Environment'!$D$27)","v":22.413793103448278},null,null,"Bundling",{"$f":"F22","v":0},0]
[null,null,null,"Felling, delimbing and crosscutting with harvester",null,{"$f":"IF(Specifications!I12=FALSE,0,IF($G$5=1,'2ca Felling and processing'!F39*'Energy content'!$E$121,IF($G$5=2,'2ca Felling and processing'!F39*'Energy content'!$E$122,IF($G$5=4,'2ca Felling and processing'!F39*'Energy content'!$E$124,'2ca Felling and processing'!F39))))/(1+'2b Environment'!$D$27)","v":0},null,null,"Chipping",{"$f":"F27+F28+F29+F30+F31+F32+F33+F34","v":12.068965517241381},0.21434249900834848]
[null,"Chipping",null,"Chipping of trees with mobile chipper in stand",null,{"$f":"IF(Specifications!I13=FALSE,0,IF($G$5=1,'2cd Chipping'!F52,IF($G$5=2,'2cd Chipping'!F52*'Energy content'!$C$122,IF($G$5=3,'2cd Chipping'!F52*'Energy content'!$C$123,'2cd Chipping'!F52*'Energy content'!$C$124))))/(1+'2b Environment'!$D$27)","v":0},null,null,"Transporting",{"$f":"F35+F36+F37+F38+F39+F40","v":3.1585086944638392},5.6094505013195108E-2]
[null,"Extracting",null,"Extracting of logs with forwarder ",null,{"$f":"IF(Specifications!I14=FALSE,0,IF($G$5=1,'2cb Extracting'!F14*'Energy content'!$E$121,IF($G$5=2,'2cb Extracting'!F14*'Energy content'!$E$122,IF($G$5=4,'2cb Extracting'!F14*'Energy content'!$E$124,'2cb Extracting'!F14))))/(1+'2b Environment'!$D$27)","v":0},null,null,"Storing",{"$f":"IF($G$5=1,L13*'Energy content'!$E$121,IF($G$5=2,L13*'Energy content'!$E$122,IF($G$5=3,L13*'Energy content'!$E$123,IF($G$5=4,L13*'Energy content'!$E$124))))","v":1},1.7759807060691728E-2,{"$f":"(Specifications!I24+Specifications!I25+Specifications!I26+Specifications!I27)*'2b Environment'!D20+'2b Environment'!D21","v":1}]
[null,null,null,"Extracting of residues with forwarder",null,{"$f":"IF(Specifications!I15=FALSE,0,IF($G$5=1,'2cb Extracting'!F17*'Energy content'!$E$121,IF($G$5=2,'2cb Extracting'!F17*'Energy content'!$E$122,IF($G$5=4,'2cb Extracting'!F17*'Energy content'!$E$124,'2cb Extracting'!F17))))/(1+'2b Environment'!$D$27)","v":0},null,null,"Overheads",{"$f":"SUM(J7:J13)*GKZ","v":2.1656506926061398},3.8461538461538457E-2]
[null,null,null,"Extracting of logs & residues with forwarder",null,{"$f":"IF(Specifications!I16=FALSE,0,IF($G$5=1,'2cb Extracting'!F20*'Energy content'!$E$121,IF($G$5=2,'2cb Extracting'!F20*'Energy content'!$E$122,IF($G$5=4,'2cb Extracting'!F20*'Energy content'!$E$124,'2cb Extracting'!F20))))/(1+'2b Environment'!$D$27)","v":14},null,null,null,{"$f":"SUM(J7:J14)","v":56.306918007759641}]
[null,null,null,"Extracting of stems with skidder",null,{"$f":"IF(Specifications!I17=FALSE,0,IF($G$5=1,'2cb Extracting'!F30*'Energy content'!$E$121,IF($G$5=2,'2cb Extracting'!F30*'Energy content'!$E$122,IF($G$5=4,'2cb Extracting'!F30*'Energy content'!$E$124,'2cb Extracting'!F30))))/(1+'2b Environment'!$D$27)","v":0}]
[null,null,null,"Extracting of trees with skidder*",null,{"$f":"IF(Specifications!I18=FALSE,0,IF($G$5=1,'2cb Extracting'!F33*'Energy content'!$E$121,IF($G$5=2,'2cb Extracting'!F33*'Energy content'!$E$122,IF($G$5=4,'2cb Extracting'!F33*'Energy content'!$E$124,'2cb Extracting'!F33))))*'2b Environment'!D23/(1+'2b Environment'!$D$27)","v":0}]
[null,null,null,"Extracting of stems with tower yarder",null,{"$f":"IF(Specifications!I19=FALSE,0,IF($G$5=1,'2cb Extracting'!F46*'Energy content'!$E$121,IF($G$5=2,'2cb Extracting'!F46*'Energy content'!$E$122,IF($G$5=4,'2cb Extracting'!F46*'Energy content'!$E$124,'2cb Extracting'!F46))))/(1+'2b Environment'!$D$27)","v":0}]
[null,null,null,"Extracting of trees with tower yarder*",null,{"$f":"IF(Specifications!I20=FALSE,0,IF($G$5=1,'2cb Extracting'!F49*'Energy content'!$E$121,IF($G$5=2,'2cb Extracting'!F49*'Energy content'!$E$122,IF($G$5=4,'2cb Extracting'!F49*'Energy content'!$E$124,'2cb Extracting'!F49))))*'2b Environment'!D23/(1+'2b Environment'!$D$27)","v":0}]
[null,null,null,"Extracting of chips with shuttle",null,{"$f":"IF(Specifications!I21=FALSE,0,IF($G$5=1,'2cb Extracting'!F59*'Energy content'!$E$121,IF($G$5=2,'2cb Extracting'!F59*'Energy content'!$E$122,IF($G$5=4,'2cb Extracting'!F59*'Energy content'!$E$124,'2cb Extracting'!F59))))/(1+'2b Environment'!$D$27)","v":0}]
[null,"Processing",null,"Delimbing and crosscutting with processor*",null,{"$f":"IF(Specifications!I22=FALSE,0,IF($G$5=1,'2ca Felling and processing'!F49*'Energy content'!$E$121,IF($G$5=2,'2ca Felling and processing'!F49*'Energy content'!$E$122,IF($G$5=4,'2ca Felling and processing'!F49*'Energy content'!$E$124,'2ca Felling and processing'!F49))))*'2b Environment'!D23/(1+'2b Environment'!$D$27)","v":0}]
[null,"Bundling",null,"Bundling of residues",null,{"$f":"IF(Specifications!I23=FALSE,0,IF($G$5=1,'2cc Bundling'!F13*'Energy content'!$E$121,IF($G$5=2,'2cc Bundling'!F13*'Energy content'!$E$122,IF($G$5=4,'2cc Bundling'!F13*'Energy content'!$E$124,'2cc Bundling'!F13))))/(1+'2b Environment'!$D$27)","v":0}]
[null,"Transporting",null,"Pre-transport of logs",null,{"$f":"IF(Specifications!I24=FALSE,0,IF($G$5=1,'Contribution margin'!E119*'Energy content'!$D$121,IF($G$5=2,'Contribution margin'!E119,IF($G$5=3,'Contribution margin'!E119*'Energy content'!$D$123,'Contribution margin'!E119*'Energy content'!$D$124))))/(1+'2b Environment'!$D$27)","v":0}]
[null,null,null,"Pre-transport of residues",null,{"$f":"IF(Specifications!I25=FALSE,0,IF($G$5=1,'Contribution margin'!E120*'Energy content'!$D$121,IF($G$5=2,'Contribution margin'!E120,IF($G$5=3,'Contribution margin'!E120*'Energy content'!$D$123,'Contribution margin'!E120*'Energy content'!$D$124))))/(1+'2b Environment'!$D$27)","v":0}]
[null,null,null,"Pre-transport of bundles",null,{"$f":"IF(Specifications!I26=FALSE,0,IF($G$5=1,'Contribution margin'!E123*'Energy content'!$D$121,IF($G$5=2,'Contribution margin'!E123,IF($G$5=3,'Contribution margin'!E123*'Energy content'!$D$123,'Contribution margin'!E123*'Energy content'!$D$124))))/(1+'2b Environment'!$D$27)","v":0}]
[null,null,null,"Pre-transport of logs & residues",null,{"$f":"IF(Specifications!I27=FALSE,0,IF($G$5=1,'Contribution margin'!E122*'Energy content'!$D$121,IF($G$5=2,'Contribution margin'!E122,IF($G$5=3,'Contribution margin'!E122*'Energy content'!$D$123,'Contribution margin'!E122*'Energy content'!$D$124))))/(1+'2b Environment'!$D$27)","v":0}]
[null,"Chipping",null,"Chipping of logs with chipper mounted on tractor",null,{"$f":"IF(Specifications!I28=FALSE,0,IF($G$5=1,'2cd Chipping'!F14,IF($G$5=2,'2cd Chipping'!F14*'Energy content'!$C$122,IF($G$5=3,'2cd Chipping'!F14*'Energy content'!$C$123,'2cd Chipping'!F14*'Energy content'!$C$124))))/(1+'2b Environment'!$D$27)","v":0}]
[null,null,null,"Chipping of residues with chipper mounted on tractor",null,{"$f":"IF(Specifications!I29=FALSE,0,IF($G$5=1,'2cd Chipping'!F17,IF($G$5=2,'2cd Chipping'!F17*'Energy content'!$C$122,IF($G$5=3,'2cd Chipping'!F17*'Energy content'!$C$123,'2cd Chipping'!F17*'Energy content'!$C$124))))/(1+'2b Environment'!$D$27)","v":0}]
[null,null,null,"Chipping of bundles with chipper mounted on tractor",null,{"$f":"IF(Specifications!I30=FALSE,0,IF($G$5=1,'2cd Chipping'!F20,IF($G$5=2,'2cd Chipping'!F20*'Energy content'!$C$122,IF($G$5=3,'2cd Chipping'!F20*'Energy content'!$C$123,'2cd Chipping'!F20*'Energy content'!$C$124))))/(1+'2b Environment'!$D$27)","v":0}]
[null,null,null,"Chipping of logs & trees with chipper mounted on tractor",null,{"$f":"IF(Specifications!I31=FALSE,0,IF($G$5=1,'2cd Chipping'!F23,IF($G$5=2,'2cd Chipping'!F23*'Energy content'!$C$122,IF($G$5=3,'2cd Chipping'!F23*'Energy content'!$C$123,'2cd Chipping'!F23*'Energy content'!$C$124))))/(1+'2b Environment'!$D$27)","v":12.068965517241381}]
[null,null,null,"Chipping of logs with chippertruck",null,{"$f":"IF(Specifications!I32=FALSE,0,IF($G$5=1,'2cd Chipping'!F33,IF($G$5=2,'2cd Chipping'!F33*'Energy content'!$C$122,IF($G$5=3,'2cd Chipping'!F33*'Energy content'!$C$123,'2cd Chipping'!F33*'Energy content'!$C$124))))/(1+'2b Environment'!$D$27)","v":0}]
[null,null,null,"Chipping of residues with chippertruck",null,{"$f":"IF(Specifications!I33=FALSE,0,IF($G$5=1,'2cd Chipping'!F36,IF($G$5=2,'2cd Chipping'!F36*'Energy content'!$C$122,IF($G$5=3,'2cd Chipping'!F36*'Energy content'!$C$123,'2cd Chipping'!F36*'Energy content'!$C$124))))/(1+'2b Environment'!$D$27)","v":0}]
[null,null,null,"Chipping of bundles with chippertruck",null,{"$f":"IF(Specifications!I34=FALSE,0,IF($G$5=1,'2cd Chipping'!F39,IF($G$5=2,'2cd Chipping'!F39*'Energy content'!$C$122,IF($G$5=3,'2cd Chipping'!F39*'Energy content'!$C$123,'2cd Chipping'!F39*'Energy content'!$C$124))))/(1+'2b Environment'!$D$27)","v":0}]
[null,null,null,"Chipping of logs & trees with chippertruck",null,{"$f":"IF(Specifications!I35=FALSE,0,IF($G$5=1,'2cd Chipping'!F42,IF($G$5=2,'2cd Chipping'!F42*'Energy content'!$C$122,IF($G$5=3,'2cd Chipping'!F42*'Energy content'!$C$123,'2cd Chipping'!F42*'Energy content'!$C$124))))/(1+'2b Environment'!$D$27)","v":0}]
[null,"Transporting",null,"Direct transport of logs",null,{"$f":"IF(Specifications!I36=FALSE,0,IF($G$5=1,'Contribution margin'!G119*'Energy content'!$D$121,IF($G$5=2,'Contribution margin'!G119,IF($G$5=3,'Contribution margin'!G119*'Energy content'!$D$123,'Contribution margin'!G119*'Energy content'!$D$124))))/(1+'2b Environment'!$D$27)","v":0}]
[null,null,null,"Direct transport of residues",null,{"$f":"IF(Specifications!I37=FALSE,0,IF($G$5=1,'Contribution margin'!G120*'Energy content'!$D$121,IF($G$5=2,'Contribution margin'!G120,IF($G$5=3,'Contribution margin'!G120*'Energy content'!$D$123,'Contribution margin'!G120*'Energy content'!$D$124))))/(1+'2b Environment'!$D$27)","v":0}]
[null,null,null,"Direct transport of bundles",null,{"$f":"IF(Specifications!I38=FALSE,0,IF($G$5=1,'Contribution margin'!G123*'Energy content'!$D$121,IF($G$5=2,'Contribution margin'!G123,IF($G$5=3,'Contribution margin'!G123*'Energy content'!$D$123,'Contribution margin'!G123*'Energy content'!$D$124))))/(1+'2b Environment'!$D$27)","v":0}]
[null,null,null,"Direct transport of logs & residues",null,{"$f":"IF(Specifications!I39=FALSE,0,IF($G$5=1,'Contribution margin'!G122*'Energy content'!$D$121,IF($G$5=2,'Contribution margin'!G122,IF($G$5=3,'Contribution margin'!G122*'Energy content'!$D$123,'Contribution margin'!G122*'Energy content'!$D$124))))/(1+'2b Environment'!$D$27)","v":0}]
[null,null,null,"Main transport of chips",null,{"$f":"IF(Specifications!I40=FALSE,0,IF($G$5=1,'Contribution margin'!F121*'Energy content'!$D$121,IF($G$5=2,'Contribution margin'!F121,IF($G$5=3,'Contribution margin'!F121*'Energy content'!$D$123,'Contribution margin'!F121*'Energy content'!$D$124))))/(1+'2b Environment'!$D$27)","v":0}]
[null,null,null,"Direct transport of chips",null,{"$f":"IF(Specifications!I41=FALSE,0,IF($G$5=1,'Contribution margin'!G121*'Energy content'!$D$121,IF($G$5=2,'Contribution margin'!G121,IF($G$5=3,'Contribution margin'!G121*'Energy content'!$D$123,'Contribution margin'!G121*'Energy content'!$D$124))))/(1+'2b Environment'!$D$27)","v":3.1585086944638392}]
[null,null,null,{"$f":"\"SUM of supply costs in \" &G6","v":"SUM of supply costs in €/m³ solid"},null,{"$f":"SUM(F7:G40)","v":51.641267315153499}]
[null,null,null,{"$f":"\"SUM of supply costs in € for \" &'2b Environment'!D7 & \" m³\"","v":"SUM of supply costs in € for 280 m³"},null,{"$f":"IF(G5=1,F41*'Energy content'!C123*'2b Environment'!D7,IF(G5=2,F41*'Energy content'!D123*'2b Environment'!D7,IF(G5=3,F41*'2b Environment'!D7,IF(G5=4,F41*'Energy content'!F123*'2b Environment'!D7))))","v":14459.55484824298}]
[null,null,null,"* considers by-production"]
[]
[]
[]
[]
[]
[]
[]
[]
[]
[]
[]
[]
[]
[]
[]
[]
[]
[]
[]
[]
[]
[]
[null,"Fuel comparison"]
[]
[null,"   Source: Austrian Biomass Association (Status: March 2012)"]
[]
[null,"   Electrical power",null,null,"€/MWh",187.7]
[]
[null,"   Natural gas",null,null,"€/MWh",86.2]
[]
[null,"   Fuel oil extra light",null,null,"€/MWh",103.6]
[]
[null,"   Pellets 6 mm",null,null,"€/MWh",47.1]
[]
[null,"   Hard wood",null,null,"€/MWh",43.1]
[]
[null,"   Wood chips",null,null,"€/MWh",{"$f":"IF(G5=1,F41*'Energy content'!C122,IF(G5=2,F41,IF(G5=3,F41*'Energy content'!E122,F41*'Energy content'!F122)))","v":27.4158629778149}]

{"sheet":"-","index":28,"n_rows":0,"n_cols":0,"rows_kept":0,"cut":false,"hidden":false,"merged":[]}

{"sheet":"Damage","index":29,"n_rows":75,"n_cols":25,"rows_kept":75,"cut":false,"hidden":true,"merged":[]}
[null,"Damage"]
["Chain saw",15,{"$f":"B2/100","v":0.15}]
["Feller buncher",10,{"$f":"B3/100","v":0.1}]
["Wheeled harvester",7,7.0000000000000007E-2]
["Tracked harvester",7,7.0000000000000007E-2]
["Wood pick",30,0.3]
["Horse",22,0.22]
["Log-Line",5,0.05]
["Forwarder",4,0.04]
["Cable forwarder",5,0.05]
["Tractor and timber trailer",4,0.04]
["Skidder",12,0.12]
["Tower yarder",17,0.17]
["Helicopter",1,0.01]
["Shuttle",9,0.09]
["Processor",0,0]
["Bundler",0,0]
["Chipper",0,0]
["Mobile chipper",8,0.08]
["Truck for round wood",0,0]
["Container truck",0,0]
["Tractor and trailer",0,0]
["Truck for chips",0,0]
["none",0,0]
[]
[]
[null,null,null,null,null,null,null,null,"Chin saw","Feller buncher","Damage","Harvester","Damage","Processor","Damage","Forwarder","Damage","Skidder","Damage","Tower yarder","Damage","Shuttle","Damage","Mobile chipper","Damage"]
[1,"Chain Saw",null,"Forwarder",null,"CTL","Logs","Forest road",{"$f":"$C$2","v":0.15},null,{"$f":"I28+(1-I28)*J28","v":0.15},null,{"$f":"K28+(1-K28)*L28","v":0.15},null,{"$f":"M28+(1-M28)*N28","v":0.15},{"$f":"$C$9","v":0.04},{"$f":"O28+(1-O28)*P28","v":0.184},null,{"$f":"Q28+(1-Q28)*R28","v":0.184},null,{"$f":"S28+(1-S28)*T28","v":0.184},null,{"$f":"U28+(1-U28)*V28","v":0.184},null,{"$f":"W28+(1-W28)*X28","v":0.184}]
[2,"Chain Saw",null,"Forwarder",null,"CTL","Logs","Terminal",{"$f":"$C$2","v":0.15},null,0.15,null,{"$f":"K29+(1-K29)*L29","v":0.15},null,0.15,{"$f":"$C$9","v":0.04},0.184,null,0.184,null,0.184,null,0.184,null,{"$f":"W29+(1-W29)*X29","v":0.184}]
[3,"Chain Saw",null,"Forwarder",null,"CTL","Logs","Plant",0.15,null,0.15,null,0.15,null,0.15,0.04,0.184,null,0.184,null,0.184,null,0.184,null,0.184]
[4,"Chain Saw",null,"Forwarder",null,"CTL","Residues","Forest road",{"$f":"$C$2*'2b Environment'!$D$23","v":1.4999999999999999E-2},null,1.4999999999999999E-2,null,1.4999999999999999E-2,null,1.4999999999999999E-2,0.04,5.4399999999999997E-2,null,5.4399999999999997E-2,null,5.4399999999999997E-2,null,5.4399999999999997E-2,null,5.4399999999999997E-2]
[5,"Chain Saw",null,"Forwarder",null,"CTL","Residues","Terminal",{"$f":"$C$2*'2b Environment'!$D$23","v":1.4999999999999999E-2},null,1.4999999999999999E-2,null,1.4999999999999999E-2,null,1.4999999999999999E-2,0.04,5.4399999999999997E-2,null,5.4399999999999997E-2,null,5.4399999999999997E-2,null,5.4399999999999997E-2,null,5.4399999999999997E-2]
[6,"Chain Saw",null,"Forwarder","Bundler","CTL","Residues","Terminal",{"$f":"$C$2*'2b Environment'!$D$23","v":1.4999999999999999E-2},null,1.4999999999999999E-2,null,1.4999999999999999E-2,null,1.4999999999999999E-2,0.04,5.4399999999999997E-2,null,5.4399999999999997E-2,null,5.4399999999999997E-2,null,5.4399999999999997E-2,null,5.4399999999999997E-2]
[7,"Chain Saw",null,"Forwarder",null,"CTL","Residues","Plant",{"$f":"$C$2*'2b Environment'!$D$23","v":1.4999999999999999E-2},null,1.4999999999999999E-2,null,1.4999999999999999E-2,null,1.4999999999999999E-2,0.04,5.4399999999999997E-2,null,5.4399999999999997E-2,null,5.4399999999999997E-2,null,5.4399999999999997E-2,null,5.4399999999999997E-2]
[8,"Chain Saw",null,"Forwarder","Bundler","CTL","Residues","Plant",{"$f":"$C$2*'2b Environment'!$D$23","v":1.4999999999999999E-2},null,1.4999999999999999E-2,null,1.4999999999999999E-2,null,1.4999999999999999E-2,0.04,5.4399999999999997E-2,null,5.4399999999999997E-2,null,5.4399999999999997E-2,null,5.4399999999999997E-2,null,5.4399999999999997E-2]
[9,"Chain Saw",null,"Forwarder",null,"CTL","Logs & residues","Forest road",0.15,null,0.15,null,0.15,null,0.15,0.04,0.184,null,0.184,null,0.184,null,0.184,null,0.184]
[10,"Chain Saw",null,"Forwarder",null,"CTL","Logs & residues","Terminal",0.15,null,0.15,null,0.15,null,0.15,0.04,0.184,null,0.184,null,0.184,null,0.184,null,0.184]
[11,"Chain Saw",null,"Forwarder",null,"CTL","Logs & residues","Plant",0.15,null,0.15,null,0.15,null,0.15,0.04,0.184,null,0.184,null,0.184,null,0.184,null,0.184]
[12,"Harvester",null,"Forwarder",null,"CTL","Logs","Forest road",null,null,0,{"$f":"$C$4","v":7.0000000000000007E-2},7.0000000000000007E-2,null,7.0000000000000007E-2,0.04,0.1072,null,0.1072,null,0.1072,null,0.1072,null,0.1072]
[13,"Harvester",null,"Forwarder",null,"CTL","Logs","Terminal",null,null,0,{"$f":"$C$4","v":7.0000000000000007E-2},7.0000000000000007E-2,null,7.0000000000000007E-2,0.04,0.1072,null,0.1072,null,0.1072,null,0.1072,null,0.1072]
[14,"Harvester",null,"Forwarder",null,"CTL","Logs","Plant",null,null,0,7.0000000000000007E-2,7.0000000000000007E-2,null,7.0000000000000007E-2,0.04,0.1072,null,0.1072,null,0.1072,null,0.1072,null,0.1072]
[15,"Harvester",null,"Forwarder",null,"CTL","Residues","Forest road",null,null,0,{"$f":"$C$4*'2b Environment'!$D$23","v":7.000000000000001E-3},7.000000000000001E-3,null,7.000000000000001E-3,0.04,4.6719999999999998E-2,null,4.6719999999999998E-2,null,4.6719999999999998E-2,null,4.6719999999999998E-2,null,4.6719999999999998E-2]
[16,"Harvester",null,"Forwarder",null,"CTL","Residues","Terminal",null,null,0,{"$f":"$C$4*'2b Environment'!$D$23","v":7.000000000000001E-3},7.000000000000001E-3,null,7.000000000000001E-3,0.04,4.6719999999999998E-2,null,4.6719999999999998E-2,null,4.6719999999999998E-2,null,4.6719999999999998E-2,null,4.6719999999999998E-2]
[17,"Harvester",null,"Forwarder","Bundler","CTL","Residues","Terminal",null,null,0,{"$f":"$C$4*'2b Environment'!$D$23","v":7.000000000000001E-3},7.000000000000001E-3,null,7.000000000000001E-3,0.04,4.6719999999999998E-2,null,4.6719999999999998E-2,null,4.6719999999999998E-2,null,4.6719999999999998E-2,null,4.6719999999999998E-2]
[18,"Harvester",null,"Forwarder",null,"CTL","Residues","Plant",null,null,0,{"$f":"$C$4*'2b Environment'!$D$23","v":7.000000000000001E-3},7.000000000000001E-3,null,7.000000000000001E-3,0.04,4.6719999999999998E-2,null,4.6719999999999998E-2,null,4.6719999999999998E-2,null,4.6719999999999998E-2,null,4.6719999999999998E-2]
[19,"Harvester",null,"Forwarder","Bundler","CTL","Residues","Plant",null,null,0,{"$f":"$C$4*'2b Environment'!$D$23","v":7.000000000000001E-3},7.000000000000001E-3,null,7.000000000000001E-3,0.04,4.6719999999999998E-2,null,4.6719999999999998E-2,null,4.6719999999999998E-2,null,4.6719999999999998E-2,null,4.6719999999999998E-2]
[20,"Harvester",null,"Forwarder",null,"CTL","Logs & residues","Forest road",null,null,0,7.0000000000000007E-2,7.0000000000000007E-2,null,7.0000000000000007E-2,0.04,0.1072,null,0.1072,null,0.1072,null,0.1072,null,0.1072]
[21,"Harvester",null,"Forwarder",null,"CTL","Logs & residues","Terminal",null,null,0,7.0000000000000007E-2,7.0000000000000007E-2,null,7.0000000000000007E-2,0.04,0.1072,null,0.1072,null,0.1072,null,0.1072,null,0.1072]
[22,"Harvester",null,"Forwarder",null,"CTL","Logs & residues","Plant",null,null,0,7.0000000000000007E-2,7.0000000000000007E-2,null,7.0000000000000007E-2,0.04,0.1072,null,0.1072,null,0.1072,null,{"$f":"U49+(1-U49)*V49","v":0.1072},null,0.1072]
[23,"Chain Saw",null,"Tower Yarder",null,"TL","Logs","Forest road",{"$f":"$C$2","v":0.15},null,0.15,null,0.15,null,0.15,null,0.15,null,0.15,{"$f":"$C$13","v":0.17},0.29449999999999998,null,0.29449999999999998,null,0.29449999999999998]
[24,"Chain Saw",null,"Tower Yarder",null,"TL","Logs","Terminal",0.15,null,0.15,null,0.15,null,0.15,null,0.15,null,0.15,{"$f":"$C$13","v":0.17},0.29449999999999998,null,0.29449999999999998,null,0.29449999999999998]
[25,"Chain Saw",null,"Tower Yarder",null,"TL","Logs","Plant",0.15,null,0.15,null,0.15,null,0.15,null,0.15,null,0.15,0.17,0.29449999999999998,null,0.29449999999999998,null,0.29449999999999998]
[26,"Chain Saw","Processor","Tower Yarder",null,"WT","Residues","Forest road",{"$f":"$C$2*'2b Environment'!$D$23","v":1.4999999999999999E-2},null,1.4999999999999999E-2,null,1.4999999999999999E-2,{"$f":"$C$16","v":0},1.4999999999999999E-2,null,1.4999999999999999E-2,null,1.4999999999999999E-2,{"$f":"$C$13*'2b Environment'!$D$23","v":1.7000000000000001E-2},3.1744999999999995E-2,null,3.1744999999999995E-2,null,3.1744999999999995E-2]
[27,"Chain Saw","Processor","Tower Yarder",null,"WT","Residues","Terminal",{"$f":"$C$2*'2b Environment'!$D$23","v":1.4999999999999999E-2},null,1.4999999999999999E-2,null,1.4999999999999999E-2,{"$f":"$C$16","v":0},1.4999999999999999E-2,null,1.4999999999999999E-2,null,1.4999999999999999E-2,{"$f":"$C$13*'2b Environment'!$D$23","v":1.7000000000000001E-2},3.1744999999999995E-2,null,3.1744999999999995E-2,null,3.1744999999999995E-2]
[28,"Chain Saw","Processor","Tower Yarder","Bundler","WT","Residues","Terminal",{"$f":"$C$2*'2b Environment'!$D$23","v":1.4999999999999999E-2},null,1.4999999999999999E-2,null,1.4999999999999999E-2,0,1.4999999999999999E-2,null,1.4999999999999999E-2,null,1.4999999999999999E-2,{"$f":"$C$13*'2b Environment'!$D$23","v":1.7000000000000001E-2},3.1744999999999995E-2,null,3.1744999999999995E-2,null,3.1744999999999995E-2]
[29,"Chain Saw","Processor","Tower Yarder",null,"WT","Residues","Plant",{"$f":"$C$2*'2b Environment'!$D$23","v":1.4999999999999999E-2},null,1.4999999999999999E-2,null,1.4999999999999999E-2,0,1.4999999999999999E-2,null,1.4999999999999999E-2,null,1.4999999999999999E-2,{"$f":"$C$13*'2b Environment'!$D$23","v":1.7000000000000001E-2},3.1744999999999995E-2,null,3.1744999999999995E-2,null,3.1744999999999995E-2]
[30,"Chain Saw","Processor","Tower Yarder","Bundler","WT","Residues","Plant",{"$f":"$C$2*'2b Environment'!$D$23","v":1.4999999999999999E-2},null,1.4999999999999999E-2,null,1.4999999999999999E-2,0,1.4999999999999999E-2,null,1.4999999999999999E-2,null,1.4999999999999999E-2,{"$f":"$C$13*'2b Environment'!$D$23","v":1.7000000000000001E-2},3.1744999999999995E-2,null,3.1744999999999995E-2,null,3.1744999999999995E-2]
[31,"Chain Saw","Processor","Tower Yarder",null,"WT","Logs & residues","Forest road",0.15,null,0.15,null,0.15,0,0.15,null,0.15,null,0.15,0.17,0.29449999999999998,null,0.29449999999999998,null,0.29449999999999998]
[32,"Chain Saw","Processor","Tower Yarder",null,"WT","Logs & residues","Terminal",0.15,null,0.15,null,0.15,0,0.15,null,0.15,null,0.15,0.17,0.29449999999999998,null,0.29449999999999998,null,0.29449999999999998]
[33,"Chain Saw","Processor","Tower Yarder",null,"WT","Logs & residues","Plant",0.15,null,0.15,null,0.15,0,0.15,null,0.15,null,0.15,0.17,0.29449999999999998,null,0.29449999999999998,null,0.29449999999999998]
[34,"Chain Saw",null,"Skidder",null,"TL","Logs","Forest road",0.15,null,0.15,null,0.15,null,0.15,null,0.15,{"$f":"$C$13","v":0.17},0.29449999999999998,null,0.29449999999999998,null,0.29449999999999998,null,0.29449999999999998]
[35,"Chain Saw",null,"Skidder",null,"TL","Logs","Terminal",0.15,null,0.15,null,0.15,null,0.15,null,0.15,{"$f":"$C$13","v":0.17},0.29449999999999998,null,0.29449999999999998,null,0.29449999999999998,null,0.29449999999999998]
[36,"Chain Saw",null,"Skidder",null,"TL","Logs","Plant",0.15,null,0.15,null,0.15,null,0.15,null,0.15,0.17,0.29449999999999998,null,0.29449999999999998,null,0.29449999999999998,null,0.29449999999999998]
[37,"Chain Saw","Skidder","Processor",null,"WT","Residues","Forest road",{"$f":"$C$2*'2b Environment'!$D$23","v":1.4999999999999999E-2},null,1.4999999999999999E-2,null,1.4999999999999999E-2,{"$f":"$C$16","v":0},1.4999999999999999E-2,null,1.4999999999999999E-2,{"$f":"$C$13*'2b Environment'!$D$23","v":1.7000000000000001E-2},3.1744999999999995E-2,null,3.1744999999999995E-2,null,3.1744999999999995E-2,null,3.1744999999999995E-2]
[38,"Chain Saw","Skidder","Processor",null,"WT","Residues","Terminal",{"$f":"$C$2*'2b Environment'!$D$23","v":1.4999999999999999E-2},null,1.4999999999999999E-2,null,1.4999999999999999E-2,0,1.4999999999999999E-2,null,1.4999999999999999E-2,{"$f":"$C$13*'2b Environment'!$D$23","v":1.7000000000000001E-2},3.1744999999999995E-2,null,3.1744999999999995E-2,null,3.1744999999999995E-2,null,3.1744999999999995E-2]
[39,"Chain Saw","Skidder","Processor","Bundler","WT","Residues","Terminal",{"$f":"$C$2*'2b Environment'!$D$23","v":1.4999999999999999E-2},null,1.4999999999999999E-2,null,1.4999999999999999E-2,0,1.4999999999999999E-2,null,1.4999999999999999E-2,{"$f":"$C$13*'2b Environment'!$D$23","v":1.7000000000000001E-2},3.1744999999999995E-2,null,3.1744999999999995E-2,null,3.1744999999999995E-2,null,3.1744999999999995E-2]
[40,"Chain Saw","Skidder","Processor",null,"WT","Residues","Plant",{"$f":"$C$2*'2b Environment'!$D$23","v":1.4999999999999999E-2},null,1.4999999999999999E-2,null,1.4999999999999999E-2,0,1.4999999999999999E-2,null,1.4999999999999999E-2,{"$f":"$C$13*'2b Environment'!$D$23","v":1.7000000000000001E-2},3.1744999999999995E-2,null,3.1744999999999995E-2,null,3.1744999999999995E-2,null,3.1744999999999995E-2]
[41,"Chain Saw","Skidder","Processor","Bundler","WT","Residues","Plant",{"$f":"$C$2*'2b Environment'!$D$23","v":1.4999999999999999E-2},null,1.4999999999999999E-2,null,1.4999999999999999E-2,0,1.4999999999999999E-2,null,1.4999999999999999E-2,{"$f":"$C$13*'2b Environment'!$D$23","v":1.7000000000000001E-2},3.1744999999999995E-2,null,3.1744999999999995E-2,null,3.1744999999999995E-2,null,3.1744999999999995E-2]
[42,"Chain Saw","Skidder","Processor",null,"WT","Logs & residues","Forest road",0.15,null,0.15,null,0.15,0,0.15,null,0.15,0.17,0.29449999999999998,null,0.29449999999999998,null,0.29449999999999998,null,0.29449999999999998]
[43,"Chain Saw","Skidder","Processor",null,"WT","Logs & residues","Terminal",0.15,null,0.15,null,0.15,0,0.15,null,0.15,0.17,0.29449999999999998,null,0.29449999999999998,null,0.29449999999999998,null,0.29449999999999998]
[44,"Chain Saw","Skidder","Processor",null,"WT","Logs & residues","Plant",0.15,null,0.15,null,0.15,0,0.15,null,0.15,0.17,0.29449999999999998,null,0.29449999999999998,null,0.29449999999999998,null,0.29449999999999998]
[45,"Feller-buncher","Chipper","Shuttle",null,"CHIPS","Logs & residues","Stand",null,{"$f":"$C$3","v":0.1},0.1,null,0.1,null,0.1,null,0.1,null,0.1,null,0.1,{"$f":"$C$15","v":0.09},0.18099999999999999,{"$f":"C19","v":0.08},0.24651999999999999]
[46,"Feller-buncher",null,"Forwarder",null,"WT","Logs & residues","Forest road",null,{"$f":"$C$3","v":0.1},0.1,null,0.1,null,0.1,{"$f":"$C$9","v":0.04},0.13600000000000001,null,0.13600000000000001,null,0.13600000000000001,null,0.13600000000000001,null,0.13600000000000001]
[47,"Feller-buncher",null,"Forwarder",null,"WT","Logs & residues","Terminal",null,0.1,0.1,null,0.1,null,0.1,0.04,0.13600000000000001,null,0.13600000000000001,null,0.13600000000000001,null,0.13600000000000001,null,0.13600000000000001]
[48,"Feller-buncher",null,"Forwarder",null,"WT","Logs & residues","Plant",null,0.1,0.1,null,0.1,null,0.1,0.04,0.13600000000000001,null,0.13600000000000001,null,0.13600000000000001,null,0.13600000000000001,null,0.13600000000000001]