{"text_format":"1","workbook":"xlsx","n_sheets":20,"sheets":["Konfig","Jänner","Februar","März","April","Mai","Juni","Juli","August","September","Oktober","November","Dezember","Monat","Hilfskonfig","Format","Feiertage","MakroTest","Dummy","Test"],"not_rendered":{"charts":0,"images":7,"macros":1,"external_links":0,"defined_names":100,"comments":0,"pivot_tables":0},"unopened":[],"bounds":{"document_bytes":16777216,"sheet_cells":100000,"rows_first":2000,"rows_last":500,"rows_between":2000,"halvings":0,"cell_chars":16384,"cell_head_chars":4096},"cells_cut":0,"cells_raw":0,"read":"whole","date_system":"1900"}

{"sheet":"Konfig","index":0,"n_rows":20,"n_cols":35,"rows_kept":20,"cut":false,"hidden":true,"merged":[[0,19,0,21],[11,29,12,29],[11,32,12,32],[11,28,12,28],[11,19,11,22],[11,34,12,34],[10,30,10,31],[11,17,11,18],[9,10,9,11],[10,10,10,11],[11,14,11,16],[11,33,12,33],[11,12,11,13],[18,0,18,4],[0,9,1,9],[1,0,1,2],[2,1,2,4],[9,9,10,9],[8,4,8,8],[7,0,7,9],[4,6,4,9],[5,6,5,9],[8,0,12,0],[10,1,11,3],[8,1,9,3],[12,6,12,9],[11,6,11,9],[9,4,10,8],[19,6,19,9],[6,6,6,9],[2,0,6,0],[2,5,2,8],[3,5,3,8],[3,1,3,4],[4,1,4,4],[5,1,5,4],[6,1,6,4],[19,0,19,4],[17,6,17,9],[13,6,13,9],[14,6,14,9],[15,6,15,9],[16,6,16,9],[18,6,18,9]]}
[" BOKU-Zeiterfassung für Wissenschaftliches Personal",null,null,null,null,null,null,null,null,null,"Jahressaldo","Kernzeit%","KZOK","WAZVZOK","WAZTZOK","WAZOK","KonfigOK","Tages\nEinträge","Adresse\nTages Einträge","KZSL-Tabelle",null,null,"KZSZeile","MacroTest","AktivesSheet"]
[{"$f":"\" Konfigurationstabelle\"","v":" Konfigurationstabelle"},null,null,null,null,null,null,null,null,null,{"$f":"\"Dezember!$J$42\"","v":"Dezember!$J$42"},null,null,{"$f":"AND(Zeitmodell=\"Vollzeit\",WAZ*24=40)","v":true},{"$f":"AND(Zeitmodell=\"Teilzeit\",WAZ*24<40,WAZ*24>0)","v":false},{"$f":"OR(WAZVZOK,WAZTZOK)","v":true},{"$f":"WAZOK","v":true},{"$f":"IF(ISERROR(INDIRECT($S$2)),0,INDIRECT($S$2))","v":0},"Dezember!$S$3","Nummer","KZSL-Adr","KZSR-Adr",0,false,"Konfig"]
["Allgemein","Mitarbeiter: ",null,null,null,"Vorname Nachname",null,null,null,"< Vor- und Nachname \n< des Mitarbeiters",null,null,null,null,null,null,null,null,null,0,false,false,null,"Konfig"]
[null,"Vorgesetzer: ",null,null,null,"Vorname Nachname",null,null,null,"< Vor- und Nachname \n< des Vorgesetzten",null,null,null,null,null,null,null,null,null,1,{"$f":"\"$AH14\"","v":"$AH14"},{"$f":"\"$AI14\"","v":"$AI14"}]
[null,"Org.-Einheit: ",null,null,null,"Hxxxxx","< Hier die Einrichtung eingeben",null,null,null,"Gültigkeit Jahr und Übertrag",null,null,null,null,null,null,null,null,2,{"$f":"\"$AH15\"","v":"$AH15"},{"$f":"\"$AI15\"","v":"$AI15"}]
[null,"Jahr: ",null,null,null,2024,"< Hier das Jahr eingeben (Achtung: Bei dieser Eingabe werden alle Monatsblätter neu erstellt und\n< alle Ihre Eingaben in den Monatsblättern werden unwiderruflich gelöscht.)",null,null,null,{"$f":"AND(ISNUMBER($F$6),$F$6=INT($F$6),$F$6>2009,$F$6<8000)","v":true},null,null,null,null,null,null,null,null,3,{"$f":"\"$AH16\"","v":"$AH16"},{"$f":"\"$AI16\"","v":"$AI16"}]
[null,"Arbeitsstunden-Übertrag Vorjahr: ",null,null,null,0,"< Hier den Arbeitsstunden-Übertrag des Vorjahres (max. 24,00 Std.) eingeben",null,null,null,{"$f":"AND(ISNUMBER($F$7))","v":true},null,null,null,null,null,null,null,null,4,{"$f":"\"$AH17\"","v":"$AH17"},{"$f":"\"$AI17\"","v":"$AI17"}]
[{"$f":"\" Definition der Normalarbeitszeit (=Dienstplan)\"&IF(Zeitmodell=\"Teilzeit\",\" und ermitteln der Kernzeit \",\"\")&\" für die Woche\"","v":" Definition der Normalarbeitszeit (=Dienstplan) für die Woche"},null,null,null,null,null,null,null,null,null,"Text bei Vollzeit","Text bei Teilzeit","Text bei VZ Gesperrt","Text bei TZ Gesperrt","KernzeitText bei VZ","KernzeitText bei TZ",null,null,null,5,{"$f":"\"$AH18\"","v":"$AH18"},{"$f":"\"$AI18\"","v":"$AI18"}]
["Wochentage",{"$f":"\"Normalarbeitszeit\"&CHAR(10)&\"(=Dienstplan) \"&TEXT(WAZ,\"[hh]:mm\")&\"h\"","v":"Normalarbeitszeit\n(=Dienstplan) 40:00h"},null,null,{"$f":"IF(MakroTest,\" Eingabestatus: \"&IF(KonfigOK,\"OK\",\"Fehler!\"),\"Makros sind nicht aktiv!\")","v":"Makros sind nicht aktiv!"},null,null,null,null,{"$f":"IF(TEin=0,IF(Zeitmodell=\"Vollzeit\",$K$9,$L$9),IF(Zeitmodell=\"Vollzeit\",$M$9,$N$9))","v":"Momentan ist der Vollzeitmodus aktiviert. Klicken Sie mit der linken Maustaste auf die Schaltfläche darunter für Teilzeitmodus"},"Momentan ist der Vollzeitmodus aktiviert. Klicken Sie mit der linken Maustaste auf die Schaltfläche darunter für Teilzeitmodus","Momentan ist der Teilzeitmodus aktiviert. Klicken Sie mit der linken Maustaste auf die Schaltfläche darunter für Vollzeitmodus","Momentan ist der Vollzeitmodus aktiviert. \nDer Zeitmodus kann nicht verändert werden, da in \nden Monatsblättern \nEinträge vorhanden sind.","Momentan ist der Teilzeitmodus aktiviert. \nDer Zeitmodus kann nicht verändert werden, da in \nden Monatsblättern \nEinträge vorhanden sind.","  Achtung: Die Kernzeit ist im Vollzeitmodus vorgegeben und kann hier nicht verändert werden."," Die Kernzeit berechnet sich im Teilzeitmodus automatisch. Mit den Schaltflächen \"15min\" darf\n die Kernzeit für jeden Tag in 15min-Schritten innerhalb der Normalarbeitszeit verschoben werden."]
[null,null,null,null,{"$f":"IF(MakroTest,IF(TEin=0,IF($M$11=\"\",\"Alle Eingaben sind korrekt durchgeführt!\",$M$11),\"Achtung: Sie können bei der Dienstplankonfiguration keine Änderungen mehr vornehmen, da Sie in den Monatsblättern Daten eingetragen haben!\"),\"Bitte lesen Sie unten in der Beschreibung mehr über das Einschalten von Makros nach. Ohne Makros funktioniert die Tabelle nicht!\")","v":"Bitte lesen Sie unten in der Beschreibung mehr über das Einschalten von Makros nach. Ohne Makros funktioniert die Tabelle nicht!"},null,null,null,null,null,"Statustext",null,"FehlerMldg"]
[null,"Vollzeit",null,null,null,null,null,null,null,null,"Eingabestatus: ",null,{"$f":"IF(Zeitmodell=\"Teilzeit\",IF(NOT(WAZOK),\"Teilzeit-Fehler: Wochenarbeitszeit ist größer,gleich 40 Stunden oder 0!\"&CHAR(10),\"\"),IF(NOT(WAZOK),\" Vollzeit Fehler: Die Normalarbeitszeit beträgt nicht 40 Stunden!\",\"\"))","v":""},null,null,null,null,null,null,null,null,null,null,null,null,null,null,null,null,null,"KZShift-Status"]
[null,null,null,null,"TAZ","TAZ-MP"," Beschreibung der Eingabe- und Berechnungsfelder",null,null,null,null,null,null,null,"NAZ gültig",null,null,null,null,"Umrechnung auf 25-Minutenwerte",null,null,null,"Abzugswerte",null,null,null,null,"75%NAZ","Offset \nKZ-Beginn","KZSL","KZSR","Offset Toleranz","Offset NAZ-Änderung","Offset Teilzeit Standard"]
[null,"Normal AZ Von","Mittags Pause","Normal AZ Bis","Tages Arbeitszeit","Tages-AZ minus MP","Achtung Mittagspause: Ab sechs Stunden Arbeitszeit, muß eine Mittagspause von mindestens 30 min konsumiert werden. Wenn Ihr Arbeitsvertrag keine bezahlte Mittagspause beinhaltet, so tragen Sie bitte für jeden Tag eine Mittagspause von mindestens 30min ein, auch wenn Sie Ihre Normalarbeitszeit an diesem Tag mit weniger als 6 Stunden definieren. In den Monatsblättern wird, dann je nach den wirklichen Arbeitszeiten die hier definierte Mittagspause ab 6 Stunden realer Arbeitszeit berücksichtigt.",null,null,null,"MP","eing. MP mitrechnen","Von","Bis","Von","MP","Bis","Von","Bis","NAZ-Von25","Kern-Von25","Kern-Bis25","NAZ-Bis25","NAZ25","KernZeit25","KZ% von NAZ","(NAZ-KZ)/2","KZ% von NAZ",null,null,{"$f":"IF(OR(KZSZeile=0,Zeitmodell=\"Vollzeit\",TEin>0,NOT(MakroTest)),FALSE,INDIRECT(VLOOKUP(KZSZeile,KZSTab,2,FALSE)))","v":false},{"$f":"IF(OR(KZSZeile=0,Zeitmodell=\"Vollzeit\",TEin>0,NOT(MakroTest)),FALSE,INDIRECT(VLOOKUP(KZSZeile,KZSTab,3,FALSE)))","v":false}]
["Mo","08:00:00","00:00:00","16:00:00",{"$f":"$D14-$B14","v":"08:00:00"},{"$f":"$D14-$B14-$K14","v":"08:00:00"},{"$f":"\"< Von- und Bis-Normal-Arbeitszeit und die Mittagsause. für \"&$A14&\" im Format [hh:mm] im weissen Feld eingeben\"&CHAR(10)&\"< Daraus errechnet sich die Tagesarbeitszeit (TAZ) und die TAZ abzüglich der unbezahlten Mittagspause\"","v":"< Von- und Bis-Normal-Arbeitszeit und die Mittagsause. für Mo im Format [hh:mm] im weissen Feld eingeben\n< Daraus errechnet sich die Tagesarbeitszeit (TAZ) und die TAZ abzüglich der unbezahlten Mittagspause"},null,null,null,{"$f":"IF($D14*24-$B14*24<6,0,$C14)","v":0},{"$f":"($D14-$B14)*24<6","v":false},null,null,{"$f":"AND(ISNUMBER($B14),ROUND($B14*24*2,0)/(24*2)=$B14,$B14>=TagUG,$B14<=TagOG)","v":true},{"$f":"AND(ISNUMBER($C14),ROUND($C14*24*4,0)/(24*4)=$C14,$C14>=TagUG,$C14<=TagOG)","v":true},{"$f":"AND(ISNUMBER($D14),ROUND($D14*24*2,0)/(24*2)=$D14,$D14>=TagUG,$D14<=TagOG)","v":true},{"$f":"IF(Zeitmodell=\"Teilzeit\",$M14,$O14)","v":true},{"$f":"IF(Zeitmodell=\"Teilzeit\",$N14,$Q14)","v":true},{"$f":"B14*24*4","v":32},null,null,{"$f":"D14*24*4","v":64},{"$f":"$W14-$T14","v":32},{"$f":"($V14-$U14)","v":0},{"$f":"IF($X14=0,0,$Y14/$X14)","v":0},{"$f":"ROUND(($X14-$Y14)/2,0)/(24*4)","v":"04:00:00"},0.75,{"$f":"INT(X14*$AB14)/(24*4)","v":"06:00:00"},"01:30:00"]
["Di","08:00:00","00:00:00","16:00:00",{"$f":"$D15-$B15","v":"08:00:00"},{"$f":"$D15-$B15-$K15","v":"08:00:00"},{"$f":"\"< Von- und Bis-Normal-Arbeitszeit und die Mittagsause. für \"&$A15&\" im Format [hh:mm] im weissen Feld eingeben\"&CHAR(10)&\"< Daraus errechnet sich die Tagesarbeitszeit (TAZ) und die TAZ abzüglich der unbezahlten Mittagspause\"","v":"< Von- und Bis-Normal-Arbeitszeit und die Mittagsause. für Di im Format [hh:mm] im weissen Feld eingeben\n< Daraus errechnet sich die Tagesarbeitszeit (TAZ) und die TAZ abzüglich der unbezahlten Mittagspause"},null,null,null,{"$f":"IF($D15*24-$B15*24<6,0,$C15)","v":0},{"$f":"($D15-$B15)*24<6","v":false},null,null,{"$f":"AND(ISNUMBER($B15),ROUND($B15*24*2,0)/(24*2)=$B15,$B15>=TagUG,$B15<=TagOG)","v":true},{"$f":"AND(ISNUMBER($C15),ROUND($C15*24*4,0)/(24*4)=$C15,$C15>=TagUG,$C15<=TagOG)","v":true},{"$f":"AND(ISNUMBER($D15),ROUND($D15*24*2,0)/(24*2)=$D15,$D15>=TagUG,$D15<=TagOG)","v":true},{"$f":"IF(Zeitmodell=\"Teilzeit\",$M15,$O15)","v":true},{"$f":"IF(Zeitmodell=\"Teilzeit\",$N15,$Q15)","v":true},{"$f":"B15*24*4","v":32},null,null,{"$f":"D15*24*4","v":64},{"$f":"$W15-$T15","v":32},{"$f":"($V15-$U15)","v":0},{"$f":"IF($X15=0,0,$Y15/$X15)","v":0},{"$f":"ROUND(($X15-$Y15)/2,0)/(24*4)","v":"04:00:00"},0.75,{"$f":"INT(X15*$AB15)/(24*4)","v":"06:00:00"},"01:30:00"]
["Mi","08:00:00","00:00:00","16:00:00",{"$f":"$D16-$B16","v":"08:00:00"},{"$f":"$D16-$B16-$K16","v":"08:00:00"},{"$f":"\"< Von- und Bis-Normal-Arbeitszeit und die Mittagsause. für \"&$A16&\" im Format [hh:mm] im weissen Feld eingeben\"&CHAR(10)&\"< Daraus errechnet sich die Tagesarbeitszeit (TAZ) und die TAZ abzüglich der unbezahlten Mittagspause\"","v":"< Von- und Bis-Normal-Arbeitszeit und die Mittagsause. für Mi im Format [hh:mm] im weissen Feld eingeben\n< Daraus errechnet sich die Tagesarbeitszeit (TAZ) und die TAZ abzüglich der unbezahlten Mittagspause"},null,null,null,{"$f":"IF($D16*24-$B16*24<6,0,$C16)","v":0},{"$f":"($D16-$B16)*24<6","v":false},null,null,{"$f":"AND(ISNUMBER($B16),ROUND($B16*24*2,0)/(24*2)=$B16,$B16>=TagUG,$B16<=TagOG)","v":true},{"$f":"AND(ISNUMBER($C16),ROUND($C16*24*4,0)/(24*4)=$C16,$C16>=TagUG,$C16<=TagOG)","v":true},{"$f":"AND(ISNUMBER($D16),ROUND($D16*24*2,0)/(24*2)=$D16,$D16>=TagUG,$D16<=TagOG)","v":true},{"$f":"IF(Zeitmodell=\"Teilzeit\",$M16,$O16)","v":true},{"$f":"IF(Zeitmodell=\"Teilzeit\",$N16,$Q16)","v":true},{"$f":"B16*24*4","v":32},null,null,{"$f":"D16*24*4","v":64},{"$f":"$W16-$T16","v":32},{"$f":"($V16-$U16)","v":0},{"$f":"IF($X16=0,0,$Y16/$X16)","v":0},{"$f":"ROUND(($X16-$Y16)/2,0)/(24*4)","v":"04:00:00"},0.75,{"$f":"INT(X16*$AB16)/(24*4)","v":"06:00:00"},"01:30:00"]
["Do","08:00:00","00:00:00","16:00:00",{"$f":"$D17-$B17","v":"08:00:00"},{"$f":"$D17-$B17-$K17","v":"08:00:00"},{"$f":"\"< Von- und Bis-Normal-Arbeitszeit und die Mittagsause. für \"&$A17&\" im Format [hh:mm] im weissen Feld eingeben\"&CHAR(10)&\"< Daraus errechnet sich die Tagesarbeitszeit (TAZ) und die TAZ abzüglich der unbezahlten Mittagspause\"","v":"< Von- und Bis-Normal-Arbeitszeit und die Mittagsause. für Do im Format [hh:mm] im weissen Feld eingeben\n< Daraus errechnet sich die Tagesarbeitszeit (TAZ) und die TAZ abzüglich der unbezahlten Mittagspause"},null,null,null,{"$f":"IF($D17*24-$B17*24<6,0,$C17)","v":0},{"$f":"($D17-$B17)*24<6","v":false},null,null,{"$f":"AND(ISNUMBER($B17),ROUND($B17*24*2,0)/(24*2)=$B17,$B17>=TagUG,$B17<=TagOG)","v":true},{"$f":"AND(ISNUMBER($C17),ROUND($C17*24*4,0)/(24*4)=$C17,$C17>=TagUG,$C17<=TagOG)","v":true},{"$f":"AND(ISNUMBER($D17),ROUND($D17*24*2,0)/(24*2)=$D17,$D17>=TagUG,$D17<=TagOG)","v":true},{"$f":"IF(Zeitmodell=\"Teilzeit\",$M17,$O17)","v":true},{"$f":"IF(Zeitmodell=\"Teilzeit\",$N17,$Q17)","v":true},{"$f":"B17*24*4","v":32},null,null,{"$f":"D17*24*4","v":64},{"$f":"$W17-$T17","v":32},{"$f":"($V17-$U17)","v":0},{"$f":"IF($X17=0,0,$Y17/$X17)","v":0},{"$f":"ROUND(($X17-$Y17)/2,0)/(24*4)","v":"04:00:00"},0.75,{"$f":"INT(X17*$AB17)/(24*4)","v":"06:00:00"},"01:30:00"]
["Fr","08:00:00","00:00:00","16:00:00",{"$f":"$D18-$B18","v":"08:00:00"},{"$f":"$D18-$B18-$K18","v":"08:00:00"},{"$f":"\"< Von- und Bis-Normal-Arbeitszeit und die Mittagsause. für \"&$A18&\" im Format [hh:mm] im weissen Feld eingeben\"&CHAR(10)&\"< Daraus errechnet sich die Tagesarbeitszeit (TAZ) und die TAZ abzüglich der unbezahlten Mittagspause\"","v":"< Von- und Bis-Normal-Arbeitszeit und die Mittagsause. für Fr im Format [hh:mm] im weissen Feld eingeben\n< Daraus errechnet sich die Tagesarbeitszeit (TAZ) und die TAZ abzüglich der unbezahlten Mittagspause"},null,null,null,{"$f":"IF($D18*24-$B18*24<6,0,$C18)","v":0},{"$f":"($D18-$B18)*24<6","v":false},null,null,{"$f":"AND(ISNUMBER($B18),ROUND($B18*24*2,0)/(24*2)=$B18,$B18>=TagUG,$B18<=TagOG)","v":true},{"$f":"AND(ISNUMBER($C18),ROUND($C18*24*4,0)/(24*4)=$C18,$C18>=TagUG,$C18<=TagOG)","v":true},{"$f":"AND(ISNUMBER($D18),ROUND($D18*24*2,0)/(24*2)=$D18,$D18>=TagUG,$D18<=TagOG)","v":true},{"$f":"IF(Zeitmodell=\"Teilzeit\",$M18,$O18)","v":true},{"$f":"IF(Zeitmodell=\"Teilzeit\",$N18,$Q18)","v":true},{"$f":"B18*24*4","v":32},null,null,{"$f":"D18*24*4","v":64},{"$f":"$W18-$T18","v":32},{"$f":"($V18-$U18)","v":0},{"$f":"IF($X18=0,0,$Y18/$X18)","v":0},{"$f":"ROUND(($X18-$Y18)/2,0)/(24*4)","v":"04:00:00"},0.75,{"$f":"INT(X18*$AB18)/(24*4)","v":"06:00:00"},"02:30:00"]
["Wochenarbeitszeit: ",null,null,null,null,{"$f":"SUM(F14:F18)","v":1.6666666666666665},"< Arbeitszeit pro Woche berechnet aus der Normalzeiteingabe von Mo.-Fr.",null,null,null,null,{"$f":"SUM(L14:L18)","v":0},null,null,null,null,null,null,{"$f":"SUM(X14:X18)","v":160},{"$f":"SUM(Y14:Y18)","v":0},{"$f":"SUM(Z14:Z18)/5","v":0},null,{"$f":"SUM(AB14:AB18)/5","v":0.75}]
["Arbeitszeitsaldo: ",null,null,null,null,{"$f":"IF(ISERROR(INDIRECT(Jahressaldo)),0,INDIRECT(Jahressaldo))","v":0},"< aktueller Stand des Arbeiszeitstunden-Saldos\n< dieser Wert wird < oder = -8 Std. und > oder = 24 Std. Rot hinterlegt"]

{"sheet":"Jänner","index":1,"n_rows":45,"n_cols":46,"rows_kept":45,"cut":false,"hidden":true,"merged":[[42,4,42,8],[43,4,43,8],[44,0,44,3],[44,12,44,15],[36,11,36,15],[37,11,37,15],[38,2,41,3],[38,4,38,8],[38,10,40,15],[39,4,39,8],[40,4,40,8],[41,4,41,8],[41,10,41,15],[30,11,30,15],[31,11,31,15],[32,11,32,15],[33,11,33,15],[34,11,34,15],[35,11,35,15],[24,11,24,15],[25,11,25,15],[26,11,26,15],[27,11,27,15],[28,11,28,15],[29,11,29,15],[18,11,18,15],[19,11,19,15],[20,11,20,15],[21,11,21,15],[22,11,22,15],[23,11,23,15],[12,11,12,15],[13,11,13,15],[14,11,14,15],[15,11,15,15],[16,11,16,15],[17,11,17,15],[5,27,5,31],[7,11,7,15],[8,11,8,15],[9,11,9,15],[10,11,10,15],[11,11,11,15],[4,4,4,6],[4,7,4,9],[5,2,6,2],[5,3,6,3],[5,5,6,5],[5,6,6,6],[5,7,6,7],[5,8,6,8],[0,15,1,15],[1,5,1,8],[2,5,2,8],[3,0,3,3],[3,4,3,6],[3,7,3,9],[3,11,6,15],[4,0,6,0],[4,1,6,1],[4,2,4,3]]}
[{"$f":"Konfig!$A$1","v":" BOKU-Zeiterfassung für Wissenschaftliches Personal"},null,null,null,null,null,null,null,null,null,null,null,null,null,null,null,"Monat","Stunden-Saldo Grenzen","Status Blatteingabe"]
[{"$f":"\" Org.-Einh. : \"&OrgEinheit","v":" Org.-Einh. : Hxxxxx"},null,null,null,null,"Zeitmodell:",null,null,null,{"$f":"\" \"&Zeitmodell","v":" Vollzeit"},null,null,null,null,null,null,{"$f":"IF(ISNA($Q$4),1,$Q$4)","v":1},0,{"$f":"SUM($AT8:$AT38)","v":0}]
[{"$f":" \" Mitarbeiter: \"&Name","v":" Mitarbeiter: Vorname Nachname"},null,null,null,null,"Vorgesetzter:",null,null,null,{"$f":"\" \"&Vorgesetzter","v":" Vorname Nachname"},null,null,null,null,null,null,{"$f":"RIGHT(CELL(\"filename\",A1),LEN(CELL(\"filename\",A1))-SEARCH(\"]\",CELL(\"filename\",A1),1))","v":"Jänner"},null,{"$f":"IF($Q$2=1,$S$2,$S$2+INDIRECT($S$5))","v":0}]
[{"$f":" \" Monat: \"&$Q$3&\" \"&Jahr","v":" Monat: Jänner 2024"},null,null,null,"Dienstplan",null,null,"Normalstunden",null,null,"Übertrag","Anmerkungen ",null,null,null,null,{"$f":"IF(ISNA(VLOOKUP($Q$3,MTab,2,FALSE)),1,VLOOKUP($Q$3,MTab,2,FALSE))","v":1},null,"Übertrags Adresse Blatteingabe"]
[" Datum","Wochentag","Tagesinformation",null,{"$f":"\"Wochen-AZ\"&\" \"&TEXT(WAZ,\"[hh]:mm\")","v":"Wochen-AZ 40:00"},null,null," Stunden 1:1",null,null,{"$f":"IF(ISNA($Q$5),Übertrag,INDIRECT($Q$5))","v":0},null,null,null,null,null,{"$f":"IF(ISNA(VLOOKUP($Q$3,MTab,3,FALSE)),\"Übertrag\",VLOOKUP($Q$3,MTab,3,FALSE))","v":"Übertrag"},null,{"$f":"IF(ISNA(VLOOKUP($Q$3,MTab,4,FALSE)),$Q$3&\"!$R$2\",VLOOKUP($Q$3,MTab,4,FALSE))","v":"Jänner!$S$2"}]
[null,null," Feiertage\n Wochenende\n Urlaub, ZA, Krank","[U]rlaub\n[Z]A\n[K]rank","Normal-","Soll","MP","Von","Bis","Plus","Saldo",null,null,null,null,null,"Hintergrundberechnungen",null,null,null,null,null,null,"Saldo aktuell",null,null,null,"GAZ-Tabellenabbildung",null,null,null,null,"Eingabebeprüfungen"]
[null,null,null,null,"Arbeitszeit",null,null,null,null,"Minus","akuell",null,null,null,null,null,"Datum","Monat OK","Abwesenh.","Freie Tage","ÜA-Tage","Std.","Soll-Std.",{"$f":"IF(ISNA($Q$5),Übertrag,INDIRECT($Q$5))","v":0},"Std.-Soll = 0","Std.-Soll > 0","Std.-Soll < 0",null,{"$f":"I_GAZNAZVon","v":2},3,{"$f":"I_GAZNAZBis","v":4},null,"Zeiteingabe","UZK-Eing.\nerlaubt","UZK-Eing.\ngültig","Normalst. ein erlaubt","Normalstd.\neingegeben","Normal VON möglich OG","Normal VON möglich UG","Normal BIS möglich OG","Normal BIS möglich UG","Normal VON\n15min","Normal VON richtig","Normal BIS\n15min","Normal BIS richtig","Status Zeilen Eingabe"]
[{"$f":"IF($R8,$Q8,\"\")","v":"2024-01-01"},{"$f":"IF($R8,VLOOKUP(WEEKDAY($Q8,2),WOTA,2,FALSE),\"\")","v":"Mo"},{"$f":"IF($R8,\" \"&IF($S8=\"\",VLOOKUP($Q8,FListe,3,FALSE),$S8),\"\")","v":" Neujahrstag"},null,{"$f":"IF(AND($R8,$T8<>\"F\"),IF($AC8=$AE8,\"keine NAZ\",TEXT($AC8,\"hh:mm\")&\"-\"&TEXT($AC8+$F8+$G8,\"hh:mm\")),\"\")","v":""},{"$f":"IF($R8,IF($T8=\"F\",0,VLOOKUP($B8,GAZ,I_GAZNAZMP,FALSE)),\"\")","v":"00:00:00"},{"$f":"IF($R8,$AD8,\"\")","v":"00:00:00"},null,null,{"$f":"IF(AND($R8,$AK8,NOT($Y8)),ROUND(($V8-$F8-$G8)*24,2),IF($D8=\"Z\",$F8*-24,\"\"))","v":""},{"$f":"$X8","v":0},null,null,null,null,null,{"$f":"DATE(Jahr,$Q2,1)","v":"2024-01-01"},{"$f":"$Q$2=MONTH($Q8)","v":true},{"$f":"IF(OR($D8=\"U\",$D8=\"Z\",$D8=\"ZK\",$D8=\"K\"),VLOOKUP($D8,UZK,2,FALSE),\"\")","v":""},{"$f":"IF($R8,VLOOKUP($Q8,FListe,4,FALSE),\"\")","v":"F"},{"$f":"IF($R8,VLOOKUP($Q8,FListe,5,FALSE),\"\")","v":"F"},{"$f":"$I8-$H8","v":0},{"$f":"IF($R8,ROUND($V8-$F8-$AD8,15),\"\")","v":0},{"$f":"IF($J8<>\"\",$X7+$J8,$X7)","v":0},{"$f":"($W8=0)","v":true},{"$f":"($W8>0)","v":false},{"$f":"($W8<0)","v":false},{"$f":"IF($U8=\"F\",\"\",TIME(0,0,0))","v":""},{"$f":"IF($U8=\"F\",\"\",IF(ISNA(VLOOKUP($B8,GAZ,AC$7,FALSE)),0,VLOOKUP($B8,GAZ,AC$7,FALSE)))","v":""},{"$f":"IF(OR($U8=\"F\",$S8<>\"\",ISNA(VLOOKUP($B8,GAZ,AD$7,FALSE))),0,IF(NOT($AK8),VLOOKUP($B8,GAZ,11,FALSE),IF(($I8-$H8)*24>=6,VLOOKUP($B8,GAZ,3,FALSE),0)))","v":"00:00:00"},{"$f":"IF($U8=\"F\",\"\",IF(ISNA(VLOOKUP($B8,GAZ,AE$7,FALSE)),0,VLOOKUP($B8,GAZ,AE$7,FALSE)))","v":""},{"$f":"IF($U8=\"F\",\"\",TIME(23,59,0))","v":""},{"$f":"OR($H8<>\"\",$I8<>\"\")","v":false},{"$f":"AND($T8<>\"F\",NOT($AG8),NOT($AC8=$AE8))","v":false},{"$f":"AND($AH8,OR($D8=\"U\",$D8=\"Z\",$D8=\"K\"))","v":false},{"$f":"AND($U8<>\"F\",$D8<>\"U\",$D8<>\"Z\",$D8<>\"K\",$R8)","v":false},{"$f":"AND($H8<>\"\",$I8<>\"\")","v":false},{"$f":"IF($AJ8,TagUG,\"\")","v":""},{"$f":"IF($AJ8,IF($I8=\"\",IF(AND($L8<>\"\",$L8<$AF8),$L8,IF(AND($M8<>\"\",$M8<$AF8),$M8,TagOG)),$I8),\"\")","v":""},{"$f":"IF($AJ8,IF($H8=\"\",$AB8,$H8),\"\")","v":""},{"$f":"IF($AJ8,IF(AND($L8<>\"\",$L8<$AF8),$L8,IF(AND($M8<>\"\",$M8<$AF8),$M8,TagOG)),\"\")","v":""},{"$f":"MOD($H8*24,0.25)=0","v":true},{"$f":"AND($AJ8,ISNUMBER($H8),$H8>=$AB8,$H8<=$AF8,OR($I8=\"\",$H8<=$I8))","v":false},{"$f":"MOD($I8*24,0.25)=0","v":true},{"$f":"AND($AJ8,ISNUMBER($I8),$I8>=$AB8,$I8<=$AF8,OR($H8=\"\",$I8>=$H8))","v":false},{"$f":"IF(AND(ISBLANK($D8),ISBLANK($H8),ISBLANK($I8)),0,1)","v":0}]
["2024-01-02","Di"," ",null,{"$f":"IF(AND($R9,$T9<>\"F\"),IF($AC9=$AE9,\"keine NAZ\",TEXT($AC9,\"hh:mm\")&\"-\"&TEXT($AC9+$F9+$G9,\"hh:mm\")),\"\")","v":"08:00-16:00"},"08:00:00","00:00:00",null,null,"",0,null,null,null,null,null,{"$f":" Q8+1","v":"2024-01-02"},true,"","A","A",{"$f":"$I9-$H9","v":0},{"$f":"IF($R9,ROUND($V9-$F9-$AD9,15),\"\")","v":-0.33333333333333298},0,false,false,true,"00:00:00","08:00:00","00:00:00","16:00:00","23:59:00",false,true,false,true,false,"00:00:00","23:59:00",{"$f":"IF($AJ9,IF($H9=\"\",TagUG,$H9),\"\")","v":"00:00:00"},"23:59:00",true,false,true,false,0]
["2024-01-03","Mi"," ",null,"08:00-16:00","08:00:00","00:00:00",null,null,"",0,null,null,null,null,null,"2024-01-03",true,"","A","A",0,-0.33333333333333298,0,false,false,true,"00:00:00","08:00:00","00:00:00","16:00:00","23:59:00",false,true,false,true,false,"00:00:00","23:59:00","00:00:00","23:59:00",true,false,true,false,0]
["2024-01-04","Do"," ",null,"08:00-16:00","08:00:00","00:00:00",null,null,"",0,null,null,null,null,null,"2024-01-04",true,"","A","A",0,-0.33333333333333298,0,false,false,true,"00:00:00","08:00:00","00:00:00","16:00:00","23:59:00",false,true,false,true,false,"00:00:00","23:59:00","00:00:00","23:59:00",true,false,true,false,0]
["2024-01-05","Fr"," ",null,"08:00-16:00","08:00:00","00:00:00",null,null,"",0,null,null,null,null,null,"2024-01-05",true,"","A","A",0,-0.33333333333333298,0,false,false,true,"00:00:00","08:00:00","00:00:00","16:00:00","23:59:00",false,true,false,true,false,"00:00:00","23:59:00","00:00:00","23:59:00",true,false,true,false,0]
["2024-01-06","Sa"," Hl. drei Könige",null,"","00:00:00","00:00:00",null,null,"",0,null,null,null,null,null,"2024-01-06",true,"","F","F",0,0,0,true,false,false,"","","00:00:00","","",false,false,false,false,false,"","","","",true,false,true,false,0]
["2024-01-07","So"," Wochenende",null,"","00:00:00","00:00:00",null,null,"",0,null,null,null,null,null,"2024-01-07",true,"","F","F",0,0,0,true,false,false,"","","00:00:00","","",false,false,false,false,false,"","","","",true,false,true,false,0]
["2024-01-08","Mo"," ",null,"08:00-16:00","08:00:00","00:00:00",null,null,"",0,null,null,null,null,null,"2024-01-08",true,"","A","A",0,-0.33333333333333298,0,false,false,true,"00:00:00","08:00:00","00:00:00","16:00:00","23:59:00",false,true,false,true,false,"00:00:00","23:59:00","00:00:00","23:59:00",true,false,true,false,0]
["2024-01-09","Di"," ",null,"08:00-16:00","08:00:00","00:00:00",null,null,"",0,null,null,null,null,null,"2024-01-09",true,"","A","A",0,-0.33333333333333298,0,false,false,true,"00:00:00","08:00:00","00:00:00","16:00:00","23:59:00",false,true,false,true,false,"00:00:00","23:59:00","00:00:00","23:59:00",true,false,true,false,0]
["2024-01-10","Mi"," ",null,"08:00-16:00","08:00:00","00:00:00",null,null,"",0,null,null,null,null,null,"2024-01-10",true,"","A","A",0,-0.33333333333333298,0,false,false,true,"00:00:00","08:00:00","00:00:00","16:00:00","23:59:00",false,true,false,true,false,"00:00:00","23:59:00","00:00:00","23:59:00",true,false,true,false,0]
["2024-01-11","Do"," ",null,"08:00-16:00","08:00:00","00:00:00",null,null,"",0,null,null,null,null,null,"2024-01-11",true,"","A","A",0,-0.33333333333333298,0,false,false,true,"00:00:00","08:00:00","00:00:00","16:00:00","23:59:00",false,true,false,true,false,"00:00:00","23:59:00","00:00:00","23:59:00",true,false,true,false,0]
["2024-01-12","Fr"," ",null,"08:00-16:00","08:00:00","00:00:00",null,null,"",0,null,null,null,null,null,"2024-01-12",true,"","A","A",0,-0.33333333333333298,0,false,false,true,"00:00:00","08:00:00","00:00:00","16:00:00","23:59:00",false,true,false,true,false,"00:00:00","23:59:00","00:00:00","23:59:00",true,false,true,false,0]
["2024-01-13","Sa"," Wochenende",null,"","00:00:00","00:00:00",null,null,"",0,null,null,null,null,null,"2024-01-13",true,"","F","A",0,0,0,true,false,false,"00:00:00","00:00:00","00:00:00","00:00:00","23:59:00",false,false,false,true,false,"00:00:00","23:59:00","00:00:00","23:59:00",true,false,true,false,0]
["2024-01-14","So"," Wochenende",null,"","00:00:00","00:00:00",null,null,"",0,null,null,null,null,null,"2024-01-14",true,"","F","F",0,0,0,true,false,false,"","","00:00:00","","",false,false,false,false,false,"","","","",true,false,true,false,0]
["2024-01-15","Mo"," ",null,"08:00-16:00","08:00:00","00:00:00",null,null,"",0,null,null,null,null,null,"2024-01-15",true,"","A","A",0,-0.33333333333333298,0,false,false,true,"00:00:00","08:00:00","00:00:00","16:00:00","23:59:00",false,true,false,true,false,"00:00:00","23:59:00","00:00:00","23:59:00",true,false,true,false,0]
["2024-01-16","Di"," ",null,"08:00-16:00","08:00:00","00:00:00",null,null,"",0,null,null,null,null,null,"2024-01-16",true,"","A","A",0,-0.33333333333333298,0,false,false,true,"00:00:00","08:00:00","00:00:00","16:00:00","23:59:00",false,true,false,true,false,"00:00:00","23:59:00","00:00:00","23:59:00",true,false,true,false,0]
["2024-01-17","Mi"," ",null,"08:00-16:00","08:00:00","00:00:00",null,null,"",0,null,null,null,null,null,"2024-01-17",true,"","A","A",0,-0.33333333333333298,0,false,false,true,"00:00:00","08:00:00","00:00:00","16:00:00","23:59:00",false,true,false,true,false,"00:00:00","23:59:00","00:00:00","23:59:00",true,false,true,false,0]
["2024-01-18","Do"," ",null,"08:00-16:00","08:00:00","00:00:00",null,null,"",0,null,null,null,null,null,"2024-01-18",true,"","A","A",0,-0.33333333333333298,0,false,false,true,"00:00:00","08:00:00","00:00:00","16:00:00","23:59:00",false,true,false,true,false,"00:00:00","23:59:00","00:00:00","23:59:00",true,false,true,false,0]
["2024-01-19","Fr"," ",null,"08:00-16:00","08:00:00","00:00:00",null,null,"",0,null,null,null,null,null,"2024-01-19",true,"","A","A",0,-0.33333333333333298,0,false,false,true,"00:00:00","08:00:00","00:00:00","16:00:00","23:59:00",false,true,false,true,false,"00:00:00","23:59:00","00:00:00","23:59:00",true,false,true,false,0]
["2024-01-20","Sa"," Wochenende",null,"","00:00:00","00:00:00",null,null,"",0,null,null,null,null,null,"2024-01-20",true,"","F","A",0,0,0,true,false,false,"00:00:00","00:00:00","00:00:00","00:00:00","23:59:00",false,false,false,true,false,"00:00:00","23:59:00","00:00:00","23:59:00",true,false,true,false,0]
["2024-01-21","So"," Wochenende",null,"","00:00:00","00:00:00",null,null,"",0,null,null,null,null,null,"2024-01-21",true,"","F","F",0,0,0,true,false,false,"","","00:00:00","","",false,false,false,false,false,"","","","",true,false,true,false,0]
["2024-01-22","Mo"," ",null,"08:00-16:00","08:00:00","00:00:00",null,null,"",0,null,null,null,null,null,"2024-01-22",true,"","A","A",0,-0.33333333333333298,0,false,false,true,"00:00:00","08:00:00","00:00:00","16:00:00","23:59:00",false,true,false,true,false,"00:00:00","23:59:00","00:00:00","23:59:00",true,false,true,false,0]
["2024-01-23","Di"," ",null,"08:00-16:00","08:00:00","00:00:00",null,null,"",0,null,null,null,null,null,"2024-01-23",true,"","A","A",0,-0.33333333333333298,0,false,false,true,"00:00:00","08:00:00","00:00:00","16:00:00","23:59:00",false,true,false,true,false,"00:00:00","23:59:00","00:00:00","23:59:00",true,false,true,false,0]
["2024-01-24","Mi"," ",null,"08:00-16:00","08:00:00","00:00:00",null,null,"",0,null,null,null,null,null,"2024-01-24",true,"","A","A",0,-0.33333333333333298,0,false,false,true,"00:00:00","08:00:00","00:00:00","16:00:00","23:59:00",false,true,false,true,false,"00:00:00","23:59:00","00:00:00","23:59:00",true,false,true,false,0]
["2024-01-25","Do"," ",null,"08:00-16:00","08:00:00","00:00:00",null,null,"",0,null,null,null,null,null,"2024-01-25",true,"","A","A",0,-0.33333333333333298,0,false,false,true,"00:00:00","08:00:00","00:00:00","16:00:00","23:59:00",false,true,false,true,false,"00:00:00","23:59:00","00:00:00","23:59:00",true,false,true,false,0]
["2024-01-26","Fr"," ",null,"08:00-16:00","08:00:00","00:00:00",null,null,"",0,null,null,null,null,null,"2024-01-26",true,"","A","A",0,-0.33333333333333298,0,false,false,true,"00:00:00","08:00:00","00:00:00","16:00:00","23:59:00",false,true,false,true,false,"00:00:00","23:59:00","00:00:00","23:59:00",true,false,true,false,0]
["2024-01-27","Sa"," Wochenende",null,"","00:00:00","00:00:00",null,null,"",0,null,null,null,null,null,"2024-01-27",true,"","F","A",0,0,0,true,false,false,"00:00:00","00:00:00","00:00:00","00:00:00","23:59:00",false,false,false,true,false,"00:00:00","23:59:00","00:00:00","23:59:00",true,false,true,false,0]
["2024-01-28","So"," Wochenende",null,"","00:00:00","00:00:00",null,null,"",0,null,null,null,null,null,"2024-01-28",true,"","F","F",0,0,0,true,false,false,"","","00:00:00","","",false,false,false,false,false,"","","","",true,false,true,false,0]
["2024-01-29","Mo"," ",null,"08:00-16:00","08:00:00","00:00:00",null,null,"",0,null,null,null,null,null,"2024-01-29",true,"","A","A",0,-0.33333333333333298,0,false,false,true,"00:00:00","08:00:00","00:00:00","16:00:00","23:59:00",false,true,false,true,false,"00:00:00","23:59:00","00:00:00","23:59:00",true,false,true,false,0]
["2024-01-30","Di"," ",null,"08:00-16:00","08:00:00","00:00:00",null,null,"",0,null,null,null,null,null,"2024-01-30",true,"","A","A",0,-0.33333333333333298,0,false,false,true,"00:00:00","08:00:00","00:00:00","16:00:00","23:59:00",false,true,false,true,false,"00:00:00","23:59:00","00:00:00","23:59:00",true,false,true,false,0]
["2024-01-31","Mi"," ",null,"08:00-16:00","08:00:00","00:00:00",null,null,"",0,null,null,null,null,null,"2024-01-31",true,"","A","A",0,-0.33333333333333298,0,false,false,true,"00:00:00","08:00:00","00:00:00","16:00:00","23:59:00",false,true,false,true,false,"00:00:00","23:59:00","00:00:00","23:59:00",true,false,true,false,0]
["Arbeitstage",{"$f":"COUNTIF(T$8:T$38,\"A\")","v":22},null,null,{"$f":"\"Monat Std.-Saldo (~15min) > \"","v":"Monat Std.-Saldo (~15min) > "},null,null,null,null,{"$f":"ROUND(SUM(J8:J38)*4,0)/4","v":0}]
["ZA-Tage",{"$f":"COUNTIF(D$8:D$38,\"Z\")","v":0},null,null," Vormonat Std.Saldo > ",null,null,null,null,{"$f":"$K5","v":0},null,null,null,null,null,null,"Gültigkeit ausbezahlt"]
["Urlaubstage",{"$f":"COUNTIF(D$8:D$38,\"U\")","v":0},null,null," Gesamt Std. Saldo > ",null,null,null,null,{"$f":"$J39+$J40","v":0},null,null,null,null,null,null,{"$f":"AND($K$41>=0,$K$41<=$J$41,MOD($K$41,0.25)=0)","v":true}]
["Krank",{"$f":"COUNTIF(D$8:D$38,\"K\")","v":0},null,null," Übertrag Std. Saldo > ",null,null,null,null,{"$f":"$J41","v":0},{"$f":"\" < Dieser Stunden-Saldo wird in das nächste \"&IF($Q$3=\"Dezember\",\"Jahr\",\"Monat\")&\" übertragen\"","v":" < Dieser Stunden-Saldo wird in das nächste Monat übertragen"}]
[null,null,null,"Z"]
[]
[{"$f":"\"Unterschrift von \"&Vorgesetzter","v":"Unterschrift von Vorname Nachname"},null,null,null,null,null,null,null,null,null,null,null,{"$f":"\"Unterschrift von \"&Name","v":"Unterschrift von Vorname Nachname"}]

{"sheet":"Februar","index":2,"n_rows":45,"n_cols":46,"rows_kept":45,"cut":false,"hidden":true,"merged":[[42,4,42,8],[43,4,43,8],[44,0,44,3],[44,12,44,15],[36,11,36,15],[37,11,37,15],[38,2,41,3],[38,4,38,8],[38,10,40,15],[39,4,39,8],[40,4,40,8],[41,4,41,8],[41,10,41,15],[30,11,30,15],[31,11,31,15],[32,11,32,15],[33,11,33,15],[34,11,34,15],[35,11,35,15],[24,11,24,15],[25,11,25,15],[26,11,26,15],[27,11,27,15],[28,11,28,15],[29,11,29,15],[18,11,18,15],[19,11,19,15],[20,11,20,15],[21,11,21,15],[22,11,22,15],[23,11,23,15],[12,11,12,15],[13,11,13,15],[14,11,14,15],[15,11,15,15],[16,11,16,15],[17,11,17,15],[5,27,5,31],[7,11,7,15],[8,11,8,15],[9,11,9,15],[10,11,10,15],[11,11,11,15],[4,4,4,6],[4,7,4,9],[5,2,6,2],[5,3,6,3],[5,5,6,5],[5,6,6,6],[5,7,6,7],[5,8,6,8],[0,15,1,15],[1,5,1,8],[2,5,2,8],[3,0,3,3],[3,4,3,6],[3,7,3,9],[3,11,6,15],[4,0,6,0],[4,1,6,1],[4,2,4,3]]}
[{"$f":"Konfig!$A$1","v":" BOKU-Zeiterfassung für Wissenschaftliches Personal"},null,null,null,null,null,null,null,null,null,null,null,null,null,null,null,"Monat","Stunden-Saldo Grenzen","Status Blatteingabe"]
[{"$f":"\" Org.-Einh. : \"&OrgEinheit","v":" Org.-Einh. : Hxxxxx"},null,null,null,null,"Zeitmodell:",null,null,null,{"$f":"\" \"&Zeitmodell","v":" Vollzeit"},null,null,null,null,null,null,{"$f":"IF(ISNA($Q$4),1,$Q$4)","v":2},0,{"$f":"SUM($AT8:$AT38)","v":0}]
[{"$f":" \" Mitarbeiter: \"&Name","v":" Mitarbeiter: Vorname Nachname"},null,null,null,null,"Vorgesetzter:",null,null,null,{"$f":"\" \"&Vorgesetzter","v":" Vorname Nachname"},null,null,null,null,null,null,{"$f":"RIGHT(CELL(\"filename\",A1),LEN(CELL(\"filename\",A1))-SEARCH(\"]\",CELL(\"filename\",A1),1))","v":"Februar"},null,{"$f":"IF($Q$2=1,$S$2,$S$2+INDIRECT($S$5))","v":0}]
[{"$f":" \" Monat: \"&$Q$3&\" \"&Jahr","v":" Monat: Februar 2024"},null,null,null,"Dienstplan",null,null,"Normalstunden",null,null,"Übertrag","Anmerkungen ",null,null,null,null,{"$f":"IF(ISNA(VLOOKUP($Q$3,MTab,2,FALSE)),1,VLOOKUP($Q$3,MTab,2,FALSE))","v":2},null,"Übertrags Adresse Blatteingabe"]
[" Datum","Wochentag","Tagesinformation",null,{"$f":"\"Wochen-AZ\"&\" \"&TEXT(WAZ,\"[hh]:mm\")","v":"Wochen-AZ 40:00"},null,null," Stunden 1:1",null,null,{"$f":"IF(ISNA($Q$5),Übertrag,INDIRECT($Q$5))","v":0},null,null,null,null,null,{"$f":"IF(ISNA(VLOOKUP($Q$3,MTab,3,FALSE)),\"Übertrag\",VLOOKUP($Q$3,MTab,3,FALSE))","v":"Jänner!$J$42"},null,{"$f":"IF(ISNA(VLOOKUP($Q$3,MTab,4,FALSE)),$Q$3&\"!$R$2\",VLOOKUP($Q$3,MTab,4,FALSE))","v":"Jänner!$S$3"}]
[null,null," Feiertage\n Wochenende\n Urlaub, ZA, Krank","[U]rlaub\n[Z]A\n[K]rank","Normal-","Soll","MP","Von","Bis","Plus","Saldo",null,null,null,null,null,"Hintergrundberechnungen",null,null,null,null,null,null,"Saldo aktuell",null,null,null,"GAZ-Tabellenabbildung",null,null,null,null,"Eingabebeprüfungen"]
[null,null,null,null,"Arbeitszeit",null,null,null,null,"Minus","akuell",null,null,null,null,null,"Datum","Monat OK","Abwesenh.","Freie Tage","ÜA-Tage","Std.","Soll-Std.",{"$f":"IF(ISNA($Q$5),Übertrag,INDIRECT($Q$5))","v":0},"Std.-Soll = 0","Std.-Soll > 0","Std.-Soll < 0",null,{"$f":"I_GAZNAZVon","v":2},3,{"$f":"I_GAZNAZBis","v":4},null,"Zeiteingabe","UZK-Eing.\nerlaubt","UZK-Eing.\ngültig","Normalst. ein erlaubt","Normalstd.\neingegeben","Normal VON möglich OG","Normal VON möglich UG","Normal BIS möglich OG","Normal BIS möglich UG","Normal VON\n15min","Normal VON richtig","Normal BIS\n15min","Normal BIS richtig","Status Zeilen Eingabe"]
[{"$f":"IF($R8,$Q8,\"\")","v":"2024-02-01"},{"$f":"IF($R8,VLOOKUP(WEEKDAY($Q8,2),WOTA,2,FALSE),\"\")","v":"Do"},{"$f":"IF($R8,\" \"&IF($S8=\"\",VLOOKUP($Q8,FListe,3,FALSE),$S8),\"\")","v":" "},null,{"$f":"IF(AND($R8,$T8<>\"F\"),IF($AC8=$AE8,\"keine NAZ\",TEXT($AC8,\"hh:mm\")&\"-\"&TEXT($AC8+$F8+$G8,\"hh:mm\")),\"\")","v":"08:00-16:00"},{"$f":"IF($R8,IF($T8=\"F\",0,VLOOKUP($B8,GAZ,I_GAZNAZMP,FALSE)),\"\")","v":"08:00:00"},{"$f":"IF($R8,$AD8,\"\")","v":"00:00:00"},null,null,{"$f":"IF(AND($R8,$AK8,NOT($Y8)),ROUND(($V8-$F8-$G8)*24,2),IF($D8=\"Z\",$F8*-24,\"\"))","v":""},{"$f":"$X8","v":0},null,null,null,null,null,{"$f":"DATE(Jahr,$Q2,1)","v":"2024-02-01"},{"$f":"$Q$2=MONTH($Q8)","v":true},{"$f":"IF(OR($D8=\"U\",$D8=\"Z\",$D8=\"ZK\",$D8=\"K\"),VLOOKUP($D8,UZK,2,FALSE),\"\")","v":""},{"$f":"IF($R8,VLOOKUP($Q8,FListe,4,FALSE),\"\")","v":"A"},{"$f":"IF($R8,VLOOKUP($Q8,FListe,5,FALSE),\"\")","v":"A"},{"$f":"$I8-$H8","v":0},{"$f":"IF($R8,ROUND($V8-$F8-$AD8,15),\"\")","v":-0.33333333333333298},{"$f":"IF($J8<>\"\",$X7+$J8,$X7)","v":0},{"$f":"($W8=0)","v":false},{"$f":"($W8>0)","v":false},{"$f":"($W8<0)","v":true},{"$f":"IF($U8=\"F\",\"\",TIME(0,0,0))","v":"00:00:00"},{"$f":"IF($U8=\"F\",\"\",IF(ISNA(VLOOKUP($B8,GAZ,AC$7,FALSE)),0,VLOOKUP($B8,GAZ,AC$7,FALSE)))","v":"08:00:00"},{"$f":"IF(OR($U8=\"F\",$S8<>\"\",ISNA(VLOOKUP($B8,GAZ,AD$7,FALSE))),0,IF(NOT($AK8),VLOOKUP($B8,GAZ,11,FALSE),IF(($I8-$H8)*24>=6,VLOOKUP($B8,GAZ,3,FALSE),0)))","v":"00:00:00"},{"$f":"IF($U8=\"F\",\"\",IF(ISNA(VLOOKUP($B8,GAZ,AE$7,FALSE)),0,VLOOKUP($B8,GAZ,AE$7,FALSE)))","v":"16:00:00"},{"$f":"IF($U8=\"F\",\"\",TIME(23,59,0))","v":"23:59:00"},{"$f":"OR($H8<>\"\",$I8<>\"\")","v":false},{"$f":"AND($T8<>\"F\",NOT($AG8),NOT($AC8=$AE8))","v":true},{"$f":"AND($AH8,OR($D8=\"U\",$D8=\"Z\",$D8=\"K\"))","v":false},{"$f":"AND($U8<>\"F\",$D8<>\"U\",$D8<>\"Z\",$D8<>\"K\",$R8)","v":true},{"$f":"AND($H8<>\"\",$I8<>\"\")","v":false},{"$f":"IF($AJ8,TagUG,\"\")","v":"00:00:00"},{"$f":"IF($AJ8,IF($I8=\"\",IF(AND($L8<>\"\",$L8<$AF8),$L8,IF(AND($M8<>\"\",$M8<$AF8),$M8,TagOG)),$I8),\"\")","v":"23:59:00"},{"$f":"IF($AJ8,IF($H8=\"\",$AB8,$H8),\"\")","v":"00:00:00"},{"$f":"IF($AJ8,IF(AND($L8<>\"\",$L8<$AF8),$L8,IF(AND($M8<>\"\",$M8<$AF8),$M8,TagOG)),\"\")","v":"23:59:00"},{"$f":"MOD($H8*24,0.25)=0","v":true},{"$f":"AND($AJ8,ISNUMBER($H8),$H8>=$AB8,$H8<=$AF8,OR($I8=\"\",$H8<=$I8))","v":false},{"$f":"MOD($I8*24,0.25)=0","v":true},{"$f":"AND($AJ8,ISNUMBER($I8),$I8>=$AB8,$I8<=$AF8,OR($H8=\"\",$I8>=$H8))","v":false},{"$f":"IF(AND(ISBLANK($D8),ISBLANK($H8),ISBLANK($I8)),0,1)","v":0}]
["2024-02-02","Fr"," ",null,{"$f":"IF(AND($R9,$T9<>\"F\"),IF($AC9=$AE9,\"keine NAZ\",TEXT($AC9,\"hh:mm\")&\"-\"&TEXT($AC9+$F9+$G9,\"hh:mm\")),\"\")","v":"08:00-16:00"},"08:00:00","00:00:00",null,null,"",0,null,null,null,null,null,{"$f":" Q8+1","v":"2024-02-02"},true,"","A","A",{"$f":"$I9-$H9","v":0},{"$f":"IF($R9,ROUND($V9-$F9-$AD9,15),\"\")","v":-0.33333333333333298},0,false,false,true,"00:00:00","08:00:00","00:00:00","16:00:00","23:59:00",false,true,false,true,false,"00:00:00","23:59:00",{"$f":"IF($AJ9,IF($H9=\"\",TagUG,$H9),\"\")","v":"00:00:00"},"23:59:00",true,false,true,false,0]
["2024-02-03","Sa"," Wochenende",null,"","00:00:00","00:00:00",null,null,"",0,null,null,null,null,null,"2024-02-03",true,"","F","A",0,0,0,true,false,false,"00:00:00","00:00:00","00:00:00","00:00:00","23:59:00",false,false,false,true,false,"00:00:00","23:59:00","00:00:00","23:59:00",true,false,true,false,0]
["2024-02-04","So"," Wochenende",null,"","00:00:00","00:00:00",null,null,"",0,null,null,null,null,null,"2024-02-04",true,"","F","F",0,0,0,true,false,false,"","","00:00:00","","",false,false,false,false,false,"","","","",true,false,true,false,0]
["2024-02-05","Mo"," ",null,"08:00-16:00","08:00:00","00:00:00",null,null,"",0,null,null,null,null,null,"2024-02-05",true,"","A","A",0,-0.33333333333333298,0,false,false,true,"00:00:00","08:00:00","00:00:00","16:00:00","23:59:00",false,true,false,true,false,"00:00:00","23:59:00","00:00:00","23:59:00",true,false,true,false,0]
["2024-02-06","Di"," ",null,"08:00-16:00","08:00:00","00:00:00",null,null,"",0,null,null,null,null,null,"2024-02-06",true,"","A","A",0,-0.33333333333333298,0,false,false,true,"00:00:00","08:00:00","00:00:00","16:00:00","23:59:00",false,true,false,true,false,"00:00:00","23:59:00","00:00:00","23:59:00",true,false,true,false,0]
["2024-02-07","Mi"," ",null,"08:00-16:00","08:00:00","00:00:00",null,null,"",0,null,null,null,null,null,"2024-02-07",true,"","A","A",0,-0.33333333333333298,0,false,false,true,"00:00:00","08:00:00","00:00:00","16:00:00","23:59:00",false,true,false,true,false,"00:00:00","23:59:00","00:00:00","23:59:00",true,false,true,false,0]
["2024-02-08","Do"," ",null,"08:00-16:00","08:00:00","00:00:00",null,null,"",0,null,null,null,null,null,"2024-02-08",true,"","A","A",0,-0.33333333333333298,0,false,false,true,"00:00:00","08:00:00","00:00:00","16:00:00","23:59:00",false,true,false,true,false,"00:00:00","23:59:00","00:00:00","23:59:00",true,false,true,false,0]
["2024-02-09","Fr"," ",null,"08:00-16:00","08:00:00","00:00:00",null,null,"",0,null,null,null,null,null,"2024-02-09",true,"","A","A",0,-0.33333333333333298,0,false,false,true,"00:00:00","08:00:00","00:00:00","16:00:00","23:59:00",false,true,false,true,false,"00:00:00","23:59:00","00:00:00","23:59:00",true,false,true,false,0]
["2024-02-10","Sa"," Wochenende",null,"","00:00:00","00:00:00",null,null,"",0,null,null,null,null,null,"2024-02-10",true,"","F","A",0,0,0,true,false,false,"00:00:00","00:00:00","00:00:00","00:00:00","23:59:00",false,false,false,true,false,"00:00:00","23:59:00","00:00:00","23:59:00",true,false,true,false,0]
["2024-02-11","So"," Wochenende",null,"","00:00:00","00:00:00",null,null,"",0,null,null,null,null,null,"2024-02-11",true,"","F","F",0,0,0,true,false,false,"","","00:00:00","","",false,false,false,false,false,"","","","",true,false,true,false,0]
["2024-02-12","Mo"," ",null,"08:00-16:00","08:00:00","00:00:00",null,null,"",0,null,null,null,null,null,"2024-02-12",true,"","A","A",0,-0.33333333333333298,0,false,false,true,"00:00:00","08:00:00","00:00:00","16:00:00","23:59:00",false,true,false,true,false,"00:00:00","23:59:00","00:00:00","23:59:00",true,false,true,false,0]
["2024-02-13","Di"," ",null,"08:00-16:00","08:00:00","00:00:00",null,null,"",0,null,null,null,null,null,"2024-02-13",true,"","A","A",0,-0.33333333333333298,0,false,false,true,"00:00:00","08:00:00","00:00:00","16:00:00","23:59:00",false,true,false,true,false,"00:00:00","23:59:00","00:00:00","23:59:00",true,false,true,false,0]
["2024-02-14","Mi"," Aschermittwoch",null,"08:00-16:00","08:00:00","00:00:00",null,null,"",0,null,null,null,null,null,"2024-02-14",true,"","A","A",0,-0.33333333333333298,0,false,false,true,"00:00:00","08:00:00","00:00:00","16:00:00","23:59:00",false,true,false,true,false,"00:00:00","23:59:00","00:00:00","23:59:00",true,false,true,false,0]
["2024-02-15","Do"," ",null,"08:00-16:00","08:00:00","00:00:00",null,null,"",0,null,null,null,null,null,"2024-02-15",true,"","A","A",0,-0.33333333333333298,0,false,false,true,"00:00:00","08:00:00","00:00:00","16:00:00","23:59:00",false,true,false,true,false,"00:00:00","23:59:00","00:00:00","23:59:00",true,false,true,false,0]
["2024-02-16","Fr"," ",null,"08:00-16:00","08:00:00","00:00:00",null,null,"",0,null,null,null,null,null,"2024-02-16",true,"","A","A",0,-0.33333333333333298,0,false,false,true,"00:00:00","08:00:00","00:00:00","16:00:00","23:59:00",false,true,false,true,false,"00:00:00","23:59:00","00:00:00","23:59:00",true,false,true,false,0]
["2024-02-17","Sa"," Wochenende",null,"","00:00:00","00:00:00",null,null,"",0,null,null,null,null,null,"2024-02-17",true,"","F","A",0,0,0,true,false,false,"00:00:00","00:00:00","00:00:00","00:00:00","23:59:00",false,false,false,true,false,"00:00:00","23:59:00","00:00:00","23:59:00",true,false,true,false,0]
["2024-02-18","So"," Wochenende",null,"","00:00:00","00:00:00",null,null,"",0,null,null,null,null,null,"2024-02-18",true,"","F","F",0,0,0,true,false,false,"","","00:00:00","","",false,false,false,false,false,"","","","",true,false,true,false,0]
["2024-02-19","Mo"," ",null,"08:00-16:00","08:00:00","00:00:00",null,null,"",0,null,null,null,null,null,"2024-02-19",true,"","A","A",0,-0.33333333333333298,0,false,false,true,"00:00:00","08:00:00","00:00:00","16:00:00","23:59:00",false,true,false,true,false,"00:00:00","23:59:00","00:00:00","23:59:00",true,false,true,false,0]
["2024-02-20","Di"," ",null,"08:00-16:00","08:00:00","00:00:00",null,null,"",0,null,null,null,null,null,"2024-02-20",true,"","A","A",0,-0.33333333333333298,0,false,false,true,"00:00:00","08:00:00","00:00:00","16:00:00","23:59:00",false,true,false,true,false,"00:00:00","23:59:00","00:00:00","23:59:00",true,false,true,false,0]
["2024-02-21","Mi"," ",null,"08:00-16:00","08:00:00","00:00:00",null,null,"",0,null,null,null,null,null,"2024-02-21",true,"","A","A",0,-0.33333333333333298,0,false,false,true,"00:00:00","08:00:00","00:00:00","16:00:00","23:59:00",false,true,false,true,false,"00:00:00","23:59:00","00:00:00","23:59:00",true,false,true,false,0]
["2024-02-22","Do"," ",null,"08:00-16:00","08:00:00","00:00:00",null,null,"",0,null,null,null,null,null,"2024-02-22",true,"","A","A",0,-0.33333333333333298,0,false,false,true,"00:00:00","08:00:00","00:00:00","16:00:00","23:59:00",false,true,false,true,false,"00:00:00","23:59:00","00:00:00","23:59:00",true,false,true,false,0]
["2024-02-23","Fr"," ",null,"08:00-16:00","08:00:00","00:00:00",null,null,"",0,null,null,null,null,null,"2024-02-23",true,"","A","A",0,-0.33333333333333298,0,false,false,true,"00:00:00","08:00:00","00:00:00","16:00:00","23:59:00",false,true,false,true,false,"00:00:00","23:59:00","00:00:00","23:59:00",true,false,true,false,0]
["2024-02-24","Sa"," Wochenende",null,"","00:00:00","00:00:00",null,null,"",0,null,null,null,null,null,"2024-02-24",true,"","F","A",0,0,0,true,false,false,"00:00:00","00:00:00","00:00:00","00:00:00","23:59:00",false,false,false,true,false,"00:00:00","23:59:00","00:00:00","23:59:00",true,false,true,false,0]
["2024-02-25","So"," Wochenende",null,"","00:00:00","00:00:00",null,null,"",0,null,null,null,null,null,"2024-02-25",true,"","F","F",0,0,0,true,false,false,"","","00:00:00","","",false,false,false,false,false,"","","","",true,false,true,false,0]
["2024-02-26","Mo"," ",null,"08:00-16:00","08:00:00","00:00:00",null,null,"",0,null,null,null,null,null,"2024-02-26",true,"","A","A",0,-0.33333333333333298,0,false,false,true,"00:00:00","08:00:00","00:00:00","16:00:00","23:59:00",false,true,false,true,false,"00:00:00","23:59:00","00:00:00","23:59:00",true,false,true,false,0]
["2024-02-27","Di"," ",null,"08:00-16:00","08:00:00","00:00:00",null,null,"",0,null,null,null,null,null,"2024-02-27",true,"","A","A",0,-0.33333333333333298,0,false,false,true,"00:00:00","08:00:00","00:00:00","16:00:00","23:59:00",false,true,false,true,false,"00:00:00","23:59:00","00:00:00","23:59:00",true,false,true,false,0]
["2024-02-28","Mi"," ",null,"08:00-16:00","08:00:00","00:00:00",null,null,"",0,null,null,null,null,null,"2024-02-28",true,"","A","A",0,-0.33333333333333298,0,false,false,true,"00:00:00","08:00:00","00:00:00","16:00:00","23:59:00",false,true,false,true,false,"00:00:00","23:59:00","00:00:00","23:59:00",true,false,true,false,0]
["2024-02-29","Do"," ",null,"08:00-16:00","08:00:00","00:00:00",null,null,"",0,null,null,null,null,null,"2024-02-29",true,"","A","A",0,-0.33333333333333298,0,false,false,true,"00:00:00","08:00:00","00:00:00","16:00:00","23:59:00",false,true,false,true,false,"00:00:00","23:59:00","00:00:00","23:59:00",true,false,true,false,0]
["","","",null,"","","",null,null,"",0,null,null,null,null,null,"2024-03-01",false,"","","",0,"",0,false,true,false,"00:00:00","00:00:00","00:00:00","00:00:00","23:59:00",false,false,false,false,false,"","","","",true,false,true,false,0]
["","","",null,"","","",null,null,"",0,null,null,null,null,null,"2024-03-02",false,"","","",0,"",0,false,true,false,"00:00:00","00:00:00","00:00:00","00:00:00","23:59:00",false,false,false,false,false,"","","","",true,false,true,false,0]
["Arbeitstage",{"$f":"COUNTIF(T$8:T$38,\"A\")","v":21},null,null,{"$f":"\"Monat Std.-Saldo (~15min) > \"","v":"Monat Std.-Saldo (~15min) > "},null,null,null,null,{"$f":"ROUND(SUM(J8:J38)*4,0)/4","v":0}]
["ZA-Tage",{"$f":"COUNTIF(D$8:D$38,\"Z\")","v":0},null,null," Vormonat Std.Saldo > ",null,null,null,null,{"$f":"$K5","v":0},null,null,null,null,null,null,"Gültigkeit ausbezahlt"]
["Urlaubstage",{"$f":"COUNTIF(D$8:D$38,\"U\")","v":0},null,null," Gesamt Std. Saldo > ",null,null,null,null,{"$f":"$J39+$J40","v":0},null,null,null,null,null,null,{"$f":"AND($K$41>=0,$K$41<=$J$41,MOD($K$41,0.25)=0)","v":true}]
["Krank",{"$f":"COUNTIF(D$8:D$38,\"K\")","v":0},null,null," Übertrag Std. Saldo > ",null,null,null,null,{"$f":"$J41","v":0},{"$f":"\" < Dieser Stunden-Saldo wird in das nächste \"&IF($Q$3=\"Dezember\",\"Jahr\",\"Monat\")&\" übertragen\"","v":" < Dieser Stunden-Saldo wird in das nächste Monat übertragen"}]
[null,null,null,"Z"]
[]
[{"$f":"\"Unterschrift von \"&Vorgesetzter","v":"Unterschrift von Vorname Nachname"},null,null,null,null,null,null,null,null,null,null,null,{"$f":"\"Unterschrift von \"&Name","v":"Unterschrift von Vorname Nachname"}]

{"sheet":"März","index":3,"n_rows":45,"n_cols":46,"rows_kept":45,"cut":false,"hidden":true,"merged":[[42,4,42,8],[43,4,43,8],[44,0,44,3],[44,12,44,15],[36,11,36,15],[37,11,37,15],[38,2,41,3],[38,4,38,8],[38,10,40,15],[39,4,39,8],[40,4,40,8],[41,4,41,8],[41,10,41,15],[30,11,30,15],[31,11,31,15],[32,11,32,15],[33,11,33,15],[34,11,34,15],[35,11,35,15],[24,11,24,15],[25,11,25,15],[26,11,26,15],[27,11,27,15],[28,11,28,15],[29,11,29,15],[18,11,18,15],[19,11,19,15],[20,11,20,15],[21,11,21,15],[22,11,22,15],[23,11,23,15],[12,11,12,15],[13,11,13,15],[14,11,14,15],[15,11,15,15],[16,11,16,15],[17,11,17,15],[5,27,5,31],[7,11,7,15],[8,11,8,15],[9,11,9,15],[10,11,10,15],[11,11,11,15],[4,4,4,6],[4,7,4,9],[5,2,6,2],[5,3,6,3],[5,5,6,5],[5,6,6,6],[5,7,6,7],[5,8,6,8],[0,15,1,15],[1,5,1,8],[2,5,2,8],[3,0,3,3],[3,4,3,6],[3,7,3,9],[3,11,6,15],[4,0,6,0],[4,1,6,1],[4,2,4,3]]}
[{"$f":"Konfig!$A$1","v":" BOKU-Zeiterfassung für Wissenschaftliches Personal"},null,null,null,null,null,null,null,null,null,null,null,null,null,null,null,"Monat","Stunden-Saldo Grenzen","Status Blatteingabe"]
[{"$f":"\" Org.-Einh. : \"&OrgEinheit","v":" Org.-Einh. : Hxxxxx"},null,null,null,null,"Zeitmodell:",null,null,null,{"$f":"\" \"&Zeitmodell","v":" Vollzeit"},null,null,null,null,null,null,{"$f":"IF(ISNA($Q$4),1,$Q$4)","v":3},0,{"$f":"SUM($AT8:$AT38)","v":0}]
[{"$f":" \" Mitarbeiter: \"&Name","v":" Mitarbeiter: Vorname Nachname"},null,null,null,null,"Vorgesetzter:",null,null,null,{"$f":"\" \"&Vorgesetzter","v":" Vorname Nachname"},null,null,null,null,null,null,{"$f":"RIGHT(CELL(\"filename\",A1),LEN(CELL(\"filename\",A1))-SEARCH(\"]\",CELL(\"filename\",A1),1))","v":"März"},null,{"$f":"IF($Q$2=1,$S$2,$S$2+INDIRECT($S$5))","v":0}]
[{"$f":" \" Monat: \"&$Q$3&\" \"&Jahr","v":" Monat: März 2024"},null,null,null,"Dienstplan",null,null,"Normalstunden",null,null,"Übertrag","Anmerkungen ",null,null,null,null,{"$f":"IF(ISNA(VLOOKUP($Q$3,MTab,2,FALSE)),1,VLOOKUP($Q$3,MTab,2,FALSE))","v":3},null,"Übertrags Adresse Blatteingabe"]
[" Datum","Wochentag","Tagesinformation",null,{"$f":"\"Wochen-AZ\"&\" \"&TEXT(WAZ,\"[hh]:mm\")","v":"Wochen-AZ 40:00"},null,null," Stunden 1:1",null,null,{"$f":"IF(ISNA($Q$5),Übertrag,INDIRECT($Q$5))","v":0},null,null,null,null,null,{"$f":"IF(ISNA(VLOOKUP($Q$3,MTab,3,FALSE)),\"Übertrag\",VLOOKUP($Q$3,MTab,3,FALSE))","v":"Februar!$J$42"},null,{"$f":"IF(ISNA(VLOOKUP($Q$3,MTab,4,FALSE)),$Q$3&\"!$R$2\",VLOOKUP($Q$3,MTab,4,FALSE))","v":"Februar!$S$3"}]
[null,null," Feiertage\n Wochenende\n Urlaub, ZA, Krank","[U]rlaub\n[Z]A\n[K]rank","Normal-","Soll","MP","Von","Bis","Plus","Saldo",null,null,null,null,null,"Hintergrundberechnungen",null,null,null,null,null,null,"Saldo aktuell",null,null,null,"GAZ-Tabellenabbildung",null,null,null,null,"Eingabebeprüfungen"]
[null,null,null,null,"Arbeitszeit",null,null,null,null,"Minus","akuell",null,null,null,null,null,"Datum","Monat OK","Abwesenh.","Freie Tage","ÜA-Tage","Std.","Soll-Std.",{"$f":"IF(ISNA($Q$5),Übertrag,INDIRECT($Q$5))","v":0},"Std.-Soll = 0","Std.-Soll > 0","Std.-Soll < 0",null,{"$f":"I_GAZNAZVon","v":2},3,{"$f":"I_GAZNAZBis","v":4},null,"Zeiteingabe","UZK-Eing.\nerlaubt","UZK-Eing.\ngültig","Normalst. ein erlaubt","Normalstd.\neingegeben","Normal VON möglich OG","Normal VON möglich UG","Normal BIS möglich OG","Normal BIS möglich UG","Normal VON\n15min","Normal VON richtig","Normal BIS\n15min","Normal BIS richtig","Status Zeilen Eingabe"]
[{"$f":"IF($R8,$Q8,\"\")","v":"2024-03-01"},{"$f":"IF($R8,VLOOKUP(WEEKDAY($Q8,2),WOTA,2,FALSE),\"\")","v":"Fr"},{"$f":"IF($R8,\" \"&IF($S8=\"\",VLOOKUP($Q8,FListe,3,FALSE),$S8),\"\")","v":" "},null,{"$f":"IF(AND($R8,$T8<>\"F\"),IF($AC8=$AE8,\"keine NAZ\",TEXT($AC8,\"hh:mm\")&\"-\"&TEXT($AC8+$F8+$G8,\"hh:mm\")),\"\")","v":"08:00-16:00"},{"$f":"IF($R8,IF($T8=\"F\",0,VLOOKUP($B8,GAZ,I_GAZNAZMP,FALSE)),\"\")","v":"08:00:00"},{"$f":"IF($R8,$AD8,\"\")","v":"00:00:00"},null,null,{"$f":"IF(AND($R8,$AK8,NOT($Y8)),ROUND(($V8-$F8-$G8)*24,2),IF($D8=\"Z\",$F8*-24,\"\"))","v":""},{"$f":"$X8","v":0},null,null,null,null,null,{"$f":"DATE(Jahr,$Q2,1)","v":"2024-03-01"},{"$f":"$Q$2=MONTH($Q8)","v":true},{"$f":"IF(OR($D8=\"U\",$D8=\"Z\",$D8=\"ZK\",$D8=\"K\"),VLOOKUP($D8,UZK,2,FALSE),\"\")","v":""},{"$f":"IF($R8,VLOOKUP($Q8,FListe,4,FALSE),\"\")","v":"A"},{"$f":"IF($R8,VLOOKUP($Q8,FListe,5,FALSE),\"\")","v":"A"},{"$f":"$I8-$H8","v":0},{"$f":"IF($R8,ROUND($V8-$F8-$AD8,15),\"\")","v":-0.33333333333333298},{"$f":"IF($J8<>\"\",$X7+$J8,$X7)","v":0},{"$f":"($W8=0)","v":false},{"$f":"($W8>0)","v":false},{"$f":"($W8<0)","v":true},{"$f":"IF($U8=\"F\",\"\",TIME(0,0,0))","v":"00:00:00"},{"$f":"IF($U8=\"F\",\"\",IF(ISNA(VLOOKUP($B8,GAZ,AC$7,FALSE)),0,VLOOKUP($B8,GAZ,AC$7,FALSE)))","v":"08:00:00"},{"$f":"IF(OR($U8=\"F\",$S8<>\"\",ISNA(VLOOKUP($B8,GAZ,AD$7,FALSE))),0,IF(NOT($AK8),VLOOKUP($B8,GAZ,11,FALSE),IF(($I8-$H8)*24>=6,VLOOKUP($B8,GAZ,3,FALSE),0)))","v":"00:00:00"},{"$f":"IF($U8=\"F\",\"\",IF(ISNA(VLOOKUP($B8,GAZ,AE$7,FALSE)),0,VLOOKUP($B8,GAZ,AE$7,FALSE)))","v":"16:00:00"},{"$f":"IF($U8=\"F\",\"\",TIME(23,59,0))","v":"23:59:00"},{"$f":"OR($H8<>\"\",$I8<>\"\")","v":false},{"$f":"AND($T8<>\"F\",NOT($AG8),NOT($AC8=$AE8))","v":true},{"$f":"AND($AH8,OR($D8=\"U\",$D8=\"Z\",$D8=\"K\"))","v":false},{"$f":"AND($U8<>\"F\",$D8<>\"U\",$D8<>\"Z\",$D8<>\"K\",$R8)","v":true},{"$f":"AND($H8<>\"\",$I8<>\"\")","v":false},{"$f":"IF($AJ8,TagUG,\"\")","v":"00:00:00"},{"$f":"IF($AJ8,IF($I8=\"\",IF(AND($L8<>\"\",$L8<$AF8),$L8,IF(AND($M8<>\"\",$M8<$AF8),$M8,TagOG)),$I8),\"\")","v":"23:59:00"},{"$f":"IF($AJ8,IF($H8=\"\",$AB8,$H8),\"\")","v":"00:00:00"},{"$f":"IF($AJ8,IF(AND($L8<>\"\",$L8<$AF8),$L8,IF(AND($M8<>\"\",$M8<$AF8),$M8,TagOG)),\"\")","v":"23:59:00"},{"$f":"MOD($H8*24,0.25)=0","v":true},{"$f":"AND($AJ8,ISNUMBER($H8),$H8>=$AB8,$H8<=$AF8,OR($I8=\"\",$H8<=$I8))","v":false},{"$f":"MOD($I8*24,0.25)=0","v":true},{"$f":"AND($AJ8,ISNUMBER($I8),$I8>=$AB8,$I8<=$AF8,OR($H8=\"\",$I8>=$H8))","v":false},{"$f":"IF(AND(ISBLANK($D8),ISBLANK($H8),ISBLANK($I8)),0,1)","v":0}]
["2024-03-02","Sa"," Wochenende",null,{"$f":"IF(AND($R9,$T9<>\"F\"),IF($AC9=$AE9,\"keine NAZ\",TEXT($AC9,\"hh:mm\")&\"-\"&TEXT($AC9+$F9+$G9,\"hh:mm\")),\"\")","v":""},"00:00:00","00:00:00",null,null,"",0,null,null,null,null,null,{"$f":" Q8+1","v":"2024-03-02"},true,"","F","A",{"$f":"$I9-$H9","v":0},{"$f":"IF($R9,ROUND($V9-$F9-$AD9,15),\"\")","v":0},0,true,false,false,"00:00:00","00:00:00","00:00:00","00:00:00","23:59:00",false,false,false,true,false,"00:00:00","23:59:00",{"$f":"IF($AJ9,IF($H9=\"\",TagUG,$H9),\"\")","v":"00:00:00"},"23:59:00",true,false,true,false,0]
["2024-03-03","So"," Wochenende",null,"","00:00:00","00:00:00",null,null,"",0,null,null,null,null,null,"2024-03-03",true,"","F","F",0,0,0,true,false,false,"","","00:00:00","","",false,false,false,false,false,"","","","",true,false,true,false,0]
["2024-03-04","Mo"," ",null,"08:00-16:00","08:00:00","00:00:00",null,null,"",0,null,null,null,null,null,"2024-03-04",true,"","A","A",0,-0.33333333333333298,0,false,false,true,"00:00:00","08:00:00","00:00:00","16:00:00","23:59:00",false,true,false,true,false,"00:00:00","23:59:00","00:00:00","23:59:00",true,false,true,false,0]
["2024-03-05","Di"," ",null,"08:00-16:00","08:00:00","00:00:00",null,null,"",0,null,null,null,null,null,"2024-03-05",true,"","A","A",0,-0.33333333333333298,0,false,false,true,"00:00:00","08:00:00","00:00:00","16:00:00","23:59:00",false,true,false,true,false,"00:00:00","23:59:00","00:00:00","23:59:00",true,false,true,false,0]
["2024-03-06","Mi"," ",null,"08:00-16:00","08:00:00","00:00:00",null,null,"",0,null,null,null,null,null,"2024-03-06",true,"","A","A",0,-0.33333333333333298,0,false,false,true,"00:00:00","08:00:00","00:00:00","16:00:00","23:59:00",false,true,false,true,false,"00:00:00","23:59:00","00:00:00","23:59:00",true,false,true,false,0]
["2024-03-07","Do"," ",null,"08:00-16:00","08:00:00","00:00:00",null,null,"",0,null,null,null,null,null,"2024-03-07",true,"","A","A",0,-0.33333333333333298,0,false,false,true,"00:00:00","08:00:00","00:00:00","16:00:00","23:59:00",false,true,false,true,false,"00:00:00","23:59:00","00:00:00","23:59:00",true,false,true,false,0]
["2024-03-08","Fr"," ",null,"08:00-16:00","08:00:00","00:00:00",null,null,"",0,null,null,null,null,null,"2024-03-08",true,"","A","A",0,-0.33333333333333298,0,false,false,true,"00:00:00","08:00:00","00:00:00","16:00:00","23:59:00",false,true,false,true,false,"00:00:00","23:59:00","00:00:00","23:59:00",true,false,true,false,0]
["2024-03-09","Sa"," Wochenende",null,"","00:00:00","00:00:00",null,null,"",0,null,null,null,null,null,"2024-03-09",true,"","F","A",0,0,0,true,false,false,"00:00:00","00:00:00","00:00:00","00:00:00","23:59:00",false,false,false,true,false,"00:00:00","23:59:00","00:00:00","23:59:00",true,false,true,false,0]
["2024-03-10","So"," Wochenende",null,"","00:00:00","00:00:00",null,null,"",0,null,null,null,null,null,"2024-03-10",true,"","F","F",0,0,0,true,false,false,"","","00:00:00","","",false,false,false,false,false,"","","","",true,false,true,false,0]
["2024-03-11","Mo"," ",null,"08:00-16:00","08:00:00","00:00:00",null,null,"",0,null,null,null,null,null,"2024-03-11",true,"","A","A",0,-0.33333333333333298,0,false,false,true,"00:00:00","08:00:00","00:00:00","16:00:00","23:59:00",false,true,false,true,false,"00:00:00","23:59:00","00:00:00","23:59:00",true,false,true,false,0]
["2024-03-12","Di"," ",null,"08:00-16:00","08:00:00","00:00:00",null,null,"",0,null,null,null,null,null,"2024-03-12",true,"","A","A",0,-0.33333333333333298,0,false,false,true,"00:00:00","08:00:00","00:00:00","16:00:00","23:59:00",false,true,false,true,false,"00:00:00","23:59:00","00:00:00","23:59:00",true,false,true,false,0]
["2024-03-13","Mi"," ",null,"08:00-16:00","08:00:00","00:00:00",null,null,"",0,null,null,null,null,null,"2024-03-13",true,"","A","A",0,-0.33333333333333298,0,false,false,true,"00:00:00","08:00:00","00:00:00","16:00:00","23:59:00",false,true,false,true,false,"00:00:00","23:59:00","00:00:00","23:59:00",true,false,true,false,0]
["2024-03-14","Do"," ",null,"08:00-16:00","08:00:00","00:00:00",null,null,"",0,null,null,null,null,null,"2024-03-14",true,"","A","A",0,-0.33333333333333298,0,false,false,true,"00:00:00","08:00:00","00:00:00","16:00:00","23:59:00",false,true,false,true,false,"00:00:00","23:59:00","00:00:00","23:59:00",true,false,true,false,0]
["2024-03-15","Fr"," ",null,"08:00-16:00","08:00:00","00:00:00",null,null,"",0,null,null,null,null,null,"2024-03-15",true,"","A","A",0,-0.33333333333333298,0,false,false,true,"00:00:00","08:00:00","00:00:00","16:00:00","23:59:00",false,true,false,true,false,"00:00:00","23:59:00","00:00:00","23:59:00",true,false,true,false,0]
["2024-03-16","Sa"," Wochenende",null,"","00:00:00","00:00:00",null,null,"",0,null,null,null,null,null,"2024-03-16",true,"","F","A",0,0,0,true,false,false,"00:00:00","00:00:00","00:00:00","00:00:00","23:59:00",false,false,false,true,false,"00:00:00","23:59:00","00:00:00","23:59:00",true,false,true,false,0]
["2024-03-17","So"," Wochenende",null,"","00:00:00","00:00:00",null,null,"",0,null,null,null,null,null,"2024-03-17",true,"","F","F",0,0,0,true,false,false,"","","00:00:00","","",false,false,false,false,false,"","","","",true,false,true,false,0]
["2024-03-18","Mo"," ",null,"08:00-16:00","08:00:00","00:00:00",null,null,"",0,null,null,null,null,null,"2024-03-18",true,"","A","A",0,-0.33333333333333298,0,false,false,true,"00:00:00","08:00:00","00:00:00","16:00:00","23:59:00",false,true,false,true,false,"00:00:00","23:59:00","00:00:00","23:59:00",true,false,true,false,0]
["2024-03-19","Di"," ",null,"08:00-16:00","08:00:00","00:00:00",null,null,"",0,null,null,null,null,null,"2024-03-19",true,"","A","A",0,-0.33333333333333298,0,false,false,true,"00:00:00","08:00:00","00:00:00","16:00:00","23:59:00",false,true,false,true,false,"00:00:00","23:59:00","00:00:00","23:59:00",true,false,true,false,0]
["2024-03-20","Mi"," ",null,"08:00-16:00","08:00:00","00:00:00",null,null,"",0,null,null,null,null,null,"2024-03-20",true,"","A","A",0,-0.33333333333333298,0,false,false,true,"00:00:00","08:00:00","00:00:00","16:00:00","23:59:00",false,true,false,true,false,"00:00:00","23:59:00","00:00:00","23:59:00",true,false,true,false,0]
["2024-03-21","Do"," ",null,"08:00-16:00","08:00:00","00:00:00",null,null,"",0,null,null,null,null,null,"2024-03-21",true,"","A","A",0,-0.33333333333333298,0,false,false,true,"00:00:00","08:00:00","00:00:00","16:00:00","23:59:00",false,true,false,true,false,"00:00:00","23:59:00","00:00:00","23:59:00",true,false,true,false,0]
["2024-03-22","Fr"," ",null,"08:00-16:00","08:00:00","00:00:00",null,null,"",0,null,null,null,null,null,"2024-03-22",true,"","A","A",0,-0.33333333333333298,0,false,false,true,"00:00:00","08:00:00","00:00:00","16:00:00","23:59:00",false,true,false,true,false,"00:00:00","23:59:00","00:00:00","23:59:00",true,false,true,false,0]
["2024-03-23","Sa"," Wochenende",null,"","00:00:00","00:00:00",null,null,"",0,null,null,null,null,null,"2024-03-23",true,"","F","A",0,0,0,true,false,false,"00:00:00","00:00:00","00:00:00","00:00:00","23:59:00",false,false,false,true,false,"00:00:00","23:59:00","00:00:00","23:59:00",true,false,true,false,0]
["2024-03-24","So"," Palmsonntag",null,"","00:00:00","00:00:00",null,null,"",0,null,null,null,null,null,"2024-03-24",true,"","F","F",0,0,0,true,false,false,"","","00:00:00","","",false,false,false,false,false,"","","","",true,false,true,false,0]
["2024-03-25","Mo"," ",null,"08:00-16:00","08:00:00","00:00:00",null,null,"",0,null,null,null,null,null,"2024-03-25",true,"","A","A",0,-0.33333333333333298,0,false,false,true,"00:00:00","08:00:00","00:00:00","16:00:00","23:59:00",false,true,false,true,false,"00:00:00","23:59:00","00:00:00","23:59:00",true,false,true,false,0]
["2024-03-26","Di"," ",null,"08:00-16:00","08:00:00","00:00:00",null,null,"",0,null,null,null,null,null,"2024-03-26",true,"","A","A",0,-0.33333333333333298,0,false,false,true,"00:00:00","08:00:00","00:00:00","16:00:00","23:59:00",false,true,false,true,false,"00:00:00","23:59:00","00:00:00","23:59:00",true,false,true,false,0]
["2024-03-27","Mi"," ",null,"08:00-16:00","08:00:00","00:00:00",null,null,"",0,null,null,null,null,null,"2024-03-27",true,"","A","A",0,-0.33333333333333298,0,false,false,true,"00:00:00","08:00:00","00:00:00","16:00:00","23:59:00",false,true,false,true,false,"00:00:00","23:59:00","00:00:00","23:59:00",true,false,true,false,0]
["2024-03-28","Do"," Gründonnerstag",null,"08:00-16:00","08:00:00","00:00:00",null,null,"",0,null,null,null,null,null,"2024-03-28",true,"","A","A",0,-0.33333333333333298,0,false,false,true,"00:00:00","08:00:00","00:00:00","16:00:00","23:59:00",false,true,false,true,false,"00:00:00","23:59:00","00:00:00","23:59:00",true,false,true,false,0]
["2024-03-29","Fr"," Karfreitag",null,"08:00-16:00","08:00:00","00:00:00",null,null,"",0,null,null,null,null,null,"2024-03-29",true,"","A","A",0,-0.33333333333333298,0,false,false,true,"00:00:00","08:00:00","00:00:00","16:00:00","23:59:00",false,true,false,true,false,"00:00:00","23:59:00","00:00:00","23:59:00",true,false,true,false,0]
["2024-03-30","Sa"," Wochenende",null,"","00:00:00","00:00:00",null,null,"",0,null,null,null,null,null,"2024-03-30",true,"","F","A",0,0,0,true,false,false,"00:00:00","00:00:00","00:00:00","00:00:00","23:59:00",false,false,false,true,false,"00:00:00","23:59:00","00:00:00","23:59:00",true,false,true,false,0]
["2024-03-31","So"," Ostersonntag",null,"","00:00:00","00:00:00",null,null,"",0,null,null,null,null,null,"2024-03-31",true,"","F","F",0,0,0,true,false,false,"","","00:00:00","","",false,false,false,false,false,"","","","",true,false,true,false,0]
["Arbeitstage",{"$f":"COUNTIF(T$8:T$38,\"A\")","v":21},null,null,{"$f":"\"Monat Std.-Saldo (~15min) > \"","v":"Monat Std.-Saldo (~15min) > "},null,null,null,null,{"$f":"ROUND(SUM(J8:J38)*4,0)/4","v":0}]
["ZA-Tage",{"$f":"COUNTIF(D$8:D$38,\"Z\")","v":0},null,null," Vormonat Std.Saldo > ",null,null,null,null,{"$f":"$K5","v":0},null,null,null,null,null,null,"Gültigkeit ausbezahlt"]
["Urlaubstage",{"$f":"COUNTIF(D$8:D$38,\"U\")","v":0},null,null," Gesamt Std. Saldo > ",null,null,null,null,{"$f":"$J39+$J40","v":0},null,null,null,null,null,null,{"$f":"AND($K$41>=0,$K$41<=$J$41,MOD($K$41,0.25)=0)","v":true}]
["Krank",{"$f":"COUNTIF(D$8:D$38,\"K\")","v":0},null,null," Übertrag Std. Saldo > ",null,null,null,null,{"$f":"$J41","v":0},{"$f":"\" < Dieser Stunden-Saldo wird in das nächste \"&IF($Q$3=\"Dezember\",\"Jahr\",\"Monat\")&\" übertragen\"","v":" < Dieser Stunden-Saldo wird in das nächste Monat übertragen"}]
[null,null,null,"Z"]
[]
[{"$f":"\"Unterschrift von \"&Vorgesetzter","v":"Unterschrift von Vorname Nachname"},null,null,null,null,null,null,null,null,null,null,null,{"$f":"\"Unterschrift von \"&Name","v":"Unterschrift von Vorname Nachname"}]

{"sheet":"April","index":4,"n_rows":45,"n_cols":46,"rows_kept":45,"cut":false,"hidden":true,"merged":[[42,4,42,8],[43,4,43,8],[44,0,44,3],[44,12,44,15],[36,11,36,15],[37,11,37,15],[38,2,41,3],[38,4,38,8],[38,10,40,15],[39,4,39,8],[40,4,40,8],[41,4,41,8],[41,10,41,15],[30,11,30,15],[31,11,31,15],[32,11,32,15],[33,11,33,15],[34,11,34,15],[35,11,35,15],[24,11,24,15],[25,11,25,15],[26,11,26,15],[27,11,27,15],[28,11,28,15],[29,11,29,15],[18,11,18,15],[19,11,19,15],[20,11,20,15],[21,11,21,15],[22,11,22,15],[23,11,23,15],[12,11,12,15],[13,11,13,15],[14,11,14,15],[15,11,15,15],[16,11,16,15],[17,11,17,15],[5,27,5,31],[7,11,7,15],[8,11,8,15],[9,11,9,15],[10,11,10,15],[11,11,11,15],[4,4,4,6],[4,7,4,9],[5,2,6,2],[5,3,6,3],[5,5,6,5],[5,6,6,6],[5,7,6,7],[5,8,6,8],[0,15,1,15],[1,5,1,8],[2,5,2,8],[3,0,3,3],[3,4,3,6],[3,7,3,9],[3,11,6,15],[4,0,6,0],[4,1,6,1],[4,2,4,3]]}
[{"$f":"Konfig!$A$1","v":" BOKU-Zeiterfassung für Wissenschaftliches Personal"},null,null,null,null,null,null,null,null,null,null,null,null,null,null,null,"Monat","Stunden-Saldo Grenzen","Status Blatteingabe"]
[{"$f":"\" Org.-Einh. : \"&OrgEinheit","v":" Org.-Einh. : Hxxxxx"},null,null,null,null,"Zeitmodell:",null,null,null,{"$f":"\" \"&Zeitmodell","v":" Vollzeit"},null,null,null,null,null,null,{"$f":"IF(ISNA($Q$4),1,$Q$4)","v":4},0,{"$f":"SUM($AT8:$AT38)","v":0}]
[{"$f":" \" Mitarbeiter: \"&Name","v":" Mitarbeiter: Vorname Nachname"},null,null,null,null,"Vorgesetzter:",null,null,null,{"$f":"\" \"&Vorgesetzter","v":" Vorname Nachname"},null,null,null,null,null,null,{"$f":"RIGHT(CELL(\"filename\",A1),LEN(CELL(\"filename\",A1))-SEARCH(\"]\",CELL(\"filename\",A1),1))","v":"April"},null,{"$f":"IF($Q$2=1,$S$2,$S$2+INDIRECT($S$5))","v":0}]
[{"$f":" \" Monat: \"&$Q$3&\" \"&Jahr","v":" Monat: April 2024"},null,null,null,"Dienstplan",null,null,"Normalstunden",null,null,"Übertrag","Anmerkungen ",null,null,null,null,{"$f":"IF(ISNA(VLOOKUP($Q$3,MTab,2,FALSE)),1,VLOOKUP($Q$3,MTab,2,FALSE))","v":4},null,"Übertrags Adresse Blatteingabe"]
[" Datum","Wochentag","Tagesinformation",null,{"$f":"\"Wochen-AZ\"&\" \"&TEXT(WAZ,\"[hh]:mm\")","v":"Wochen-AZ 40:00"},null,null," Stunden 1:1",null,null,{"$f":"IF(ISNA($Q$5),Übertrag,INDIRECT($Q$5))","v":0},null,null,null,null,null,{"$f":"IF(ISNA(VLOOKUP($Q$3,MTab,3,FALSE)),\"Übertrag\",VLOOKUP($Q$3,MTab,3,FALSE))","v":"März!$J$42"},null,{"$f":"IF(ISNA(VLOOKUP($Q$3,MTab,4,FALSE)),$Q$3&\"!$R$2\",VLOOKUP($Q$3,MTab,4,FALSE))","v":"März!$S$3"}]
[null,null," Feiertage\n Wochenende\n Urlaub, ZA, Krank","[U]rlaub\n[Z]A\n[K]rank","Normal-","Soll","MP","Von","Bis","Plus","Saldo",null,null,null,null,null,"Hintergrundberechnungen",null,null,null,null,null,null,"Saldo aktuell",null,null,null,"GAZ-Tabellenabbildung",null,null,null,null,"Eingabebeprüfungen"]
[null,null,null,null,"Arbeitszeit",null,null,null,null,"Minus","akuell",null,null,null,null,null,"Datum","Monat OK","Abwesenh.","Freie Tage","ÜA-Tage","Std.","Soll-Std.",{"$f":"IF(ISNA($Q$5),Übertrag,INDIRECT($Q$5))","v":0},"Std.-Soll = 0","Std.-Soll > 0","Std.-Soll < 0",null,{"$f":"I_GAZNAZVon","v":2},3,{"$f":"I_GAZNAZBis","v":4},null,"Zeiteingabe","UZK-Eing.\nerlaubt","UZK-Eing.\ngültig","Normalst. ein erlaubt","Normalstd.\neingegeben","Normal VON möglich OG","Normal VON möglich UG","Normal BIS möglich OG","Normal BIS möglich UG","Normal VON\n15min","Normal VON richtig","Normal BIS\n15min","Normal BIS richtig","Status Zeilen Eingabe"]
[{"$f":"IF($R8,$Q8,\"\")","v":"2024-04-01"},{"$f":"IF($R8,VLOOKUP(WEEKDAY($Q8,2),WOTA,2,FALSE),\"\")","v":"Mo"},{"$f":"IF($R8,\" \"&IF($S8=\"\",VLOOKUP($Q8,FListe,3,FALSE),$S8),\"\")","v":" Ostermontag"},null,{"$f":"IF(AND($R8,$T8<>\"F\"),IF($AC8=$AE8,\"keine NAZ\",TEXT($AC8,\"hh:mm\")&\"-\"&TEXT($AC8+$F8+$G8,\"hh:mm\")),\"\")","v":""},{"$f":"IF($R8,IF($T8=\"F\",0,VLOOKUP($B8,GAZ,I_GAZNAZMP,FALSE)),\"\")","v":"00:00:00"},{"$f":"IF($R8,$AD8,\"\")","v":"00:00:00"},null,null,{"$f":"IF(AND($R8,$AK8,NOT($Y8)),ROUND(($V8-$F8-$G8)*24,2),IF($D8=\"Z\",$F8*-24,\"\"))","v":""},{"$f":"$X8","v":0},null,null,null,null,null,{"$f":"DATE(Jahr,$Q2,1)","v":"2024-04-01"},{"$f":"$Q$2=MONTH($Q8)","v":true},{"$f":"IF(OR($D8=\"U\",$D8=\"Z\",$D8=\"ZK\",$D8=\"K\"),VLOOKUP($D8,UZK,2,FALSE),\"\")","v":""},{"$f":"IF($R8,VLOOKUP($Q8,FListe,4,FALSE),\"\")","v":"F"},{"$f":"IF($R8,VLOOKUP($Q8,FListe,5,FALSE),\"\")","v":"F"},{"$f":"$I8-$H8","v":0},{"$f":"IF($R8,ROUND($V8-$F8-$AD8,15),\"\")","v":0},{"$f":"IF($J8<>\"\",$X7+$J8,$X7)","v":0},{"$f":"($W8=0)","v":true},{"$f":"($W8>0)","v":false},{"$f":"($W8<0)","v":false},{"$f":"IF($U8=\"F\",\"\",TIME(0,0,0))","v":""},{"$f":"IF($U8=\"F\",\"\",IF(ISNA(VLOOKUP($B8,GAZ,AC$7,FALSE)),0,VLOOKUP($B8,GAZ,AC$7,FALSE)))","v":""},{"$f":"IF(OR($U8=\"F\",$S8<>\"\",ISNA(VLOOKUP($B8,GAZ,AD$7,FALSE))),0,IF(NOT($AK8),VLOOKUP($B8,GAZ,11,FALSE),IF(($I8-$H8)*24>=6,VLOOKUP($B8,GAZ,3,FALSE),0)))","v":"00:00:00"},{"$f":"IF($U8=\"F\",\"\",IF(ISNA(VLOOKUP($B8,GAZ,AE$7,FALSE)),0,VLOOKUP($B8,GAZ,AE$7,FALSE)))","v":""},{"$f":"IF($U8=\"F\",\"\",TIME(23,59,0))","v":""},{"$f":"OR($H8<>\"\",$I8<>\"\")","v":false},{"$f":"AND($T8<>\"F\",NOT($AG8),NOT($AC8=$AE8))","v":false},{"$f":"AND($AH8,OR($D8=\"U\",$D8=\"Z\",$D8=\"K\"))","v":false},{"$f":"AND($U8<>\"F\",$D8<>\"U\",$D8<>\"Z\",$D8<>\"K\",$R8)","v":false},{"$f":"AND($H8<>\"\",$I8<>\"\")","v":false},{"$f":"IF($AJ8,TagUG,\"\")","v":""},{"$f":"IF($AJ8,IF($I8=\"\",IF(AND($L8<>\"\",$L8<$AF8),$L8,IF(AND($M8<>\"\",$M8<$AF8),$M8,TagOG)),$I8),\"\")","v":""},{"$f":"IF($AJ8,IF($H8=\"\",$AB8,$H8),\"\")","v":""},{"$f":"IF($AJ8,IF(AND($L8<>\"\",$L8<$AF8),$L8,IF(AND($M8<>\"\",$M8<$AF8),$M8,TagOG)),\"\")","v":""},{"$f":"MOD($H8*24,0.25)=0","v":true},{"$f":"AND($AJ8,ISNUMBER($H8),$H8>=$AB8,$H8<=$AF8,OR($I8=\"\",$H8<=$I8))","v":false},{"$f":"MOD($I8*24,0.25)=0","v":true},{"$f":"AND($AJ8,ISNUMBER($I8),$I8>=$AB8,$I8<=$AF8,OR($H8=\"\",$I8>=$H8))","v":false},{"$f":"IF(AND(ISBLANK($D8),ISBLANK($H8),ISBLANK($I8)),0,1)","v":0}]
["2024-04-02","Di"," Osterdienstag",null,{"$f":"IF(AND($R9,$T9<>\"F\"),IF($AC9=$AE9,\"keine NAZ\",TEXT($AC9,\"hh:mm\")&\"-\"&TEXT($AC9+$F9+$G9,\"hh:mm\")),\"\")","v":"08:00-16:00"},"08:00:00","00:00:00",null,null,"",0,null,null,null,null,null,{"$f":" Q8+1","v":"2024-04-02"},true,"","A","A",{"$f":"$I9-$H9","v":0},{"$f":"IF($R9,ROUND($V9-$F9-$AD9,15),\"\")","v":-0.33333333333333298},0,false,false,true,"00:00:00","08:00:00","00:00:00","16:00:00","23:59:00",false,true,false,true,false,"00:00:00","23:59:00",{"$f":"IF($AJ9,IF($H9=\"\",TagUG,$H9),\"\")","v":"00:00:00"},"23:59:00",true,false,true,false,0]
["2024-04-03","Mi"," ",null,"08:00-16:00","08:00:00","00:00:00",null,null,"",0,null,null,null,null,null,"2024-04-03",true,"","A","A",0,-0.33333333333333298,0,false,false,true,"00:00:00","08:00:00","00:00:00","16:00:00","23:59:00",false,true,false,true,false,"00:00:00","23:59:00","00:00:00","23:59:00",true,false,true,false,0]
["2024-04-04","Do"," ",null,"08:00-16:00","08:00:00","00:00:00",null,null,"",0,null,null,null,null,null,"2024-04-04",true,"","A","A",0,-0.33333333333333298,0,false,false,true,"00:00:00","08:00:00","00:00:00","16:00:00","23:59:00",false,true,false,true,false,"00:00:00","23:59:00","00:00:00","23:59:00",true,false,true,false,0]
["2024-04-05","Fr"," ",null,"08:00-16:00","08:00:00","00:00:00",null,null,"",0,null,null,null,null,null,"2024-04-05",true,"","A","A",0,-0.33333333333333298,0,false,false,true,"00:00:00","08:00:00","00:00:00","16:00:00","23:59:00",false,true,false,true,false,"00:00:00","23:59:00","00:00:00","23:59:00",true,false,true,false,0]
["2024-04-06","Sa"," Wochenende",null,"","00:00:00","00:00:00",null,null,"",0,null,null,null,null,null,"2024-04-06",true,"","F","A",0,0,0,true,false,false,"00:00:00","00:00:00","00:00:00","00:00:00","23:59:00",false,false,false,true,false,"00:00:00","23:59:00","00:00:00","23:59:00",true,false,true,false,0]
["2024-04-07","So"," Wochenende",null,"","00:00:00","00:00:00",null,null,"",0,null,null,null,null,null,"2024-04-07",true,"","F","F",0,0,0,true,false,false,"","","00:00:00","","",false,false,false,false,false,"","","","",true,false,true,false,0]
["2024-04-08","Mo"," ",null,"08:00-16:00","08:00:00","00:00:00",null,null,"",0,null,null,null,null,null,"2024-04-08",true,"","A","A",0,-0.33333333333333298,0,false,false,true,"00:00:00","08:00:00","00:00:00","16:00:00","23:59:00",false,true,false,true,false,"00:00:00","23:59:00","00:00:00","23:59:00",true,false,true,false,0]
["2024-04-09","Di"," ",null,"08:00-16:00","08:00:00","00:00:00",null,null,"",0,null,null,null,null,null,"2024-04-09",true,"","A","A",0,-0.33333333333333298,0,false,false,true,"00:00:00","08:00:00","00:00:00","16:00:00","23:59:00",false,true,false,true,false,"00:00:00","23:59:00","00:00:00","23:59:00",true,false,true,false,0]
["2024-04-10","Mi"," ",null,"08:00-16:00","08:00:00","00:00:00",null,null,"",0,null,null,null,null,null,"2024-04-10",true,"","A","A",0,-0.33333333333333298,0,false,false,true,"00:00:00","08:00:00","00:00:00","16:00:00","23:59:00",false,true,false,true,false,"00:00:00","23:59:00","00:00:00","23:59:00",true,false,true,false,0]
["2024-04-11","Do"," ",null,"08:00-16:00","08:00:00","00:00:00",null,null,"",0,null,null,null,null,null,"2024-04-11",true,"","A","A",0,-0.33333333333333298,0,false,false,true,"00:00:00","08:00:00","00:00:00","16:00:00","23:59:00",false,true,false,true,false,"00:00:00","23:59:00","00:00:00","23:59:00",true,false,true,false,0]
["2024-04-12","Fr"," ",null,"08:00-16:00","08:00:00","00:00:00",null,null,"",0,null,null,null,null,null,"2024-04-12",true,"","A","A",0,-0.33333333333333298,0,false,false,true,"00:00:00","08:00:00","00:00:00","16:00:00","23:59:00",false,true,false,true,false,"00:00:00","23:59:00","00:00:00","23:59:00",true,false,true,false,0]
["2024-04-13","Sa"," Wochenende",null,"","00:00:00","00:00:00",null,null,"",0,null,null,null,null,null,"2024-04-13",true,"","F","A",0,0,0,true,false,false,"00:00:00","00:00:00","00:00:00","00:00:00","23:59:00",false,false,false,true,false,"00:00:00","23:59:00","00:00:00","23:59:00",true,false,true,false,0]
["2024-04-14","So"," Wochenende",null,"","00:00:00","00:00:00",null,null,"",0,null,null,null,null,null,"2024-04-14",true,"","F","F",0,0,0,true,false,false,"","","00:00:00","","",false,false,false,false,false,"","","","",true,false,true,false,0]
["2024-04-15","Mo"," ",null,"08:00-16:00","08:00:00","00:00:00",null,null,"",0,null,null,null,null,null,"2024-04-15",true,"","A","A",0,-0.33333333333333298,0,false,false,true,"00:00:00","08:00:00","00:00:00","16:00:00","23:59:00",false,true,false,true,false,"00:00:00","23:59:00","00:00:00","23:59:00",true,false,true,false,0]
["2024-04-16","Di"," ",null,"08:00-16:00","08:00:00","00:00:00",null,null,"",0,null,null,null,null,null,"2024-04-16",true,"","A","A",0,-0.33333333333333298,0,false,false,true,"00:00:00","08:00:00","00:00:00","16:00:00","23:59:00",false,true,false,true,false,"00:00:00","23:59:00","00:00:00","23:59:00",true,false,true,false,0]
["2024-04-17","Mi"," ",null,"08:00-16:00","08:00:00","00:00:00",null,null,"",0,null,null,null,null,null,"2024-04-17",true,"","A","A",0,-0.33333333333333298,0,false,false,true,"00:00:00","08:00:00","00:00:00","16:00:00","23:59:00",false,true,false,true,false,"00:00:00","23:59:00","00:00:00","23:59:00",true,false,true,false,0]
["2024-04-18","Do"," ",null,"08:00-16:00","08:00:00","00:00:00",null,null,"",0,null,null,null,null,null,"2024-04-18",true,"","A","A",0,-0.33333333333333298,0,false,false,true,"00:00:00","08:00:00","00:00:00","16:00:00","23:59:00",false,true,false,true,false,"00:00:00","23:59:00","00:00:00","23:59:00",true,false,true,false,0]
["2024-04-19","Fr"," ",null,"08:00-16:00","08:00:00","00:00:00",null,null,"",0,null,null,null,null,null,"2024-04-19",true,"","A","A",0,-0.33333333333333298,0,false,false,true,"00:00:00","08:00:00","00:00:00","16:00:00","23:59:00",false,true,false,true,false,"00:00:00","23:59:00","00:00:00","23:59:00",true,false,true,false,0]
["2024-04-20","Sa"," Wochenende",null,"","00:00:00","00:00:00",null,null,"",0,null,null,null,null,null,"2024-04-20",true,"","F","A",0,0,0,true,false,false,"00:00:00","00:00:00","00:00:00","00:00:00","23:59:00",false,false,false,true,false,"00:00:00","23:59:00","00:00:00","23:59:00",true,false,true,false,0]
["2024-04-21","So"," Wochenende",null,"","00:00:00","00:00:00",null,null,"",0,null,null,null,null,null,"2024-04-21",true,"","F","F",0,0,0,true,false,false,"","","00:00:00","","",false,false,false,false,false,"","","","",true,false,true,false,0]
["2024-04-22","Mo"," ",null,"08:00-16:00","08:00:00","00:00:00",null,null,"",0,null,null,null,null,null,"2024-04-22",true,"","A","A",0,-0.33333333333333298,0,false,false,true,"00:00:00","08:00:00","00:00:00","16:00:00","23:59:00",false,true,false,true,false,"00:00:00","23:59:00","00:00:00","23:59:00",true,false,true,false,0]
["2024-04-23","Di"," ",null,"08:00-16:00","08:00:00","00:00:00",null,null,"",0,null,null,null,null,null,"2024-04-23",true,"","A","A",0,-0.33333333333333298,0,false,false,true,"00:00:00","08:00:00","00:00:00","16:00:00","23:59:00",false,true,false,true,false,"00:00:00","23:59:00","00:00:00","23:59:00",true,false,true,false,0]
["2024-04-24","Mi"," ",null,"08:00-16:00","08:00:00","00:00:00",null,null,"",0,null,null,null,null,null,"2024-04-24",true,"","A","A",0,-0.33333333333333298,0,false,false,true,"00:00:00","08:00:00","00:00:00","16:00:00","23:59:00",false,true,false,true,false,"00:00:00","23:59:00","00:00:00","23:59:00",true,false,true,false,0]
["2024-04-25","Do"," ",null,"08:00-16:00","08:00:00","00:00:00",null,null,"",0,null,null,null,null,null,"2024-04-25",true,"","A","A",0,-0.33333333333333298,0,false,false,true,"00:00:00","08:00:00","00:00:00","16:00:00","23:59:00",false,true,false,true,false,"00:00:00","23:59:00","00:00:00","23:59:00",true,false,true,false,0]
["2024-04-26","Fr"," ",null,"08:00-16:00","08:00:00","00:00:00",null,null,"",0,null,null,null,null,null,"2024-04-26",true,"","A","A",0,-0.33333333333333298,0,false,false,true,"00:00:00","08:00:00","00:00:00","16:00:00","23:59:00",false,true,false,true,false,"00:00:00","23:59:00","00:00:00","23:59:00",true,false,true,false,0]
["2024-04-27","Sa"," Wochenende",null,"","00:00:00","00:00:00",null,null,"",0,null,null,null,null,null,"2024-04-27",true,"","F","A",0,0,0,true,false,false,"00:00:00","00:00:00","00:00:00","00:00:00","23:59:00",false,false,false,true,false,"00:00:00","23:59:00","00:00:00","23:59:00",true,false,true,false,0]
["2024-04-28","So"," Wochenende",null,"","00:00:00","00:00:00",null,null,"",0,null,null,null,null,null,"2024-04-28",true,"","F","F",0,0,0,true,false,false,"","","00:00:00","","",false,false,false,false,false,"","","","",true,false,true,false,0]
["2024-04-29","Mo"," ",null,"08:00-16:00","08:00:00","00:00:00",null,null,"",0,null,null,null,null,null,"2024-04-29",true,"","A","A",0,-0.33333333333333298,0,false,false,true,"00:00:00","08:00:00","00:00:00","16:00:00","23:59:00",false,true,false,true,false,"00:00:00","23:59:00","00:00:00","23:59:00",true,false,true,false,0]
["2024-04-30","Di"," ",null,"08:00-16:00","08:00:00","00:00:00",null,null,"",0,null,null,null,null,null,"2024-04-30",true,"","A","A",0,-0.33333333333333298,0,false,false,true,"00:00:00","08:00:00","00:00:00","16:00:00","23:59:00",false,true,false,true,false,"00:00:00","23:59:00","00:00:00","23:59:00",true,false,true,false,0]
["","","",null,"","","",null,null,"",0,null,null,null,null,null,"2024-05-01",false,"","","",0,"",0,false,true,false,"00:00:00","00:00:00","00:00:00","00:00:00","23:59:00",false,false,false,false,false,"","","","",true,false,true,false,0]
["Arbeitstage",{"$f":"COUNTIF(T$8:T$38,\"A\")","v":21},null,null,{"$f":"\"Monat Std.-Saldo (~15min) > \"","v":"Monat Std.-Saldo (~15min) > "},null,null,null,null,{"$f":"ROUND(SUM(J8:J38)*4,0)/4","v":0}]
["ZA-Tage",{"$f":"COUNTIF(D$8:D$38,\"Z\")","v":0},null,null," Vormonat Std.Saldo > ",null,null,null,null,{"$f":"$K5","v":0},null,null,null,null,null,null,"Gültigkeit ausbezahlt"]
["Urlaubstage",{"$f":"COUNTIF(D$8:D$38,\"U\")","v":0},null,null," Gesamt Std. Saldo > ",null,null,null,null,{"$f":"$J39+$J40","v":0},null,null,null,null,null,null,{"$f":"AND($K$41>=0,$K$41<=$J$41,MOD($K$41,0.25)=0)","v":true}]
["Krank",{"$f":"COUNTIF(D$8:D$38,\"K\")","v":0},null,null," Übertrag Std. Saldo > ",null,null,null,null,{"$f":"$J41","v":0},{"$f":"\" < Dieser Stunden-Saldo wird in das nächste \"&IF($Q$3=\"Dezember\",\"Jahr\",\"Monat\")&\" übertragen\"","v":" < Dieser Stunden-Saldo wird in das nächste Monat übertragen"}]
[null,null,null,"Z"]
[]
[{"$f":"\"Unterschrift von \"&Vorgesetzter","v":"Unterschrift von Vorname Nachname"},null,null,null,null,null,null,null,null,null,null,null,{"$f":"\"Unterschrift von \"&Name","v":"Unterschrift von Vorname Nachname"}]

{"sheet":"Mai","index":5,"n_rows":45,"n_cols":46,"rows_kept":45,"cut":false,"hidden":true,"merged":[[42,4,42,8],[43,4,43,8],[44,0,44,3],[44,12,44,15],[36,11,36,15],[37,11,37,15],[38,2,41,3],[38,4,38,8],[38,10,40,15],[39,4,39,8],[40,4,40,8],[41,4,41,8],[41,10,41,15],[30,11,30,15],[31,11,31,15],[32,11,32,15],[33,11,33,15],[34,11,34,15],[35,11,35,15],[24,11,24,15],[25,11,25,15],[26,11,26,15],[27,11,27,15],[28,11,28,15],[29,11,29,15],[18,11,18,15],[19,11,19,15],[20,11,20,15],[21,11,21,15],[22,11,22,15],[23,11,23,15],[12,11,12,15],[13,11,13,15],[14,11,14,15],[15,11,15,15],[16,11,16,15],[17,11,17,15],[5,27,5,31],[7,11,7,15],[8,11,8,15],[9,11,9,15],[10,11,10,15],[11,11,11,15],[4,4,4,6],[4,7,4,9],[5,2,6,2],[5,3,6,3],[5,5,6,5],[5,6,6,6],[5,7,6,7],[5,8,6,8],[0,15,1,15],[1,5,1,8],[2,5,2,8],[3,0,3,3],[3,4,3,6],[3,7,3,9],[3,11,6,15],[4,0,6,0],[4,1,6,1],[4,2,4,3]]}
[{"$f":"Konfig!$A$1","v":" BOKU-Zeiterfassung für Wissenschaftliches Personal"},null,null,null,null,null,null,null,null,null,null,null,null,null,null,null,"Monat","Stunden-Saldo Grenzen","Status Blatteingabe"]
[{"$f":"\" Org.-Einh. : \"&OrgEinheit","v":" Org.-Einh. : Hxxxxx"},null,null,null,null,"Zeitmodell:",null,null,null,{"$f":"\" \"&Zeitmodell","v":" Vollzeit"},null,null,null,null,null,null,{"$f":"IF(ISNA($Q$4),1,$Q$4)","v":5},0,{"$f":"SUM($AT8:$AT38)","v":0}]
[{"$f":" \" Mitarbeiter: \"&Name","v":" Mitarbeiter: Vorname Nachname"},null,null,null,null,"Vorgesetzter:",null,null,null,{"$f":"\" \"&Vorgesetzter","v":" Vorname Nachname"},null,null,null,null,null,null,{"$f":"RIGHT(CELL(\"filename\",A1),LEN(CELL(\"filename\",A1))-SEARCH(\"]\",CELL(\"filename\",A1),1))","v":"Mai"},null,{"$f":"IF($Q$2=1,$S$2,$S$2+INDIRECT($S$5))","v":0}]
[{"$f":" \" Monat: \"&$Q$3&\" \"&Jahr","v":" Monat: Mai 2024"},null,null,null,"Dienstplan",null,null,"Normalstunden",null,null,"Übertrag","Anmerkungen ",null,null,null,null,{"$f":"IF(ISNA(VLOOKUP($Q$3,MTab,2,FALSE)),1,VLOOKUP($Q$3,MTab,2,FALSE))","v":5},null,"Übertrags Adresse Blatteingabe"]
[" Datum","Wochentag","Tagesinformation",null,{"$f":"\"Wochen-AZ\"&\" \"&TEXT(WAZ,\"[hh]:mm\")","v":"Wochen-AZ 40:00"},null,null," Stunden 1:1",null,null,{"$f":"IF(ISNA($Q$5),Übertrag,INDIRECT($Q$5))","v":0},null,null,null,null,null,{"$f":"IF(ISNA(VLOOKUP($Q$3,MTab,3,FALSE)),\"Übertrag\",VLOOKUP($Q$3,MTab,3,FALSE))","v":"April!$J$42"},null,{"$f":"IF(ISNA(VLOOKUP($Q$3,MTab,4,FALSE)),$Q$3&\"!$R$2\",VLOOKUP($Q$3,MTab,4,FALSE))","v":"April!$S$3"}]
[null,null," Feiertage\n Wochenende\n Urlaub, ZA, Krank","[U]rlaub\n[Z]A\n[K]rank","Normal-","Soll","MP","Von","Bis","Plus","Saldo",null,null,null,null,null,"Hintergrundberechnungen",null,null,null,null,null,null,"Saldo aktuell",null,null,null,"GAZ-Tabellenabbildung",null,null,null,null,"Eingabebeprüfungen"]
[null,null,null,null,"Arbeitszeit",null,null,null,null,"Minus","akuell",null,null,null,null,null,"Datum","Monat OK","Abwesenh.","Freie Tage","ÜA-Tage","Std.","Soll-Std.",{"$f":"IF(ISNA($Q$5),Übertrag,INDIRECT($Q$5))","v":0},"Std.-Soll = 0","Std.-Soll > 0","Std.-Soll < 0",null,{"$f":"I_GAZNAZVon","v":2},3,{"$f":"I_GAZNAZBis","v":4},null,"Zeiteingabe","UZK-Eing.\nerlaubt","UZK-Eing.\ngültig","Normalst. ein erlaubt","Normalstd.\neingegeben","Normal VON möglich OG","Normal VON möglich UG","Normal BIS möglich OG","Normal BIS möglich UG","Normal VON\n15min","Normal VON richtig","Normal BIS\n15min","Normal BIS richtig","Status Zeilen Eingabe"]
[{"$f":"IF($R8,$Q8,\"\")","v":"2024-05-01"},{"$f":"IF($R8,VLOOKUP(WEEKDAY($Q8,2),WOTA,2,FALSE),\"\")","v":"Mi"},{"$f":"IF($R8,\" \"&IF($S8=\"\",VLOOKUP($Q8,FListe,3,FALSE),$S8),\"\")","v":" Staatsfeiertag"},null,{"$f":"IF(AND($R8,$T8<>\"F\"),IF($AC8=$AE8,\"keine NAZ\",TEXT($AC8,\"hh:mm\")&\"-\"&TEXT($AC8+$F8+$G8,\"hh:mm\")),\"\")","v":""},{"$f":"IF($R8,IF($T8=\"F\",0,VLOOKUP($B8,GAZ,I_GAZNAZMP,FALSE)),\"\")","v":"00:00:00"},{"$f":"IF($R8,$AD8,\"\")","v":"00:00:00"},null,null,{"$f":"IF(AND($R8,$AK8,NOT($Y8)),ROUND(($V8-$F8-$G8)*24,2),IF($D8=\"Z\",$F8*-24,\"\"))","v":""},{"$f":"$X8","v":0},null,null,null,null,null,{"$f":"DATE(Jahr,$Q2,1)","v":"2024-05-01"},{"$f":"$Q$2=MONTH($Q8)","v":true},{"$f":"IF(OR($D8=\"U\",$D8=\"Z\",$D8=\"ZK\",$D8=\"K\"),VLOOKUP($D8,UZK,2,FALSE),\"\")","v":""},{"$f":"IF($R8,VLOOKUP($Q8,FListe,4,FALSE),\"\")","v":"F"},{"$f":"IF($R8,VLOOKUP($Q8,FListe,5,FALSE),\"\")","v":"F"},{"$f":"$I8-$H8","v":0},{"$f":"IF($R8,ROUND($V8-$F8-$AD8,15),\"\")","v":0},{"$f":"IF($J8<>\"\",$X7+$J8,$X7)","v":0},{"$f":"($W8=0)","v":true},{"$f":"($W8>0)","v":false},{"$f":"($W8<0)","v":false},{"$f":"IF($U8=\"F\",\"\",TIME(0,0,0))","v":""},{"$f":"IF($U8=\"F\",\"\",IF(ISNA(VLOOKUP($B8,GAZ,AC$7,FALSE)),0,VLOOKUP($B8,GAZ,AC$7,FALSE)))","v":""},{"$f":"IF(OR($U8=\"F\",$S8<>\"\",ISNA(VLOOKUP($B8,GAZ,AD$7,FALSE))),0,IF(NOT($AK8),VLOOKUP($B8,GAZ,11,FALSE),IF(($I8-$H8)*24>=6,VLOOKUP($B8,GAZ,3,FALSE),0)))","v":"00:00:00"},{"$f":"IF($U8=\"F\",\"\",IF(ISNA(VLOOKUP($B8,GAZ,AE$7,FALSE)),0,VLOOKUP($B8,GAZ,AE$7,FALSE)))","v":""},{"$f":"IF($U8=\"F\",\"\",TIME(23,59,0))","v":""},{"$f":"OR($H8<>\"\",$I8<>\"\")","v":false},{"$f":"AND($T8<>\"F\",NOT($AG8),NOT($AC8=$AE8))","v":false},{"$f":"AND($AH8,OR($D8=\"U\",$D8=\"Z\",$D8=\"K\"))","v":false},{"$f":"AND($U8<>\"F\",$D8<>\"U\",$D8<>\"Z\",$D8<>\"K\",$R8)","v":false},{"$f":"AND($H8<>\"\",$I8<>\"\")","v":false},{"$f":"IF($AJ8,TagUG,\"\")","v":""},{"$f":"IF($AJ8,IF($I8=\"\",IF(AND($L8<>\"\",$L8<$AF8),$L8,IF(AND($M8<>\"\",$M8<$AF8),$M8,TagOG)),$I8),\"\")","v":""},{"$f":"IF($AJ8,IF($H8=\"\",$AB8,$H8),\"\")","v":""},{"$f":"IF($AJ8,IF(AND($L8<>\"\",$L8<$AF8),$L8,IF(AND($M8<>\"\",$M8<$AF8),$M8,TagOG)),\"\")","v":""},{"$f":"MOD($H8*24,0.25)=0","v":true},{"$f":"AND($AJ8,ISNUMBER($H8),$H8>=$AB8,$H8<=$AF8,OR($I8=\"\",$H8<=$I8))","v":false},{"$f":"MOD($I8*24,0.25)=0","v":true},{"$f":"AND($AJ8,ISNUMBER($I8),$I8>=$AB8,$I8<=$AF8,OR($H8=\"\",$I8>=$H8))","v":false},{"$f":"IF(AND(ISBLANK($D8),ISBLANK($H8),ISBLANK($I8)),0,1)","v":0}]
["2024-05-02","Do"," ",null,{"$f":"IF(AND($R9,$T9<>\"F\"),IF($AC9=$AE9,\"keine NAZ\",TEXT($AC9,\"hh:mm\")&\"-\"&TEXT($AC9+$F9+$G9,\"hh:mm\")),\"\")","v":"08:00-16:00"},"08:00:00","00:00:00",null,null,"",0,null,null,null,null,null,{"$f":" Q8+1","v":"2024-05-02"},true,"","A","A",{"$f":"$I9-$H9","v":0},{"$f":"IF($R9,ROUND($V9-$F9-$AD9,15),\"\")","v":-0.33333333333333298},0,false,false,true,"00:00:00","08:00:00","00:00:00","16:00:00","23:59:00",false,true,false,true,false,"00:00:00","23:59:00",{"$f":"IF($AJ9,IF($H9=\"\",TagUG,$H9),\"\")","v":"00:00:00"},"23:59:00",true,false,true,false,0]
["2024-05-03","Fr"," ",null,"08:00-16:00","08:00:00","00:00:00",null,null,"",0,null,null,null,null,null,"2024-05-03",true,"","A","A",0,-0.33333333333333298,0,false,false,true,"00:00:00","08:00:00","00:00:00","16:00:00","23:59:00",false,true,false,true,false,"00:00:00","23:59:00","00:00:00","23:59:00",true,false,true,false,0]
["2024-05-04","Sa"," Wochenende",null,"","00:00:00","00:00:00",null,null,"",0,null,null,null,null,null,"2024-05-04",true,"","F","A",0,0,0,true,false,false,"00:00:00","00:00:00","00:00:00","00:00:00","23:59:00",false,false,false,true,false,"00:00:00","23:59:00","00:00:00","23:59:00",true,false,true,false,0]
["2024-05-05","So"," Wochenende",null,"","00:00:00","00:00:00",null,null,"",0,null,null,null,null,null,"2024-05-05",true,"","F","F",0,0,0,true,false,false,"","","00:00:00","","",false,false,false,false,false,"","","","",true,false,true,false,0]
["2024-05-06","Mo"," ",null,"08:00-16:00","08:00:00","00:00:00",null,null,"",0,null,null,null,null,null,"2024-05-06",true,"","A","A",0,-0.33333333333333298,0,false,false,true,"00:00:00","08:00:00","00:00:00","16:00:00","23:59:00",false,true,false,true,false,"00:00:00","23:59:00","00:00:00","23:59:00",true,false,true,false,0]
["2024-05-07","Di"," ",null,"08:00-16:00","08:00:00","00:00:00",null,null,"",0,null,null,null,null,null,"2024-05-07",true,"","A","A",0,-0.33333333333333298,0,false,false,true,"00:00:00","08:00:00","00:00:00","16:00:00","23:59:00",false,true,false,true,false,"00:00:00","23:59:00","00:00:00","23:59:00",true,false,true,false,0]
["2024-05-08","Mi"," ",null,"08:00-16:00","08:00:00","00:00:00",null,null,"",0,null,null,null,null,null,"2024-05-08",true,"","A","A",0,-0.33333333333333298,0,false,false,true,"00:00:00","08:00:00","00:00:00","16:00:00","23:59:00",false,true,false,true,false,"00:00:00","23:59:00","00:00:00","23:59:00",true,false,true,false,0]
["2024-05-09","Do"," Christi Himmelfahrt",null,"","00:00:00","00:00:00",null,null,"",0,null,null,null,null,null,"2024-05-09",true,"","F","F",0,0,0,true,false,false,"","","00:00:00","","",false,false,false,false,false,"","","","",true,false,true,false,0]
["2024-05-10","Fr"," ",null,"08:00-16:00","08:00:00","00:00:00",null,null,"",0,null,null,null,null,null,"2024-05-10",true,"","A","A",0,-0.33333333333333298,0,false,false,true,"00:00:00","08:00:00","00:00:00","16:00:00","23:59:00",false,true,false,true,false,"00:00:00","23:59:00","00:00:00","23:59:00",true,false,true,false,0]
["2024-05-11","Sa"," Wochenende",null,"","00:00:00","00:00:00",null,null,"",0,null,null,null,null,null,"2024-05-11",true,"","F","A",0,0,0,true,false,false,"00:00:00","00:00:00","00:00:00","00:00:00","23:59:00",false,false,false,true,false,"00:00:00","23:59:00","00:00:00","23:59:00",true,false,true,false,0]
["2024-05-12","So"," Muttertag",null,"","00:00:00","00:00:00",null,null,"",0,null,null,null,null,null,"2024-05-12",true,"","F","F",0,0,0,true,false,false,"","","00:00:00","","",false,false,false,false,false,"","","","",true,false,true,false,0]
["2024-05-13","Mo"," ",null,"08:00-16:00","08:00:00","00:00:00",null,null,"",0,null,null,null,null,null,"2024-05-13",true,"","A","A",0,-0.33333333333333298,0,false,false,true,"00:00:00","08:00:00","00:00:00","16:00:00","23:59:00",false,true,false,true,false,"00:00:00","23:59:00","00:00:00","23:59:00",true,false,true,false,0]
["2024-05-14","Di"," ",null,"08:00-16:00","08:00:00","00:00:00",null,null,"",0,null,null,null,null,null,"2024-05-14",true,"","A","A",0,-0.33333333333333298,0,false,false,true,"00:00:00","08:00:00","00:00:00","16:00:00","23:59:00",false,true,false,true,false,"00:00:00","23:59:00","00:00:00","23:59:00",true,false,true,false,0]
["2024-05-15","Mi"," ",null,"08:00-16:00","08:00:00","00:00:00",null,null,"",0,null,null,null,null,null,"2024-05-15",true,"","A","A",0,-0.33333333333333298,0,false,false,true,"00:00:00","08:00:00","00:00:00","16:00:00","23:59:00",false,true,false,true,false,"00:00:00","23:59:00","00:00:00","23:59:00",true,false,true,false,0]
["2024-05-16","Do"," ",null,"08:00-16:00","08:00:00","00:00:00",null,null,"",0,null,null,null,null,null,"2024-05-16",true,"","A","A",0,-0.33333333333333298,0,false,false,true,"00:00:00","08:00:00","00:00:00","16:00:00","23:59:00",false,true,false,true,false,"00:00:00","23:59:00","00:00:00","23:59:00",true,false,true,false,0]
["2024-05-17","Fr"," ",null,"08:00-16:00","08:00:00","00:00:00",null,null,"",0,null,null,null,null,null,"2024-05-17",true,"","A","A",0,-0.33333333333333298,0,false,false,true,"00:00:00","08:00:00","00:00:00","16:00:00","23:59:00",false,true,false,true,false,"00:00:00","23:59:00","00:00:00","23:59:00",true,false,true,false,0]
["2024-05-18","Sa"," Wochenende",null,"","00:00:00","00:00:00",null,null,"",0,null,null,null,null,null,"2024-05-18",true,"","F","A",0,0,0,true,false,false,"00:00:00","00:00:00","00:00:00","00:00:00","23:59:00",false,false,false,true,false,"00:00:00","23:59:00","00:00:00","23:59:00",true,false,true,false,0]
["2024-05-19","So"," Pfingsten",null,"","00:00:00","00:00:00",null,null,"",0,null,null,null,null,null,"2024-05-19",true,"","F","F",0,0,0,true,false,false,"","","00:00:00","","",false,false,false,false,false,"","","","",true,false,true,false,0]
["2024-05-20","Mo"," Pfingstmontag",null,"","00:00:00","00:00:00",null,null,"",0,null,null,null,null,null,"2024-05-20",true,"","F","F",0,0,0,true,false,false,"","","00:00:00","","",false,false,false,false,false,"","","","",true,false,true,false,0]
["2024-05-21","Di"," ",null,"08:00-16:00","08:00:00","00:00:00",null,null,"",0,null,null,null,null,null,"2024-05-21",true,"","A","A",0,-0.33333333333333298,0,false,false,true,"00:00:00","08:00:00","00:00:00","16:00:00","23:59:00",false,true,false,true,false,"00:00:00","23:59:00","00:00:00","23:59:00",true,false,true,false,0]
["2024-05-22","Mi"," ",null,"08:00-16:00","08:00:00","00:00:00",null,null,"",0,null,null,null,null,null,"2024-05-22",true,"","A","A",0,-0.33333333333333298,0,false,false,true,"00:00:00","08:00:00","00:00:00","16:00:00","23:59:00",false,true,false,true,false,"00:00:00","23:59:00","00:00:00","23:59:00",true,false,true,false,0]
["2024-05-23","Do"," ",null,"08:00-16:00","08:00:00","00:00:00",null,null,"",0,null,null,null,null,null,"2024-05-23",true,"","A","A",0,-0.33333333333333298,0,false,false,true,"00:00:00","08:00:00","00:00:00","16:00:00","23:59:00",false,true,false,true,false,"00:00:00","23:59:00","00:00:00","23:59:00",true,false,true,false,0]
["2024-05-24","Fr"," ",null,"08:00-16:00","08:00:00","00:00:00",null,null,"",0,null,null,null,null,null,"2024-05-24",true,"","A","A",0,-0.33333333333333298,0,false,false,true,"00:00:00","08:00:00","00:00:00","16:00:00","23:59:00",false,true,false,true,false,"00:00:00","23:59:00","00:00:00","23:59:00",true,false,true,false,0]
["2024-05-25","Sa"," Wochenende",null,"","00:00:00","00:00:00",null,null,"",0,null,null,null,null,null,"2024-05-25",true,"","F","A",0,0,0,true,false,false,"00:00:00","00:00:00","00:00:00","00:00:00","23:59:00",false,false,false,true,false,"00:00:00","23:59:00","00:00:00","23:59:00",true,false,true,false,0]
["2024-05-26","So"," Wochenende",null,"","00:00:00","00:00:00",null,null,"",0,null,null,null,null,null,"2024-05-26",true,"","F","F",0,0,0,true,false,false,"","","00:00:00","","",false,false,false,false,false,"","","","",true,false,true,false,0]
["2024-05-27","Mo"," ",null,"08:00-16:00","08:00:00","00:00:00",null,null,"",0,null,null,null,null,null,"2024-05-27",true,"","A","A",0,-0.33333333333333298,0,false,false,true,"00:00:00","08:00:00","00:00:00","16:00:00","23:59:00",false,true,false,true,false,"00:00:00","23:59:00","00:00:00","23:59:00",true,false,true,false,0]
["2024-05-28","Di"," ",null,"08:00-16:00","08:00:00","00:00:00",null,null,"",0,null,null,null,null,null,"2024-05-28",true,"","A","A",0,-0.33333333333333298,0,false,false,true,"00:00:00","08:00:00","00:00:00","16:00:00","23:59:00",false,true,false,true,false,"00:00:00","23:59:00","00:00:00","23:59:00",true,false,true,false,0]
["2024-05-29","Mi"," ",null,"08:00-16:00","08:00:00","00:00:00",null,null,"",0,null,null,null,null,null,"2024-05-29",true,"","A","A",0,-0.33333333333333298,0,false,false,true,"00:00:00","08:00:00","00:00:00","16:00:00","23:59:00",false,true,false,true,false,"00:00:00","23:59:00","00:00:00","23:59:00",true,false,true,false,0]
["2024-05-30","Do"," Fronleichnam",null,"","00:00:00","00:00:00",null,null,"",0,null,null,null,null,null,"2024-05-30",true,"","F","F",0,0,0,true,false,false,"","","00:00:00","","",false,false,false,false,false,"","","","",true,false,true,false,0]
["2024-05-31","Fr"," ",null,"08:00-16:00","08:00:00","00:00:00",null,null,"",0,null,null,null,null,null,"2024-05-31",true,"","A","A",0,-0.33333333333333298,0,false,false,true,"00:00:00","08:00:00","00:00:00","16:00:00","23:59:00",false,true,false,true,false,"00:00:00","23:59:00","00:00:00","23:59:00",true,false,true,false,0]
["Arbeitstage",{"$f":"COUNTIF(T$8:T$38,\"A\")","v":19},null,null,{"$f":"\"Monat Std.-Saldo (~15min) > \"","v":"Monat Std.-Saldo (~15min) > "},null,null,null,null,{"$f":"ROUND(SUM(J8:J38)*4,0)/4","v":0}]
["ZA-Tage",{"$f":"COUNTIF(D$8:D$38,\"Z\")","v":0},null,null," Vormonat Std.Saldo > ",null,null,null,null,{"$f":"$K5","v":0},null,null,null,null,null,null,"Gültigkeit ausbezahlt"]
["Urlaubstage",{"$f":"COUNTIF(D$8:D$38,\"U\")","v":0},null,null," Gesamt Std. Saldo > ",null,null,null,null,{"$f":"$J39+$J40","v":0},null,null,null,null,null,null,{"$f":"AND($K$41>=0,$K$41<=$J$41,MOD($K$41,0.25)=0)","v":true}]
["Krank",{"$f":"COUNTIF(D$8:D$38,\"K\")","v":0},null,null," Übertrag Std. Saldo > ",null,null,null,null,{"$f":"$J41","v":0},{"$f":"\" < Dieser Stunden-Saldo wird in das nächste \"&IF($Q$3=\"Dezember\",\"Jahr\",\"Monat\")&\" übertragen\"","v":" < Dieser Stunden-Saldo wird in das nächste Monat übertragen"}]
[null,null,null,"Z"]
[]
[{"$f":"\"Unterschrift von \"&Vorgesetzter","v":"Unterschrift von Vorname Nachname"},null,null,null,null,null,null,null,null,null,null,null,{"$f":"\"Unterschrift von \"&Name","v":"Unterschrift von Vorname Nachname"}]

{"sheet":"Juni","index":6,"n_rows":45,"n_cols":46,"rows_kept":45,"cut":false,"hidden":true,"merged":[[42,4,42,8],[43,4,43,8],[44,0,44,3],[44,12,44,15],[36,11,36,15],[37,11,37,15],[38,2,41,3],[38,4,38,8],[38,10,40,15],[39,4,39,8],[40,4,40,8],[41,4,41,8],[41,10,41,15],[30,11,30,15],[31,11,31,15],[32,11,32,15],[33,11,33,15],[34,11,34,15],[35,11,35,15],[24,11,24,15],[25,11,25,15],[26,11,26,15],[27,11,27,15],[28,11,28,15],[29,11,29,15],[18,11,18,15],[19,11,19,15],[20,11,20,15],[21,11,21,15],[22,11,22,15],[23,11,23,15],[12,11,12,15],[13,11,13,15],[14,11,14,15],[15,11,15,15],[16,11,16,15],[17,11,17,15],[5,27,5,31],[7,11,7,15],[8,11,8,15],[9,11,9,15],[10,11,10,15],[11,11,11,15],[4,4,4,6],[4,7,4,9],[5,2,6,2],[5,3,6,3],[5,5,6,5],[5,6,6,6],[5,7,6,7],[5,8,6,8],[0,15,1,15],[1,5,1,8],[2,5,2,8],[3,0,3,3],[3,4,3,6],[3,7,3,9],[3,11,6,15],[4,0,6,0],[4,1,6,1],[4,2,4,3]]}
[{"$f":"Konfig!$A$1","v":" BOKU-Zeiterfassung für Wissenschaftliches Personal"},null,null,null,null,null,null,null,null,null,null,null,null,null,null,null,"Monat","Stunden-Saldo Grenzen","Status Blatteingabe"]
[{"$f":"\" Org.-Einh. : \"&OrgEinheit","v":" Org.-Einh. : Hxxxxx"},null,null,null,null,"Zeitmodell:",null,null,null,{"$f":"\" \"&Zeitmodell","v":" Vollzeit"},null,null,null,null,null,null,{"$f":"IF(ISNA($Q$4),1,$Q$4)","v":6},0,{"$f":"SUM($AT8:$AT38)","v":0}]
[{"$f":" \" Mitarbeiter: \"&Name","v":" Mitarbeiter: Vorname Nachname"},null,null,null,null,"Vorgesetzter:",null,null,null,{"$f":"\" \"&Vorgesetzter","v":" Vorname Nachname"},null,null,null,null,null,null,{"$f":"RIGHT(CELL(\"filename\",A1),LEN(CELL(\"filename\",A1))-SEARCH(\"]\",CELL(\"filename\",A1),1))","v":"Juni"},null,{"$f":"IF($Q$2=1,$S$2,$S$2+INDIRECT($S$5))","v":0}]
[{"$f":" \" Monat: \"&$Q$3&\" \"&Jahr","v":" Monat: Juni 2024"},null,null,null,"Dienstplan",null,null,"Normalstunden",null,null,"Übertrag","Anmerkungen ",null,null,null,null,{"$f":"IF(ISNA(VLOOKUP($Q$3,MTab,2,FALSE)),1,VLOOKUP($Q$3,MTab,2,FALSE))","v":6},null,"Übertrags Adresse Blatteingabe"]
[" Datum","Wochentag","Tagesinformation",null,{"$f":"\"Wochen-AZ\"&\" \"&TEXT(WAZ,\"[hh]:mm\")","v":"Wochen-AZ 40:00"},null,null," Stunden 1:1",null,null,{"$f":"IF(ISNA($Q$5),Übertrag,INDIRECT($Q$5))","v":0},null,null,null,null,null,{"$f":"IF(ISNA(VLOOKUP($Q$3,MTab,3,FALSE)),\"Übertrag\",VLOOKUP($Q$3,MTab,3,FALSE))","v":"Mai!$J$42"},null,{"$f":"IF(ISNA(VLOOKUP($Q$3,MTab,4,FALSE)),$Q$3&\"!$R$2\",VLOOKUP($Q$3,MTab,4,FALSE))","v":"Mai!$S$3"}]
[null,null," Feiertage\n Wochenende\n Urlaub, ZA, Krank","[U]rlaub\n[Z]A\n[K]rank","Normal-","Soll","MP","Von","Bis","Plus","Saldo",null,null,null,null,null,"Hintergrundberechnungen",null,null,null,null,null,null,"Saldo aktuell",null,null,null,"GAZ-Tabellenabbildung",null,null,null,null,"Eingabebeprüfungen"]
[null,null,null,null,"Arbeitszeit",null,null,null,null,"Minus","akuell",null,null,null,null,null,"Datum","Monat OK","Abwesenh.","Freie Tage","ÜA-Tage","Std.","Soll-Std.",{"$f":"IF(ISNA($Q$5),Übertrag,INDIRECT($Q$5))","v":0},"Std.-Soll = 0","Std.-Soll > 0","Std.-Soll < 0",null,{"$f":"I_GAZNAZVon","v":2},3,{"$f":"I_GAZNAZBis","v":4},null,"Zeiteingabe","UZK-Eing.\nerlaubt","UZK-Eing.\ngültig","Normalst. ein erlaubt","Normalstd.\neingegeben","Normal VON möglich OG","Normal VON möglich UG","Normal BIS möglich OG","Normal BIS möglich UG","Normal VON\n15min","Normal VON richtig","Normal BIS\n15min","Normal BIS richtig","Status Zeilen Eingabe"]
[{"$f":"IF($R8,$Q8,\"\")","v":"2024-06-01"},{"$f":"IF($R8,VLOOKUP(WEEKDAY($Q8,2),WOTA,2,FALSE),\"\")","v":"Sa"},{"$f":"IF($R8,\" \"&IF($S8=\"\",VLOOKUP($Q8,FListe,3,FALSE),$S8),\"\")","v":" Wochenende"},null,{"$f":"IF(AND($R8,$T8<>\"F\"),IF($AC8=$AE8,\"keine NAZ\",TEXT($AC8,\"hh:mm\")&\"-\"&TEXT($AC8+$F8+$G8,\"hh:mm\")),\"\")","v":""},{"$f":"IF($R8,IF($T8=\"F\",0,VLOOKUP($B8,GAZ,I_GAZNAZMP,FALSE)),\"\")","v":"00:00:00"},{"$f":"IF($R8,$AD8,\"\")","v":"00:00:00"},null,null,{"$f":"IF(AND($R8,$AK8,NOT($Y8)),ROUND(($V8-$F8-$G8)*24,2),IF($D8=\"Z\",$F8*-24,\"\"))","v":""},{"$f":"$X8","v":0},null,null,null,null,null,{"$f":"DATE(Jahr,$Q2,1)","v":"2024-06-01"},{"$f":"$Q$2=MONTH($Q8)","v":true},{"$f":"IF(OR($D8=\"U\",$D8=\"Z\",$D8=\"ZK\",$D8=\"K\"),VLOOKUP($D8,UZK,2,FALSE),\"\")","v":""},{"$f":"IF($R8,VLOOKUP($Q8,FListe,4,FALSE),\"\")","v":"F"},{"$f":"IF($R8,VLOOKUP($Q8,FListe,5,FALSE),\"\")","v":"A"},{"$f":"$I8-$H8","v":0},{"$f":"IF($R8,ROUND($V8-$F8-$AD8,15),\"\")","v":0},{"$f":"IF($J8<>\"\",$X7+$J8,$X7)","v":0},{"$f":"($W8=0)","v":true},{"$f":"($W8>0)","v":false},{"$f":"($W8<0)","v":false},{"$f":"IF($U8=\"F\",\"\",TIME(0,0,0))","v":"00:00:00"},{"$f":"IF($U8=\"F\",\"\",IF(ISNA(VLOOKUP($B8,GAZ,AC$7,FALSE)),0,VLOOKUP($B8,GAZ,AC$7,FALSE)))","v":"00:00:00"},{"$f":"IF(OR($U8=\"F\",$S8<>\"\",ISNA(VLOOKUP($B8,GAZ,AD$7,FALSE))),0,IF(NOT($AK8),VLOOKUP($B8,GAZ,11,FALSE),IF(($I8-$H8)*24>=6,VLOOKUP($B8,GAZ,3,FALSE),0)))","v":"00:00:00"},{"$f":"IF($U8=\"F\",\"\",IF(ISNA(VLOOKUP($B8,GAZ,AE$7,FALSE)),0,VLOOKUP($B8,GAZ,AE$7,FALSE)))","v":"00:00:00"},{"$f":"IF($U8=\"F\",\"\",TIME(23,59,0))","v":"23:59:00"},{"$f":"OR($H8<>\"\",$I8<>\"\")","v":false},{"$f":"AND($T8<>\"F\",NOT($AG8),NOT($AC8=$AE8))","v":false},{"$f":"AND($AH8,OR($D8=\"U\",$D8=\"Z\",$D8=\"K\"))","v":false},{"$f":"AND($U8<>\"F\",$D8<>\"U\",$D8<>\"Z\",$D8<>\"K\",$R8)","v":true},{"$f":"AND($H8<>\"\",$I8<>\"\")","v":false},{"$f":"IF($AJ8,TagUG,\"\")","v":"00:00:00"},{"$f":"IF($AJ8,IF($I8=\"\",IF(AND($L8<>\"\",$L8<$AF8),$L8,IF(AND($M8<>\"\",$M8<$AF8),$M8,TagOG)),$I8),\"\")","v":"23:59:00"},{"$f":"IF($AJ8,IF($H8=\"\",$AB8,$H8),\"\")","v":"00:00:00"},{"$f":"IF($AJ8,IF(AND($L8<>\"\",$L8<$AF8),$L8,IF(AND($M8<>\"\",$M8<$AF8),$M8,TagOG)),\"\")","v":"23:59:00"},{"$f":"MOD($H8*24,0.25)=0","v":true},{"$f":"AND($AJ8,ISNUMBER($H8),$H8>=$AB8,$H8<=$AF8,OR($I8=\"\",$H8<=$I8))","v":false},{"$f":"MOD($I8*24,0.25)=0","v":true},{"$f":"AND($AJ8,ISNUMBER($I8),$I8>=$AB8,$I8<=$AF8,OR($H8=\"\",$I8>=$H8))","v":false},{"$f":"IF(AND(ISBLANK($D8),ISBLANK($H8),ISBLANK($I8)),0,1)","v":0}]
["2024-06-02","So"," Wochenende",null,{"$f":"IF(AND($R9,$T9<>\"F\"),IF($AC9=$AE9,\"keine NAZ\",TEXT($AC9,\"hh:mm\")&\"-\"&TEXT($AC9+$F9+$G9,\"hh:mm\")),\"\")","v":""},"00:00:00","00:00:00",null,null,"",0,null,null,null,null,null,{"$f":" Q8+1","v":"2024-06-02"},true,"","F","F",{"$f":"$I9-$H9","v":0},{"$f":"IF($R9,ROUND($V9-$F9-$AD9,15),\"\")","v":0},0,true,false,false,"","","00:00:00","","",false,false,false,false,false,"","",{"$f":"IF($AJ9,IF($H9=\"\",TagUG,$H9),\"\")","v":""},"",true,false,true,false,0]
["2024-06-03","Mo"," ",null,"08:00-16:00","08:00:00","00:00:00",null,null,"",0,null,null,null,null,null,"2024-06-03",true,"","A","A",0,-0.33333333333333298,0,false,false,true,"00:00:00","08:00:00","00:00:00","16:00:00","23:59:00",false,true,false,true,false,"00:00:00","23:59:00","00:00:00","23:59:00",true,false,true,false,0]
["2024-06-04","Di"," ",null,"08:00-16:00","08:00:00","00:00:00",null,null,"",0,null,null,null,null,null,"2024-06-04",true,"","A","A",0,-0.33333333333333298,0,false,false,true,"00:00:00","08:00:00","00:00:00","16:00:00","23:59:00",false,true,false,true,false,"00:00:00","23:59:00","00:00:00","23:59:00",true,false,true,false,0]
["2024-06-05","Mi"," ",null,"08:00-16:00","08:00:00","00:00:00",null,null,"",0,null,null,null,null,null,"2024-06-05",true,"","A","A",0,-0.33333333333333298,0,false,false,true,"00:00:00","08:00:00","00:00:00","16:00:00","23:59:00",false,true,false,true,false,"00:00:00","23:59:00","00:00:00","23:59:00",true,false,true,false,0]
["2024-06-06","Do"," ",null,"08:00-16:00","08:00:00","00:00:00",null,null,"",0,null,null,null,null,null,"2024-06-06",true,"","A","A",0,-0.33333333333333298,0,false,false,true,"00:00:00","08:00:00","00:00:00","16:00:00","23:59:00",false,true,false,true,false,"00:00:00","23:59:00","00:00:00","23:59:00",true,false,true,false,0]
["2024-06-07","Fr"," ",null,"08:00-16:00","08:00:00","00:00:00",null,null,"",0,null,null,null,null,null,"2024-06-07",true,"","A","A",0,-0.33333333333333298,0,false,false,true,"00:00:00","08:00:00","00:00:00","16:00:00","23:59:00",false,true,false,true,false,"00:00:00","23:59:00","00:00:00","23:59:00",true,false,true,false,0]
["2024-06-08","Sa"," Wochenende",null,"","00:00:00","00:00:00",null,null,"",0,null,null,null,null,null,"2024-06-08",true,"","F","A",0,0,0,true,false,false,"00:00:00","00:00:00","00:00:00","00:00:00","23:59:00",false,false,false,true,false,"00:00:00","23:59:00","00:00:00","23:59:00",true,false,true,false,0]
["2024-06-09","So"," Vatertag",null,"","00:00:00","00:00:00",null,null,"",0,null,null,null,null,null,"2024-06-09",true,"","F","F",0,0,0,true,false,false,"","","00:00:00","","",false,false,false,false,false,"","","","",true,false,true,false,0]
["2024-06-10","Mo"," ",null,"08:00-16:00","08:00:00","00:00:00",null,null,"",0,null,null,null,null,null,"2024-06-10",true,"","A","A",0,-0.33333333333333298,0,false,false,true,"00:00:00","08:00:00","00:00:00","16:00:00","23:59:00",false,true,false,true,false,"00:00:00","23:59:00","00:00:00","23:59:00",true,false,true,false,0]
["2024-06-11","Di"," ",null,"08:00-16:00","08:00:00","00:00:00",null,null,"",0,null,null,null,null,null,"2024-06-11",true,"","A","A",0,-0.33333333333333298,0,false,false,true,"00:00:00","08:00:00","00:00:00","16:00:00","23:59:00",false,true,false,true,false,"00:00:00","23:59:00","00:00:00","23:59:00",true,false,true,false,0]
["2024-06-12","Mi"," ",null,"08:00-16:00","08:00:00","00:00:00",null,null,"",0,null,null,null,null,null,"2024-06-12",true,"","A","A",0,-0.33333333333333298,0,false,false,true,"00:00:00","08:00:00","00:00:00","16:00:00","23:59:00",false,true,false,true,false,"00:00:00","23:59:00","00:00:00","23:59:00",true,false,true,false,0]
["2024-06-13","Do"," ",null,"08:00-16:00","08:00:00","00:00:00",null,null,"",0,null,null,null,null,null,"2024-06-13",true,"","A","A",0,-0.33333333333333298,0,false,false,true,"00:00:00","08:00:00","00:00:00","16:00:00","23:59:00",false,true,false,true,false,"00:00:00","23:59:00","00:00:00","23:59:00",true,false,true,false,0]
["2024-06-14","Fr"," ",null,"08:00-16:00","08:00:00","00:00:00",null,null,"",0,null,null,null,null,null,"2024-06-14",true,"","A","A",0,-0.33333333333333298,0,false,false,true,"00:00:00","08:00:00","00:00:00","16:00:00","23:59:00",false,true,false,true,false,"00:00:00","23:59:00","00:00:00","23:59:00",true,false,true,false,0]
["2024-06-15","Sa"," Wochenende",null,"","00:00:00","00:00:00",null,null,"",0,null,null,null,null,null,"2024-06-15",true,"","F","A",0,0,0,true,false,false,"00:00:00","00:00:00","00:00:00","00:00:00","23:59:00",false,false,false,true,false,"00:00:00","23:59:00","00:00:00","23:59:00",true,false,true,false,0]
["2024-06-16","So"," Wochenende",null,"","00:00:00","00:00:00",null,null,"",0,null,null,null,null,null,"2024-06-16",true,"","F","F",0,0,0,true,false,false,"","","00:00:00","","",false,false,false,false,false,"","","","",true,false,true,false,0]
["2024-06-17","Mo"," ",null,"08:00-16:00","08:00:00","00:00:00",null,null,"",0,null,null,null,null,null,"2024-06-17",true,"","A","A",0,-0.33333333333333298,0,false,false,true,"00:00:00","08:00:00","00:00:00","16:00:00","23:59:00",false,true,false,true,false,"00:00:00","23:59:00","00:00:00","23:59:00",true,false,true,false,0]
["2024-06-18","Di"," ",null,"08:00-16:00","08:00:00","00:00:00",null,null,"",0,null,null,null,null,null,"2024-06-18",true,"","A","A",0,-0.33333333333333298,0,false,false,true,"00:00:00","08:00:00","00:00:00","16:00:00","23:59:00",false,true,false,true,false,"00:00:00","23:59:00","00:00:00","23:59:00",true,false,true,false,0]
["2024-06-19","Mi"," ",null,"08:00-16:00","08:00:00","00:00:00",null,null,"",0,null,null,null,null,null,"2024-06-19",true,"","A","A",0,-0.33333333333333298,0,false,false,true,"00:00:00","08:00:00","00:00:00","16:00:00","23:59:00",false,true,false,true,false,"00:00:00","23:59:00","00:00:00","23:59:00",true,false,true,false,0]
["2024-06-20","Do"," ",null,"08:00-16:00","08:00:00","00:00:00",null,null,"",0,null,null,null,null,null,"2024-06-20",true,"","A","A",0,-0.33333333333333298,0,false,false,true,"00:00:00","08:00:00","00:00:00","16:00:00","23:59:00",false,true,false,true,false,"00:00:00","23:59:00","00:00:00","23:59:00",true,false,true,false,0]
["2024-06-21","Fr"," ",null,"08:00-16:00","08:00:00","00:00:00",null,null,"",0,null,null,null,null,null,"2024-06-21",true,"","A","A",0,-0.33333333333333298,0,false,false,true,"00:00:00","08:00:00","00:00:00","16:00:00","23:59:00",false,true,false,true,false,"00:00:00","23:59:00","00:00:00","23:59:00",true,false,true,false,0]
["2024-06-22","Sa"," Wochenende",null,"","00:00:00","00:00:00",null,null,"",0,null,null,null,null,null,"2024-06-22",true,"","F","A",0,0,0,true,false,false,"00:00:00","00:00:00","00:00:00","00:00:00","23:59:00",false,false,false,true,false,"00:00:00","23:59:00","00:00:00","23:59:00",true,false,true,false,0]
["2024-06-23","So"," Wochenende",null,"","00:00:00","00:00:00",null,null,"",0,null,null,null,null,null,"2024-06-23",true,"","F","F",0,0,0,true,false,false,"","","00:00:00","","",false,false,false,false,false,"","","","",true,false,true,false,0]
["2024-06-24","Mo"," ",null,"08:00-16:00","08:00:00","00:00:00",null,null,"",0,null,null,null,null,null,"2024-06-24",true,"","A","A",0,-0.33333333333333298,0,false,false,true,"00:00:00","08:00:00","00:00:00","16:00:00","23:59:00",false,true,false,true,false,"00:00:00","23:59:00","00:00:00","23:59:00",true,false,true,false,0]
["2024-06-25","Di"," ",null,"08:00-16:00","08:00:00","00:00:00",null,null,"",0,null,null,null,null,null,"2024-06-25",true,"","A","A",0,-0.33333333333333298,0,false,false,true,"00:00:00","08:00:00","00:00:00","16:00:00","23:59:00",false,true,false,true,false,"00:00:00","23:59:00","00:00:00","23:59:00",true,false,true,false,0]
["2024-06-26","Mi"," ",null,"08:00-16:00","08:00:00","00:00:00",null,null,"",0,null,null,null,null,null,"2024-06-26",true,"","A","A",0,-0.33333333333333298,0,false,false,true,"00:00:00","08:00:00","00:00:00","16:00:00","23:59:00",false,true,false,true,false,"00:00:00","23:59:00","00:00:00","23:59:00",true,false,true,false,0]
["2024-06-27","Do"," ",null,"08:00-16:00","08:00:00","00:00:00",null,null,"",0,null,null,null,null,null,"2024-06-27",true,"","A","A",0,-0.33333333333333298,0,false,false,true,"00:00:00","08:00:00","00:00:00","16:00:00","23:59:00",false,true,false,true,false,"00:00:00","23:59:00","00:00:00","23:59:00",true,false,true,false,0]
["2024-06-28","Fr"," ",null,"08:00-16:00","08:00:00","00:00:00",null,null,"",0,null,null,null,null,null,"2024-06-28",true,"","A","A",0,-0.33333333333333298,0,false,false,true,"00:00:00","08:00:00","00:00:00","16:00:00","23:59:00",false,true,false,true,false,"00:00:00","23:59:00","00:00:00","23:59:00",true,false,true,false,0]
["2024-06-29","Sa"," Wochenende",null,"","00:00:00","00:00:00",null,null,"",0,null,null,null,null,null,"2024-06-29",true,"","F","A",0,0,0,true,false,false,"00:00:00","00:00:00","00:00:00","00:00:00","23:59:00",false,false,false,true,false,"00:00:00","23:59:00","00:00:00","23:59:00",true,false,true,false,0]
["2024-06-30","So"," Wochenende",null,"","00:00:00","00:00:00",null,null,"",0,null,null,null,null,null,"2024-06-30",true,"","F","F",0,0,0,true,false,false,"","","00:00:00","","",false,false,false,false,false,"","","","",true,false,true,false,0]
["","","",null,"","","",null,null,"",0,null,null,null,null,null,"2024-07-01",false,"","","",0,"",0,false,true,false,"00:00:00","00:00:00","00:00:00","00:00:00","23:59:00",false,false,false,false,false,"","","","",true,false,true,false,0]
["Arbeitstage",{"$f":"COUNTIF(T$8:T$38,\"A\")","v":20},null,null,{"$f":"\"Monat Std.-Saldo (~15min) > \"","v":"Monat Std.-Saldo (~15min) > "},null,null,null,null,{"$f":"ROUND(SUM(J8:J38)*4,0)/4","v":0}]
["ZA-Tage",{"$f":"COUNTIF(D$8:D$38,\"Z\")","v":0},null,null," Vormonat Std.Saldo > ",null,null,null,null,{"$f":"$K5","v":0},null,null,null,null,null,null,"Gültigkeit ausbezahlt"]
["Urlaubstage",{"$f":"COUNTIF(D$8:D$38,\"U\")","v":0},null,null," Gesamt Std. Saldo > ",null,null,null,null,{"$f":"$J39+$J40","v":0},null,null,null,null,null,null,{"$f":"AND($K$41>=0,$K$41<=$J$41,MOD($K$41,0.25)=0)","v":true}]
["Krank",{"$f":"COUNTIF(D$8:D$38,\"K\")","v":0},null,null," Übertrag Std. Saldo > ",null,null,null,null,{"$f":"$J41","v":0},{"$f":"\" < Dieser Stunden-Saldo wird in das nächste \"&IF($Q$3=\"Dezember\",\"Jahr\",\"Monat\")&\" übertragen\"","v":" < Dieser Stunden-Saldo wird in das nächste Monat übertragen"}]
[null,null,null,"Z"]
[]
[{"$f":"\"Unterschrift von \"&Vorgesetzter","v":"Unterschrift von Vorname Nachname"},null,null,null,null,null,null,null,null,null,null,null,{"$f":"\"Unterschrift von \"&Name","v":"Unterschrift von Vorname Nachname"}]

{"sheet":"Juli","index":7,"n_rows":45,"n_cols":46,"rows_kept":45,"cut":false,"hidden":true,"merged":[[42,4,42,8],[43,4,43,8],[44,0,44,3],[44,12,44,15],[36,11,36,15],[37,11,37,15],[38,2,41,3],[38,4,38,8],[38,10,40,15],[39,4,39,8],[40,4,40,8],[41,4,41,8],[41,10,41,15],[30,11,30,15],[31,11,31,15],[32,11,32,15],[33,11,33,15],[34,11,34,15],[35,11,35,15],[24,11,24,15],[25,11,25,15],[26,11,26,15],[27,11,27,15],[28,11,28,15],[29,11,29,15],[18,11,18,15],[19,11,19,15],[20,11,20,15],[21,11,21,15],[22,11,22,15],[23,11,23,15],[12,11,12,15],[13,11,13,15],[14,11,14,15],[15,11,15,15],[16,11,16,15],[17,11,17,15],[5,27,5,31],[7,11,7,15],[8,11,8,15],[9,11,9,15],[10,11,10,15],[11,11,11,15],[4,4,4,6],[4,7,4,9],[5,2,6,2],[5,3,6,3],[5,5,6,5],[5,6,6,6],[5,7,6,7],[5,8,6,8],[0,15,1,15],[1,5,1,8],[2,5,2,8],[3,0,3,3],[3,4,3,6],[3,7,3,9],[3,11,6,15],[4,0,6,0],[4,1,6,1],[4,2,4,3]]}
[{"$f":"Konfig!$A$1","v":" BOKU-Zeiterfassung für Wissenschaftliches Personal"},null,null,null,null,null,null,null,null,null,null,null,null,null,null,null,"Monat","Stunden-Saldo Grenzen","Status Blatteingabe"]
[{"$f":"\" Org.-Einh. : \"&OrgEinheit","v":" Org.-Einh. : Hxxxxx"},null,null,null,null,"Zeitmodell:",null,null,null,{"$f":"\" \"&Zeitmodell","v":" Vollzeit"},null,null,null,null,null,null,{"$f":"IF(ISNA($Q$4),1,$Q$4)","v":7},0,{"$f":"SUM($AT8:$AT38)","v":0}]
[{"$f":" \" Mitarbeiter: \"&Name","v":" Mitarbeiter: Vorname Nachname"},null,null,null,null,"Vorgesetzter:",null,null,null,{"$f":"\" \"&Vorgesetzter","v":" Vorname Nachname"},null,null,null,null,null,null,{"$f":"RIGHT(CELL(\"filename\",A1),LEN(CELL(\"filename\",A1))-SEARCH(\"]\",CELL(\"filename\",A1),1))","v":"Juli"},null,{"$f":"IF($Q$2=1,$S$2,$S$2+INDIRECT($S$5))","v":0}]
[{"$f":" \" Monat: \"&$Q$3&\" \"&Jahr","v":" Monat: Juli 2024"},null,null,null,"Dienstplan",null,null,"Normalstunden",null,null,"Übertrag","Anmerkungen ",null,null,null,null,{"$f":"IF(ISNA(VLOOKUP($Q$3,MTab,2,FALSE)),1,VLOOKUP($Q$3,MTab,2,FALSE))","v":7},null,"Übertrags Adresse Blatteingabe"]
[" Datum","Wochentag","Tagesinformation",null,{"$f":"\"Wochen-AZ\"&\" \"&TEXT(WAZ,\"[hh]:mm\")","v":"Wochen-AZ 40:00"},null,null," Stunden 1:1",null,null,{"$f":"IF(ISNA($Q$5),Übertrag,INDIRECT($Q$5))","v":0},null,null,null,null,null,{"$f":"IF(ISNA(VLOOKUP($Q$3,MTab,3,FALSE)),\"Übertrag\",VLOOKUP($Q$3,MTab,3,FALSE))","v":"Juni!$J$42"},null,{"$f":"IF(ISNA(VLOOKUP($Q$3,MTab,4,FALSE)),$Q$3&\"!$R$2\",VLOOKUP($Q$3,MTab,4,FALSE))","v":"Juni!$S$3"}]
[null,null," Feiertage\n Wochenende\n Urlaub, ZA, Krank","[U]rlaub\n[Z]A\n[K]rank","Normal-","Soll","MP","Von","Bis","Plus","Saldo",null,null,null,null,null,"Hintergrundberechnungen",null,null,null,null,null,null,"Saldo aktuell",null,null,null,"GAZ-Tabellenabbildung",null,null,null,null,"Eingabebeprüfungen"]
[null,null,null,null,"Arbeitszeit",null,null,null,null,"Minus","akuell",null,null,null,null,null,"Datum","Monat OK","Abwesenh.","Freie Tage","ÜA-Tage","Std.","Soll-Std.",{"$f":"IF(ISNA($Q$5),Übertrag,INDIRECT($Q$5))","v":0},"Std.-Soll = 0","Std.-Soll > 0","Std.-Soll < 0",null,{"$f":"I_GAZNAZVon","v":2},3,{"$f":"I_GAZNAZBis","v":4},null,"Zeiteingabe","UZK-Eing.\nerlaubt","UZK-Eing.\ngültig","Normalst. ein erlaubt","Normalstd.\neingegeben","Normal VON möglich OG","Normal VON möglich UG","Normal BIS möglich OG","Normal BIS möglich UG","Normal VON\n15min","Normal VON richtig","Normal BIS\n15min","Normal BIS richtig","Status Zeilen Eingabe"]
[{"$f":"IF($R8,$Q8,\"\")","v":"2024-07-01"},{"$f":"IF($R8,VLOOKUP(WEEKDAY($Q8,2),WOTA,2,FALSE),\"\")","v":"Mo"},{"$f":"IF($R8,\" \"&IF($S8=\"\",VLOOKUP($Q8,FListe,3,FALSE),$S8),\"\")","v":" "},null,{"$f":"IF(AND($R8,$T8<>\"F\"),IF($AC8=$AE8,\"keine NAZ\",TEXT($AC8,\"hh:mm\")&\"-\"&TEXT($AC8+$F8+$G8,\"hh:mm\")),\"\")","v":"08:00-16:00"},{"$f":"IF($R8,IF($T8=\"F\",0,VLOOKUP($B8,GAZ,I_GAZNAZMP,FALSE)),\"\")","v":"08:00:00"},{"$f":"IF($R8,$AD8,\"\")","v":"00:00:00"},null,null,{"$f":"IF(AND($R8,$AK8,NOT($Y8)),ROUND(($V8-$F8-$G8)*24,2),IF($D8=\"Z\",$F8*-24,\"\"))","v":""},{"$f":"$X8","v":0},null,null,null,null,null,{"$f":"DATE(Jahr,$Q2,1)","v":"2024-07-01"},{"$f":"$Q$2=MONTH($Q8)","v":true},{"$f":"IF(OR($D8=\"U\",$D8=\"Z\",$D8=\"ZK\",$D8=\"K\"),VLOOKUP($D8,UZK,2,FALSE),\"\")","v":""},{"$f":"IF($R8,VLOOKUP($Q8,FListe,4,FALSE),\"\")","v":"A"},{"$f":"IF($R8,VLOOKUP($Q8,FListe,5,FALSE),\"\")","v":"A"},{"$f":"$I8-$H8","v":0},{"$f":"IF($R8,ROUND($V8-$F8-$AD8,15),\"\")","v":-0.33333333333333298},{"$f":"IF($J8<>\"\",$X7+$J8,$X7)","v":0},{"$f":"($W8=0)","v":false},{"$f":"($W8>0)","v":false},{"$f":"($W8<0)","v":true},{"$f":"IF($U8=\"F\",\"\",TIME(0,0,0))","v":"00:00:00"},{"$f":"IF($U8=\"F\",\"\",IF(ISNA(VLOOKUP($B8,GAZ,AC$7,FALSE)),0,VLOOKUP($B8,GAZ,AC$7,FALSE)))","v":"08:00:00"},{"$f":"IF(OR($U8=\"F\",$S8<>\"\",ISNA(VLOOKUP($B8,GAZ,AD$7,FALSE))),0,IF(NOT($AK8),VLOOKUP($B8,GAZ,11,FALSE),IF(($I8-$H8)*24>=6,VLOOKUP($B8,GAZ,3,FALSE),0)))","v":"00:00:00"},{"$f":"IF($U8=\"F\",\"\",IF(ISNA(VLOOKUP($B8,GAZ,AE$7,FALSE)),0,VLOOKUP($B8,GAZ,AE$7,FALSE)))","v":"16:00:00"},{"$f":"IF($U8=\"F\",\"\",TIME(23,59,0))","v":"23:59:00"},{"$f":"OR($H8<>\"\",$I8<>\"\")","v":false},{"$f":"AND($T8<>\"F\",NOT($AG8),NOT($AC8=$AE8))","v":true},{"$f":"AND($AH8,OR($D8=\"U\",$D8=\"Z\",$D8=\"K\"))","v":false},{"$f":"AND($U8<>\"F\",$D8<>\"U\",$D8<>\"Z\",$D8<>\"K\",$R8)","v":true},{"$f":"AND($H8<>\"\",$I8<>\"\")","v":false},{"$f":"IF($AJ8,TagUG,\"\")","v":"00:00:00"},{"$f":"IF($AJ8,IF($I8=\"\",IF(AND($L8<>\"\",$L8<$AF8),$L8,IF(AND($M8<>\"\",$M8<$AF8),$M8,TagOG)),$I8),\"\")","v":"23:59:00"},{"$f":"IF($AJ8,IF($H8=\"\",$AB8,$H8),\"\")","v":"00:00:00"},{"$f":"IF($AJ8,IF(AND($L8<>\"\",$L8<$AF8),$L8,IF(AND($M8<>\"\",$M8<$AF8),$M8,TagOG)),\"\")","v":"23:59:00"},{"$f":"MOD($H8*24,0.25)=0","v":true},{"$f":"AND($AJ8,ISNUMBER($H8),$H8>=$AB8,$H8<=$AF8,OR($I8=\"\",$H8<=$I8))","v":false},{"$f":"MOD($I8*24,0.25)=0","v":true},{"$f":"AND($AJ8,ISNUMBER($I8),$I8>=$AB8,$I8<=$AF8,OR($H8=\"\",$I8>=$H8))","v":false},{"$f":"IF(AND(ISBLANK($D8),ISBLANK($H8),ISBLANK($I8)),0,1)","v":0}]
["2024-07-02","Di"," ",null,{"$f":"IF(AND($R9,$T9<>\"F\"),IF($AC9=$AE9,\"keine NAZ\",TEXT($AC9,\"hh:mm\")&\"-\"&TEXT($AC9+$F9+$G9,\"hh:mm\")),\"\")","v":"08:00-16:00"},"08:00:00","00:00:00",null,null,"",0,null,null,null,null,null,{"$f":" Q8+1","v":"2024-07-02"},true,"","A","A",{"$f":"$I9-$H9","v":0},{"$f":"IF($R9,ROUND($V9-$F9-$AD9,15),\"\")","v":-0.33333333333333298},0,false,false,true,"00:00:00","08:00:00","00:00:00","16:00:00","23:59:00",false,true,false,true,false,"00:00:00","23:59:00",{"$f":"IF($AJ9,IF($H9=\"\",TagUG,$H9),\"\")","v":"00:00:00"},"23:59:00",true,false,true,false,0]
["2024-07-03","Mi"," ",null,"08:00-16:00","08:00:00","00:00:00",null,null,"",0,null,null,null,null,null,"2024-07-03",true,"","A","A",0,-0.33333333333333298,0,false,false,true,"00:00:00","08:00:00","00:00:00","16:00:00","23:59:00",false,true,false,true,false,"00:00:00","23:59:00","00:00:00","23:59:00",true,false,true,false,0]
["2024-07-04","Do"," ",null,"08:00-16:00","08:00:00","00:00:00",null,null,"",0,null,null,null,null,null,"2024-07-04",true,"","A","A",0,-0.33333333333333298,0,false,false,true,"00:00:00","08:00:00","00:00:00","16:00:00","23:59:00",false,true,false,true,false,"00:00:00","23:59:00","00:00:00","23:59:00",true,false,true,false,0]
["2024-07-05","Fr"," ",null,"08:00-16:00","08:00:00","00:00:00",null,null,"",0,null,null,null,null,null,"2024-07-05",true,"","A","A",0,-0.33333333333333298,0,false,false,true,"00:00:00","08:00:00","00:00:00","16:00:00","23:59:00",false,true,false,true,false,"00:00:00","23:59:00","00:00:00","23:59:00",true,false,true,false,0]
["2024-07-06","Sa"," Wochenende",null,"","00:00:00","00:00:00",null,null,"",0,null,null,null,null,null,"2024-07-06",true,"","F","A",0,0,0,true,false,false,"00:00:00","00:00:00","00:00:00","00:00:00","23:59:00",false,false,false,true,false,"00:00:00","23:59:00","00:00:00","23:59:00",true,false,true,false,0]
["2024-07-07","So"," Wochenende",null,"","00:00:00","00:00:00",null,null,"",0,null,null,null,null,null,"2024-07-07",true,"","F","F",0,0,0,true,false,false,"","","00:00:00","","",false,false,false,false,false,"","","","",true,false,true,false,0]
["2024-07-08","Mo"," ",null,"08:00-16:00","08:00:00","00:00:00",null,null,"",0,null,null,null,null,null,"2024-07-08",true,"","A","A",0,-0.33333333333333298,0,false,false,true,"00:00:00","08:00:00","00:00:00","16:00:00","23:59:00",false,true,false,true,false,"00:00:00","23:59:00","00:00:00","23:59:00",true,false,true,false,0]
["2024-07-09","Di"," ",null,"08:00-16:00","08:00:00","00:00:00",null,null,"",0,null,null,null,null,null,"2024-07-09",true,"","A","A",0,-0.33333333333333298,0,false,false,true,"00:00:00","08:00:00","00:00:00","16:00:00","23:59:00",false,true,false,true,false,"00:00:00","23:59:00","00:00:00","23:59:00",true,false,true,false,0]
["2024-07-10","Mi"," ",null,"08:00-16:00","08:00:00","00:00:00",null,null,"",0,null,null,null,null,null,"2024-07-10",true,"","A","A",0,-0.33333333333333298,0,false,false,true,"00:00:00","08:00:00","00:00:00","16:00:00","23:59:00",false,true,false,true,false,"00:00:00","23:59:00","00:00:00","23:59:00",true,false,true,false,0]
["2024-07-11","Do"," ",null,"08:00-16:00","08:00:00","00:00:00",null,null,"",0,null,null,null,null,null,"2024-07-11",true,"","A","A",0,-0.33333333333333298,0,false,false,true,"00:00:00","08:00:00","00:00:00","16:00:00","23:59:00",false,true,false,true,false,"00:00:00","23:59:00","00:00:00","23:59:00",true,false,true,false,0]
["2024-07-12","Fr"," ",null,"08:00-16:00","08:00:00","00:00:00",null,null,"",0,null,null,null,null,null,"2024-07-12",true,"","A","A",0,-0.33333333333333298,0,false,false,true,"00:00:00","08:00:00","00:00:00","16:00:00","23:59:00",false,true,false,true,false,"00:00:00","23:59:00","00:00:00","23:59:00",true,false,true,false,0]
["2024-07-13","Sa"," Wochenende",null,"","00:00:00","00:00:00",null,null,"",0,null,null,null,null,null,"2024-07-13",true,"","F","A",0,0,0,true,false,false,"00:00:00","00:00:00","00:00:00","00:00:00","23:59:00",false,false,false,true,false,"00:00:00","23:59:00","00:00:00","23:59:00",true,false,true,false,0]
["2024-07-14","So"," Wochenende",null,"","00:00:00","00:00:00",null,null,"",0,null,null,null,null,null,"2024-07-14",true,"","F","F",0,0,0,true,false,false,"","","00:00:00","","",false,false,false,false,false,"","","","",true,false,true,false,0]
["2024-07-15","Mo"," ",null,"08:00-16:00","08:00:00","00:00:00",null,null,"",0,null,null,null,null,null,"2024-07-15",true,"","A","A",0,-0.33333333333333298,0,false,false,true,"00:00:00","08:00:00","00:00:00","16:00:00","23:59:00",false,true,false,true,false,"00:00:00","23:59:00","00:00:00","23:59:00",true,false,true,false,0]
["2024-07-16","Di"," ",null,"08:00-16:00","08:00:00","00:00:00",null,null,"",0,null,null,null,null,null,"2024-07-16",true,"","A","A",0,-0.33333333333333298,0,false,false,true,"00:00:00","08:00:00","00:00:00","16:00:00","23:59:00",false,true,false,true,false,"00:00:00","23:59:00","00:00:00","23:59:00",true,false,true,false,0]
["2024-07-17","Mi"," ",null,"08:00-16:00","08:00:00","00:00:00",null,null,"",0,null,null,null,null,null,"2024-07-17",true,"","A","A",0,-0.33333333333333298,0,false,false,true,"00:00:00","08:00:00","00:00:00","16:00:00","23:59:00",false,true,false,true,false,"00:00:00","23:59:00","00:00:00","23:59:00",true,false,true,false,0]
["2024-07-18","Do"," ",null,"08:00-16:00","08:00:00","00:00:00",null,null,"",0,null,null,null,null,null,"2024-07-18",true,"","A","A",0,-0.33333333333333298,0,false,false,true,"00:00:00","08:00:00","00:00:00","16:00:00","23:59:00",false,true,false,true,false,"00:00:00","23:59:00","00:00:00","23:59:00",true,false,true,false,0]
["2024-07-19","Fr"," ",null,"08:00-16:00","08:00:00","00:00:00",null,null,"",0,null,null,null,null,null,"2024-07-19",true,"","A","A",0,-0.33333333333333298,0,false,false,true,"00:00:00","08:00:00","00:00:00","16:00:00","23:59:00",false,true,false,true,false,"00:00:00","23:59:00","00:00:00","23:59:00",true,false,true,false,0]
["2024-07-20","Sa"," Wochenende",null,"","00:00:00","00:00:00",null,null,"",0,null,null,null,null,null,"2024-07-20",true,"","F","A",0,0,0,true,false,false,"00:00:00","00:00:00","00:00:00","00:00:00","23:59:00",false,false,false,true,false,"00:00:00","23:59:00","00:00:00","23:59:00",true,false,true,false,0]
["2024-07-21","So"," Wochenende",null,"","00:00:00","00:00:00",null,null,"",0,null,null,null,null,null,"2024-07-21",true,"","F","F",0,0,0,true,false,false,"","","00:00:00","","",false,false,false,false,false,"","","","",true,false,true,false,0]
["2024-07-22","Mo"," ",null,"08:00-16:00","08:00:00","00:00:00",null,null,"",0,null,null,null,null,null,"2024-07-22",true,"","A","A",0,-0.33333333333333298,0,false,false,true,"00:00:00","08:00:00","00:00:00","16:00:00","23:59:00",false,true,false,true,false,"00:00:00","23:59:00","00:00:00","23:59:00",true,false,true,false,0]
["2024-07-23","Di"," ",null,"08:00-16:00","08:00:00","00:00:00",null,null,"",0,null,null,null,null,null,"2024-07-23",true,"","A","A",0,-0.33333333333333298,0,false,false,true,"00:00:00","08:00:00","00:00:00","16:00:00","23:59:00",false,true,false,true,false,"00:00:00","23:59:00","00:00:00","23:59:00",true,false,true,false,0]
["2024-07-24","Mi"," ",null,"08:00-16:00","08:00:00","00:00:00",null,null,"",0,null,null,null,null,null,"2024-07-24",true,"","A","A",0,-0.33333333333333298,0,false,false,true,"00:00:00","08:00:00","00:00:00","16:00:00","23:59:00",false,true,false,true,false,"00:00:00","23:59:00","00:00:00","23:59:00",true,false,true,false,0]
["2024-07-25","Do"," ",null,"08:00-16:00","08:00:00","00:00:00",null,null,"",0,null,null,null,null,null,"2024-07-25",true,"","A","A",0,-0.33333333333333298,0,false,false,true,"00:00:00","08:00:00","00:00:00","16:00:00","23:59:00",false,true,false,true,false,"00:00:00","23:59:00","00:00:00","23:59:00",true,false,true,false,0]
["2024-07-26","Fr"," ",null,"08:00-16:00","08:00:00","00:00:00",null,null,"",0,null,null,null,null,null,"2024-07-26",true,"","A","A",0,-0.33333333333333298,0,false,false,true,"00:00:00","08:00:00","00:00:00","16:00:00","23:59:00",false,true,false,true,false,"00:00:00","23:59:00","00:00:00","23:59:00",true,false,true,false,0]
["2024-07-27","Sa"," Wochenende",null,"","00:00:00","00:00:00",null,null,"",0,null,null,null,null,null,"2024-07-27",true,"","F","A",0,0,0,true,false,false,"00:00:00","00:00:00","00:00:00","00:00:00","23:59:00",false,false,false,true,false,"00:00:00","23:59:00","00:00:00","23:59:00",true,false,true,false,0]
["2024-07-28","So"," Wochenende",null,"","00:00:00","00:00:00",null,null,"",0,null,null,null,null,null,"2024-07-28",true,"","F","F",0,0,0,true,false,false,"","","00:00:00","","",false,false,false,false,false,"","","","",true,false,true,false,0]
["2024-07-29","Mo"," ",null,"08:00-16:00","08:00:00","00:00:00",null,null,"",0,null,null,null,null,null,"2024-07-29",true,"","A","A",0,-0.33333333333333298,0,false,false,true,"00:00:00","08:00:00","00:00:00","16:00:00","23:59:00",false,true,false,true,false,"00:00:00","23:59:00","00:00:00","23:59:00",true,false,true,false,0]
["2024-07-30","Di"," ",null,"08:00-16:00","08:00:00","00:00:00",null,null,"",0,null,null,null,null,null,"2024-07-30",true,"","A","A",0,-0.33333333333333298,0,false,false,true,"00:00:00","08:00:00","00:00:00","16:00:00","23:59:00",false,true,false,true,false,"00:00:00","23:59:00","00:00:00","23:59:00",true,false,true,false,0]
["2024-07-31","Mi"," ",null,"08:00-16:00","08:00:00","00:00:00",null,null,"",0,null,null,null,null,null,"2024-07-31",true,"","A","A",0,-0.33333333333333298,0,false,false,true,"00:00:00","08:00:00","00:00:00","16:00:00","23:59:00",false,true,false,true,false,"00:00:00","23:59:00","00:00:00","23:59:00",true,false,true,false,0]
["Arbeitstage",{"$f":"COUNTIF(T$8:T$38,\"A\")","v":23},null,null,{"$f":"\"Monat Std.-Saldo (~15min) > \"","v":"Monat Std.-Saldo (~15min) > "},null,null,null,null,{"$f":"ROUND(SUM(J8:J38)*4,0)/4","v":0}]
["ZA-Tage",{"$f":"COUNTIF(D$8:D$38,\"Z\")","v":0},null,null," Vormonat Std.Saldo > ",null,null,null,null,{"$f":"$K5","v":0},null,null,null,null,null,null,"Gültigkeit ausbezahlt"]
["Urlaubstage",{"$f":"COUNTIF(D$8:D$38,\"U\")","v":0},null,null," Gesamt Std. Saldo > ",null,null,null,null,{"$f":"$J39+$J40","v":0},null,null,null,null,null,null,{"$f":"AND($K$41>=0,$K$41<=$J$41,MOD($K$41,0.25)=0)","v":true}]
["Krank",{"$f":"COUNTIF(D$8:D$38,\"K\")","v":0},null,null," Übertrag Std. Saldo > ",null,null,null,null,{"$f":"$J41","v":0},{"$f":"\" < Dieser Stunden-Saldo wird in das nächste \"&IF($Q$3=\"Dezember\",\"Jahr\",\"Monat\")&\" übertragen\"","v":" < Dieser Stunden-Saldo wird in das nächste Monat übertragen"}]
[null,null,null,"Z"]
[]
[{"$f":"\"Unterschrift von \"&Vorgesetzter","v":"Unterschrift von Vorname Nachname"},null,null,null,null,null,null,null,null,null,null,null,{"$f":"\"Unterschrift von \"&Name","v":"Unterschrift von Vorname Nachname"}]

{"sheet":"August","index":8,"n_rows":45,"n_cols":46,"rows_kept":45,"cut":false,"hidden":true,"merged":[[42,4,42,8],[43,4,43,8],[44,0,44,3],[44,12,44,15],[36,11,36,15],[37,11,37,15],[38,2,41,3],[38,4,38,8],[38,10,40,15],[39,4,39,8],[40,4,40,8],[41,4,41,8],[41,10,41,15],[30,11,30,15],[31,11,31,15],[32,11,32,15],[33,11,33,15],[34,11,34,15],[35,11,35,15],[24,11,24,15],[25,11,25,15],[26,11,26,15],[27,11,27,15],[28,11,28,15],[29,11,29,15],[18,11,18,15],[19,11,19,15],[20,11,20,15],[21,11,21,15],[22,11,22,15],[23,11,23,15],[12,11,12,15],[13,11,13,15],[14,11,14,15],[15,11,15,15],[16,11,16,15],[17,11,17,15],[5,27,5,31],[7,11,7,15],[8,11,8,15],[9,11,9,15],[10,11,10,15],[11,11,11,15],[4,4,4,6],[4,7,4,9],[5,2,6,2],[5,3,6,3],[5,5,6,5],[5,6,6,6],[5,7,6,7],[5,8,6,8],[0,15,1,15],[1,5,1,8],[2,5,2,8],[3,0,3,3],[3,4,3,6],[3,7,3,9],[3,11,6,15],[4,0,6,0],[4,1,6,1],[4,2,4,3]]}
[{"$f":"Konfig!$A$1","v":" BOKU-Zeiterfassung für Wissenschaftliches Personal"},null,null,null,null,null,null,null,null,null,null,null,null,null,null,null,"Monat","Stunden-Saldo Grenzen","Status Blatteingabe"]
[{"$f":"\" Org.-Einh. : \"&OrgEinheit","v":" Org.-Einh. : Hxxxxx"},null,null,null,null,"Zeitmodell:",null,null,null,{"$f":"\" \"&Zeitmodell","v":" Vollzeit"},null,null,null,null,null,null,{"$f":"IF(ISNA($Q$4),1,$Q$4)","v":8},0,{"$f":"SUM($AT8:$AT38)","v":0}]
[{"$f":" \" Mitarbeiter: \"&Name","v":" Mitarbeiter: Vorname Nachname"},null,null,null,null,"Vorgesetzter:",null,null,null,{"$f":"\" \"&Vorgesetzter","v":" Vorname Nachname"},null,null,null,null,null,null,{"$f":"RIGHT(CELL(\"filename\",A1),LEN(CELL(\"filename\",A1))-SEARCH(\"]\",CELL(\"filename\",A1),1))","v":"August"},null,{"$f":"IF($Q$2=1,$S$2,$S$2+INDIRECT($S$5))","v":0}]
[{"$f":" \" Monat: \"&$Q$3&\" \"&Jahr","v":" Monat: August 2024"},null,null,null,"Dienstplan",null,null,"Normalstunden",null,null,"Übertrag","Anmerkungen ",null,null,null,null,{"$f":"IF(ISNA(VLOOKUP($Q$3,MTab,2,FALSE)),1,VLOOKUP($Q$3,MTab,2,FALSE))","v":8},null,"Übertrags Adresse Blatteingabe"]
[" Datum","Wochentag","Tagesinformation",null,{"$f":"\"Wochen-AZ\"&\" \"&TEXT(WAZ,\"[hh]:mm\")","v":"Wochen-AZ 40:00"},null,null," Stunden 1:1",null,null,{"$f":"IF(ISNA($Q$5),Übertrag,INDIRECT($Q$5))","v":0},null,null,null,null,null,{"$f":"IF(ISNA(VLOOKUP($Q$3,MTab,3,FALSE)),\"Übertrag\",VLOOKUP($Q$3,MTab,3,FALSE))","v":"Juli!$J$42"},null,{"$f":"IF(ISNA(VLOOKUP($Q$3,MTab,4,FALSE)),$Q$3&\"!$R$2\",VLOOKUP($Q$3,MTab,4,FALSE))","v":"Juli!$S$3"}]
[null,null," Feiertage\n Wochenende\n Urlaub, ZA, Krank","[U]rlaub\n[Z]A\n[K]rank","Normal-","Soll","MP","Von","Bis","Plus","Saldo",null,null,null,null,null,"Hintergrundberechnungen",null,null,null,null,null,null,"Saldo aktuell",null,null,null,"GAZ-Tabellenabbildung",null,null,null,null,"Eingabebeprüfungen"]
[null,null,null,null,"Arbeitszeit",null,null,null,null,"Minus","akuell",null,null,null,null,null,"Datum","Monat OK","Abwesenh.","Freie Tage","ÜA-Tage","Std.","Soll-Std.",{"$f":"IF(ISNA($Q$5),Übertrag,INDIRECT($Q$5))","v":0},"Std.-Soll = 0","Std.-Soll > 0","Std.-Soll < 0",null,{"$f":"I_GAZNAZVon","v":2},3,{"$f":"I_GAZNAZBis","v":4},null,"Zeiteingabe","UZK-Eing.\nerlaubt","UZK-Eing.\ngültig","Normalst. ein erlaubt","Normalstd.\neingegeben","Normal VON möglich OG","Normal VON möglich UG","Normal BIS möglich OG","Normal BIS möglich UG","Normal VON\n15min","Normal VON richtig","Normal BIS\n15min","Normal BIS richtig","Status Zeilen Eingabe"]
[{"$f":"IF($R8,$Q8,\"\")","v":"2024-08-01"},{"$f":"IF($R8,VLOOKUP(WEEKDAY($Q8,2),WOTA,2,FALSE),\"\")","v":"Do"},{"$f":"IF($R8,\" \"&IF($S8=\"\",VLOOKUP($Q8,FListe,3,FALSE),$S8),\"\")","v":" "},null,{"$f":"IF(AND($R8,$T8<>\"F\"),IF($AC8=$AE8,\"keine NAZ\",TEXT($AC8,\"hh:mm\")&\"-\"&TEXT($AC8+$F8+$G8,\"hh:mm\")),\"\")","v":"08:00-16:00"},{"$f":"IF($R8,IF($T8=\"F\",0,VLOOKUP($B8,GAZ,I_GAZNAZMP,FALSE)),\"\")","v":"08:00:00"},{"$f":"IF($R8,$AD8,\"\")","v":"00:00:00"},null,null,{"$f":"IF(AND($R8,$AK8,NOT($Y8)),ROUND(($V8-$F8-$G8)*24,2),IF($D8=\"Z\",$F8*-24,\"\"))","v":""},{"$f":"$X8","v":0},null,null,null,null,null,{"$f":"DATE(Jahr,$Q2,1)","v":"2024-08-01"},{"$f":"$Q$2=MONTH($Q8)","v":true},{"$f":"IF(OR($D8=\"U\",$D8=\"Z\",$D8=\"ZK\",$D8=\"K\"),VLOOKUP($D8,UZK,2,FALSE),\"\")","v":""},{"$f":"IF($R8,VLOOKUP($Q8,FListe,4,FALSE),\"\")","v":"A"},{"$f":"IF($R8,VLOOKUP($Q8,FListe,5,FALSE),\"\")","v":"A"},{"$f":"$I8-$H8","v":0},{"$f":"IF($R8,ROUND($V8-$F8-$AD8,15),\"\")","v":-0.33333333333333298},{"$f":"IF($J8<>\"\",$X7+$J8,$X7)","v":0},{"$f":"($W8=0)","v":false},{"$f":"($W8>0)","v":false},{"$f":"($W8<0)","v":true},{"$f":"IF($U8=\"F\",\"\",TIME(0,0,0))","v":"00:00:00"},{"$f":"IF($U8=\"F\",\"\",IF(ISNA(VLOOKUP($B8,GAZ,AC$7,FALSE)),0,VLOOKUP($B8,GAZ,AC$7,FALSE)))","v":"08:00:00"},{"$f":"IF(OR($U8=\"F\",$S8<>\"\",ISNA(VLOOKUP($B8,GAZ,AD$7,FALSE))),0,IF(NOT($AK8),VLOOKUP($B8,GAZ,11,FALSE),IF(($I8-$H8)*24>=6,VLOOKUP($B8,GAZ,3,FALSE),0)))","v":"00:00:00"},{"$f":"IF($U8=\"F\",\"\",IF(ISNA(VLOOKUP($B8,GAZ,AE$7,FALSE)),0,VLOOKUP($B8,GAZ,AE$7,FALSE)))","v":"16:00:00"},{"$f":"IF($U8=\"F\",\"\",TIME(23,59,0))","v":"23:59:00"},{"$f":"OR($H8<>\"\",$I8<>\"\")","v":false},{"$f":"AND($T8<>\"F\",NOT($AG8),NOT($AC8=$AE8))","v":true},{"$f":"AND($AH8,OR($D8=\"U\",$D8=\"Z\",$D8=\"K\"))","v":false},{"$f":"AND($U8<>\"F\",$D8<>\"U\",$D8<>\"Z\",$D8<>\"K\",$R8)","v":true},{"$f":"AND($H8<>\"\",$I8<>\"\")","v":false},{"$f":"IF($AJ8,TagUG,\"\")","v":"00:00:00"},{"$f":"IF($AJ8,IF($I8=\"\",IF(AND($L8<>\"\",$L8<$AF8),$L8,IF(AND($M8<>\"\",$M8<$AF8),$M8,TagOG)),$I8),\"\")","v":"23:59:00"},{"$f":"IF($AJ8,IF($H8=\"\",$AB8,$H8),\"\")","v":"00:00:00"},{"$f":"IF($AJ8,IF(AND($L8<>\"\",$L8<$AF8),$L8,IF(AND($M8<>\"\",$M8<$AF8),$M8,TagOG)),\"\")","v":"23:59:00"},{"$f":"MOD($H8*24,0.25)=0","v":true},{"$f":"AND($AJ8,ISNUMBER($H8),$H8>=$AB8,$H8<=$AF8,OR($I8=\"\",$H8<=$I8))","v":false},{"$f":"MOD($I8*24,0.25)=0","v":true},{"$f":"AND($AJ8,ISNUMBER($I8),$I8>=$AB8,$I8<=$AF8,OR($H8=\"\",$I8>=$H8))","v":false},{"$f":"IF(AND(ISBLANK($D8),ISBLANK($H8),ISBLANK($I8)),0,1)","v":0}]
["2024-08-02","Fr"," ",null,{"$f":"IF(AND($R9,$T9<>\"F\"),IF($AC9=$AE9,\"keine NAZ\",TEXT($AC9,\"hh:mm\")&\"-\"&TEXT($AC9+$F9+$G9,\"hh:mm\")),\"\")","v":"08:00-16:00"},"08:00:00","00:00:00",null,null,"",0,null,null,null,null,null,{"$f":" Q8+1","v":"2024-08-02"},true,"","A","A",{"$f":"$I9-$H9","v":0},{"$f":"IF($R9,ROUND($V9-$F9-$AD9,15),\"\")","v":-0.33333333333333298},0,false,false,true,"00:00:00","08:00:00","00:00:00","16:00:00","23:59:00",false,true,false,true,false,"00:00:00","23:59:00",{"$f":"IF($AJ9,IF($H9=\"\",TagUG,$H9),\"\")","v":"00:00:00"},"23:59:00",true,false,true,false,0]
["2024-08-03","Sa"," Wochenende",null,"","00:00:00","00:00:00",null,null,"",0,null,null,null,null,null,"2024-08-03",true,"","F","A",0,0,0,true,false,false,"00:00:00","00:00:00","00:00:00","00:00:00","23:59:00",false,false,false,true,false,"00:00:00","23:59:00","00:00:00","23:59:00",true,false,true,false,0]
["2024-08-04","So"," Wochenende",null,"","00:00:00","00:00:00",null,null,"",0,null,null,null,null,null,"2024-08-04",true,"","F","F",0,0,0,true,false,false,"","","00:00:00","","",false,false,false,false,false,"","","","",true,false,true,false,0]
["2024-08-05","Mo"," ",null,"08:00-16:00","08:00:00","00:00:00",null,null,"",0,null,null,null,null,null,"2024-08-05",true,"","A","A",0,-0.33333333333333298,0,false,false,true,"00:00:00","08:00:00","00:00:00","16:00:00","23:59:00",false,true,false,true,false,"00:00:00","23:59:00","00:00:00","23:59:00",true,false,true,false,0]
["2024-08-06","Di"," ",null,"08:00-16:00","08:00:00","00:00:00",null,null,"",0,null,null,null,null,null,"2024-08-06",true,"","A","A",0,-0.33333333333333298,0,false,false,true,"00:00:00","08:00:00","00:00:00","16:00:00","23:59:00",false,true,false,true,false,"00:00:00","23:59:00","00:00:00","23:59:00",true,false,true,false,0]
["2024-08-07","Mi"," ",null,"08:00-16:00","08:00:00","00:00:00",null,null,"",0,null,null,null,null,null,"2024-08-07",true,"","A","A",0,-0.33333333333333298,0,false,false,true,"00:00:00","08:00:00","00:00:00","16:00:00","23:59:00",false,true,false,true,false,"00:00:00","23:59:00","00:00:00","23:59:00",true,false,true,false,0]
["2024-08-08","Do"," ",null,"08:00-16:00","08:00:00","00:00:00",null,null,"",0,null,null,null,null,null,"2024-08-08",true,"","A","A",0,-0.33333333333333298,0,false,false,true,"00:00:00","08:00:00","00:00:00","16:00:00","23:59:00",false,true,false,true,false,"00:00:00","23:59:00","00:00:00","23:59:00",true,false,true,false,0]
["2024-08-09","Fr"," ",null,"08:00-16:00","08:00:00","00:00:00",null,null,"",0,null,null,null,null,null,"2024-08-09",true,"","A","A",0,-0.33333333333333298,0,false,false,true,"00:00:00","08:00:00","00:00:00","16:00:00","23:59:00",false,true,false,true,false,"00:00:00","23:59:00","00:00:00","23:59:00",true,false,true,false,0]
["2024-08-10","Sa"," Wochenende",null,"","00:00:00","00:00:00",null,null,"",0,null,null,null,null,null,"2024-08-10",true,"","F","A",0,0,0,true,false,false,"00:00:00","00:00:00","00:00:00","00:00:00","23:59:00",false,false,false,true,false,"00:00:00","23:59:00","00:00:00","23:59:00",true,false,true,false,0]
["2024-08-11","So"," Wochenende",null,"","00:00:00","00:00:00",null,null,"",0,null,null,null,null,null,"2024-08-11",true,"","F","F",0,0,0,true,false,false,"","","00:00:00","","",false,false,false,false,false,"","","","",true,false,true,false,0]
["2024-08-12","Mo"," ",null,"08:00-16:00","08:00:00","00:00:00",null,null,"",0,null,null,null,null,null,"2024-08-12",true,"","A","A",0,-0.33333333333333298,0,false,false,true,"00:00:00","08:00:00","00:00:00","16:00:00","23:59:00",false,true,false,true,false,"00:00:00","23:59:00","00:00:00","23:59:00",true,false,true,false,0]
["2024-08-13","Di"," ",null,"08:00-16:00","08:00:00","00:00:00",null,null,"",0,null,null,null,null,null,"2024-08-13",true,"","A","A",0,-0.33333333333333298,0,false,false,true,"00:00:00","08:00:00","00:00:00","16:00:00","23:59:00",false,true,false,true,false,"00:00:00","23:59:00","00:00:00","23:59:00",true,false,true,false,0]
["2024-08-14","Mi"," ",null,"08:00-16:00","08:00:00","00:00:00",null,null,"",0,null,null,null,null,null,"2024-08-14",true,"","A","A",0,-0.33333333333333298,0,false,false,true,"00:00:00","08:00:00","00:00:00","16:00:00","23:59:00",false,true,false,true,false,"00:00:00","23:59:00","00:00:00","23:59:00",true,false,true,false,0]
["2024-08-15","Do"," Maria Himmelfahrt",null,"","00:00:00","00:00:00",null,null,"",0,null,null,null,null,null,"2024-08-15",true,"","F","F",0,0,0,true,false,false,"","","00:00:00","","",false,false,false,false,false,"","","","",true,false,true,false,0]
["2024-08-16","Fr"," ",null,"08:00-16:00","08:00:00","00:00:00",null,null,"",0,null,null,null,null,null,"2024-08-16",true,"","A","A",0,-0.33333333333333298,0,false,false,true,"00:00:00","08:00:00","00:00:00","16:00:00","23:59:00",false,true,false,true,false,"00:00:00","23:59:00","00:00:00","23:59:00",true,false,true,false,0]
["2024-08-17","Sa"," Wochenende",null,"","00:00:00","00:00:00",null,null,"",0,null,null,null,null,null,"2024-08-17",true,"","F","A",0,0,0,true,false,false,"00:00:00","00:00:00","00:00:00","00:00:00","23:59:00",false,false,false,true,false,"00:00:00","23:59:00","00:00:00","23:59:00",true,false,true,false,0]
["2024-08-18","So"," Wochenende",null,"","00:00:00","00:00:00",null,null,"",0,null,null,null,null,null,"2024-08-18",true,"","F","F",0,0,0,true,false,false,"","","00:00:00","","",false,false,false,false,false,"","","","",true,false,true,false,0]
["2024-08-19","Mo"," ",null,"08:00-16:00","08:00:00","00:00:00",null,null,"",0,null,null,null,null,null,"2024-08-19",true,"","A","A",0,-0.33333333333333298,0,false,false,true,"00:00:00","08:00:00","00:00:00","16:00:00","23:59:00",false,true,false,true,false,"00:00:00","23:59:00","00:00:00","23:59:00",true,false,true,false,0]
["2024-08-20","Di"," ",null,"08:00-16:00","08:00:00","00:00:00",null,null,"",0,null,null,null,null,null,"2024-08-20",true,"","A","A",0,-0.33333333333333298,0,false,false,true,"00:00:00","08:00:00","00:00:00","16:00:00","23:59:00",false,true,false,true,false,"00:00:00","23:59:00","00:00:00","23:59:00",true,false,true,false,0]
["2024-08-21","Mi"," ",null,"08:00-16:00","08:00:00","00:00:00",null,null,"",0,null,null,null,null,null,"2024-08-21",true,"","A","A",0,-0.33333333333333298,0,false,false,true,"00:00:00","08:00:00","00:00:00","16:00:00","23:59:00",false,true,false,true,false,"00:00:00","23:59:00","00:00:00","23:59:00",true,false,true,false,0]
["2024-08-22","Do"," ",null,"08:00-16:00","08:00:00","00:00:00",null,null,"",0,null,null,null,null,null,"2024-08-22",true,"","A","A",0,-0.33333333333333298,0,false,false,true,"00:00:00","08:00:00","00:00:00","16:00:00","23:59:00",false,true,false,true,false,"00:00:00","23:59:00","00:00:00","23:59:00",true,false,true,false,0]
["2024-08-23","Fr"," ",null,"08:00-16:00","08:00:00","00:00:00",null,null,"",0,null,null,null,null,null,"2024-08-23",true,"","A","A",0,-0.33333333333333298,0,false,false,true,"00:00:00","08:00:00","00:00:00","16:00:00","23:59:00",false,true,false,true,false,"00:00:00","23:59:00","00:00:00","23:59:00",true,false,true,false,0]
["2024-08-24","Sa"," Wochenende",null,"","00:00:00","00:00:00",null,null,"",0,null,null,null,null,null,"2024-08-24",true,"","F","A",0,0,0,true,false,false,"00:00:00","00:00:00","00:00:00","00:00:00","23:59:00",false,false,false,true,false,"00:00:00","23:59:00","00:00:00","23:59:00",true,false,true,false,0]
["2024-08-25","So"," Wochenende",null,"","00:00:00","00:00:00",null,null,"",0,null,null,null,null,null,"2024-08-25",true,"","F","F",0,0,0,true,false,false,"","","00:00:00","","",false,false,false,false,false,"","","","",true,false,true,false,0]
["2024-08-26","Mo"," ",null,"08:00-16:00","08:00:00","00:00:00",null,null,"",0,null,null,null,null,null,"2024-08-26",true,"","A","A",0,-0.33333333333333298,0,false,false,true,"00:00:00","08:00:00","00:00:00","16:00:00","23:59:00",false,true,false,true,false,"00:00:00","23:59:00","00:00:00","23:59:00",true,false,true,false,0]
["2024-08-27","Di"," ",null,"08:00-16:00","08:00:00","00:00:00",null,null,"",0,null,null,null,null,null,"2024-08-27",true,"","A","A",0,-0.33333333333333298,0,false,false,true,"00:00:00","08:00:00","00:00:00","16:00:00","23:59:00",false,true,false,true,false,"00:00:00","23:59:00","00:00:00","23:59:00",true,false,true,false,0]
["2024-08-28","Mi"," ",null,"08:00-16:00","08:00:00","00:00:00",null,null,"",0,null,null,null,null,null,"2024-08-28",true,"","A","A",0,-0.33333333333333298,0,false,false,true,"00:00:00","08:00:00","00:00:00","16:00:00","23:59:00",false,true,false,true,false,"00:00:00","23:59:00","00:00:00","23:59:00",true,false,true,false,0]
["2024-08-29","Do"," ",null,"08:00-16:00","08:00:00","00:00:00",null,null,"",0,null,null,null,null,null,"2024-08-29",true,"","A","A",0,-0.33333333333333298,0,false,false,true,"00:00:00","08:00:00","00:00:00","16:00:00","23:59:00",false,true,false,true,false,"00:00:00","23:59:00","00:00:00","23:59:00",true,false,true,false,0]
["2024-08-30","Fr"," ",null,"08:00-16:00","08:00:00","00:00:00",null,null,"",0,null,null,null,null,null,"2024-08-30",true,"","A","A",0,-0.33333333333333298,0,false,false,true,"00:00:00","08:00:00","00:00:00","16:00:00","23:59:00",false,true,false,true,false,"00:00:00","23:59:00","00:00:00","23:59:00",true,false,true,false,0]
["2024-08-31","Sa"," Wochenende",null,"","00:00:00","00:00:00",null,null,"",0,null,null,null,null,null,"2024-08-31",true,"","F","A",0,0,0,true,false,false,"00:00:00","00:00:00","00:00:00","00:00:00","23:59:00",false,false,false,true,false,"00:00:00","23:59:00","00:00:00","23:59:00",true,false,true,false,0]
["Arbeitstage",{"$f":"COUNTIF(T$8:T$38,\"A\")","v":21},null,null,{"$f":"\"Monat Std.-Saldo (~15min) > \"","v":"Monat Std.-Saldo (~15min) > "},null,null,null,null,{"$f":"ROUND(SUM(J8:J38)*4,0)/4","v":0}]
["ZA-Tage",{"$f":"COUNTIF(D$8:D$38,\"Z\")","v":0},null,null," Vormonat Std.Saldo > ",null,null,null,null,{"$f":"$K5","v":0},null,null,null,null,null,null,"Gültigkeit ausbezahlt"]
["Urlaubstage",{"$f":"COUNTIF(D$8:D$38,\"U\")","v":0},null,null," Gesamt Std. Saldo > ",null,null,null,null,{"$f":"$J39+$J40","v":0},null,null,null,null,null,null,{"$f":"AND($K$41>=0,$K$41<=$J$41,MOD($K$41,0.25)=0)","v":true}]
["Krank",{"$f":"COUNTIF(D$8:D$38,\"K\")","v":0},null,null," Übertrag Std. Saldo > ",null,null,null,null,{"$f":"$J41","v":0},{"$f":"\" < Dieser Stunden-Saldo wird in das nächste \"&IF($Q$3=\"Dezember\",\"Jahr\",\"Monat\")&\" übertragen\"","v":" < Dieser Stunden-Saldo wird in das nächste Monat übertragen"}]
[null,null,null,"Z"]
[]
[{"$f":"\"Unterschrift von \"&Vorgesetzter","v":"Unterschrift von Vorname Nachname"},null,null,null,null,null,null,null,null,null,null,null,{"$f":"\"Unterschrift von \"&Name","v":"Unterschrift von Vorname Nachname"}]

{"sheet":"September","index":9,"n_rows":45,"n_cols":46,"rows_kept":45,"cut":false,"hidden":true,"merged":[[42,4,42,8],[43,4,43,8],[44,0,44,3],[44,12,44,15],[36,11,36,15],[37,11,37,15],[38,2,41,3],[38,4,38,8],[38,10,40,15],[39,4,39,8],[40,4,40,8],[41,4,41,8],[41,10,41,15],[30,11,30,15],[31,11,31,15],[32,11,32,15],[33,11,33,15],[34,11,34,15],[35,11,35,15],[24,11,24,15],[25,11,25,15],[26,11,26,15],[27,11,27,15],[28,11,28,15],[29,11,29,15],[18,11,18,15],[19,11,19,15],[20,11,20,15],[21,11,21,15],[22,11,22,15],[23,11,23,15],[12,11,12,15],[13,11,13,15],[14,11,14,15],[15,11,15,15],[16,11,16,15],[17,11,17,15],[5,27,5,31],[7,11,7,15],[8,11,8,15],[9,11,9,15],[10,11,10,15],[11,11,11,15],[4,4,4,6],[4,7,4,9],[5,2,6,2],[5,3,6,3],[5,5,6,5],[5,6,6,6],[5,7,6,7],[5,8,6,8],[0,15,1,15],[1,5,1,8],[2,5,2,8],[3,0,3,3],[3,4,3,6],[3,7,3,9],[3,11,6,15],[4,0,6,0],[4,1,6,1],[4,2,4,3]]}
[{"$f":"Konfig!$A$1","v":" BOKU-Zeiterfassung für Wissenschaftliches Personal"},null,null,null,null,null,null,null,null,null,null,null,null,null,null,null,"Monat","Stunden-Saldo Grenzen","Status Blatteingabe"]
[{"$f":"\" Org.-Einh. : \"&OrgEinheit","v":" Org.-Einh. : Hxxxxx"},null,null,null,null,"Zeitmodell:",null,null,null,{"$f":"\" \"&Zeitmodell","v":" Vollzeit"},null,null,null,null,null,null,{"$f":"IF(ISNA($Q$4),1,$Q$4)","v":9},0,{"$f":"SUM($AT8:$AT38)","v":0}]
[{"$f":" \" Mitarbeiter: \"&Name","v":" Mitarbeiter: Vorname Nachname"},null,null,null,null,"Vorgesetzter:",null,null,null,{"$f":"\" \"&Vorgesetzter","v":" Vorname Nachname"},null,null,null,null,null,null,{"$f":"RIGHT(CELL(\"filename\",A1),LEN(CELL(\"filename\",A1))-SEARCH(\"]\",CELL(\"filename\",A1),1))","v":"September"},null,{"$f":"IF($Q$2=1,$S$2,$S$2+INDIRECT($S$5))","v":0}]
[{"$f":" \" Monat: \"&$Q$3&\" \"&Jahr","v":" Monat: September 2024"},null,null,null,"Dienstplan",null,null,"Normalstunden",null,null,"Übertrag","Anmerkungen ",null,null,null,null,{"$f":"IF(ISNA(VLOOKUP($Q$3,MTab,2,FALSE)),1,VLOOKUP($Q$3,MTab,2,FALSE))","v":9},null,"Übertrags Adresse Blatteingabe"]
[" Datum","Wochentag","Tagesinformation",null,{"$f":"\"Wochen-AZ\"&\" \"&TEXT(WAZ,\"[hh]:mm\")","v":"Wochen-AZ 40:00"},null,null," Stunden 1:1",null,null,{"$f":"IF(ISNA($Q$5),Übertrag,INDIRECT($Q$5))","v":0},null,null,null,null,null,{"$f":"IF(ISNA(VLOOKUP($Q$3,MTab,3,FALSE)),\"Übertrag\",VLOOKUP($Q$3,MTab,3,FALSE))","v":"August!$J$42"},null,{"$f":"IF(ISNA(VLOOKUP($Q$3,MTab,4,FALSE)),$Q$3&\"!$R$2\",VLOOKUP($Q$3,MTab,4,FALSE))","v":"August!$S$3"}]
[null,null," Feiertage\n Wochenende\n Urlaub, ZA, Krank","[U]rlaub\n[Z]A\n[K]rank","Normal-","Soll","MP","Von","Bis","Plus","Saldo",null,null,null,null,null,"Hintergrundberechnungen",null,null,null,null,null,null,"Saldo aktuell",null,null,null,"GAZ-Tabellenabbildung",null,null,null,null,"Eingabebeprüfungen"]
[null,null,null,null,"Arbeitszeit",null,null,null,null,"Minus","akuell",null,null,null,null,null,"Datum","Monat OK","Abwesenh.","Freie Tage","ÜA-Tage","Std.","Soll-Std.",{"$f":"IF(ISNA($Q$5),Übertrag,INDIRECT($Q$5))","v":0},"Std.-Soll = 0","Std.-Soll > 0","Std.-Soll < 0",null,{"$f":"I_GAZNAZVon","v":2},3,{"$f":"I_GAZNAZBis","v":4},null,"Zeiteingabe","UZK-Eing.\nerlaubt","UZK-Eing.\ngültig","Normalst. ein erlaubt","Normalstd.\neingegeben","Normal VON möglich OG","Normal VON möglich UG","Normal BIS möglich OG","Normal BIS möglich UG","Normal VON\n15min","Normal VON richtig","Normal BIS\n15min","Normal BIS richtig","Status Zeilen Eingabe"]
[{"$f":"IF($R8,$Q8,\"\")","v":"2024-09-01"},{"$f":"IF($R8,VLOOKUP(WEEKDAY($Q8,2),WOTA,2,FALSE),\"\")","v":"So"},{"$f":"IF($R8,\" \"&IF($S8=\"\",VLOOKUP($Q8,FListe,3,FALSE),$S8),\"\")","v":" Wochenende"},null,{"$f":"IF(AND($R8,$T8<>\"F\"),IF($AC8=$AE8,\"keine NAZ\",TEXT($AC8,\"hh:mm\")&\"-\"&TEXT($AC8+$F8+$G8,\"hh:mm\")),\"\")","v":""},{"$f":"IF($R8,IF($T8=\"F\",0,VLOOKUP($B8,GAZ,I_GAZNAZMP,FALSE)),\"\")","v":"00:00:00"},{"$f":"IF($R8,$AD8,\"\")","v":"00:00:00"},null,null,{"$f":"IF(AND($R8,$AK8,NOT($Y8)),ROUND(($V8-$F8-$G8)*24,2),IF($D8=\"Z\",$F8*-24,\"\"))","v":""},{"$f":"$X8","v":0},null,null,null,null,null,{"$f":"DATE(Jahr,$Q2,1)","v":"2024-09-01"},{"$f":"$Q$2=MONTH($Q8)","v":true},{"$f":"IF(OR($D8=\"U\",$D8=\"Z\",$D8=\"ZK\",$D8=\"K\"),VLOOKUP($D8,UZK,2,FALSE),\"\")","v":""},{"$f":"IF($R8,VLOOKUP($Q8,FListe,4,FALSE),\"\")","v":"F"},{"$f":"IF($R8,VLOOKUP($Q8,FListe,5,FALSE),\"\")","v":"F"},{"$f":"$I8-$H8","v":0},{"$f":"IF($R8,ROUND($V8-$F8-$AD8,15),\"\")","v":0},{"$f":"IF($J8<>\"\",$X7+$J8,$X7)","v":0},{"$f":"($W8=0)","v":true},{"$f":"($W8>0)","v":false},{"$f":"($W8<0)","v":false},{"$f":"IF($U8=\"F\",\"\",TIME(0,0,0))","v":""},{"$f":"IF($U8=\"F\",\"\",IF(ISNA(VLOOKUP($B8,GAZ,AC$7,FALSE)),0,VLOOKUP($B8,GAZ,AC$7,FALSE)))","v":""},{"$f":"IF(OR($U8=\"F\",$S8<>\"\",ISNA(VLOOKUP($B8,GAZ,AD$7,FALSE))),0,IF(NOT($AK8),VLOOKUP($B8,GAZ,11,FALSE),IF(($I8-$H8)*24>=6,VLOOKUP($B8,GAZ,3,FALSE),0)))","v":"00:00:00"},{"$f":"IF($U8=\"F\",\"\",IF(ISNA(VLOOKUP($B8,GAZ,AE$7,FALSE)),0,VLOOKUP($B8,GAZ,AE$7,FALSE)))","v":""},{"$f":"IF($U8=\"F\",\"\",TIME(23,59,0))","v":""},{"$f":"OR($H8<>\"\",$I8<>\"\")","v":false},{"$f":"AND($T8<>\"F\",NOT($AG8),NOT($AC8=$AE8))","v":false},{"$f":"AND($AH8,OR($D8=\"U\",$D8=\"Z\",$D8=\"K\"))","v":false},{"$f":"AND($U8<>\"F\",$D8<>\"U\",$D8<>\"Z\",$D8<>\"K\",$R8)","v":false},{"$f":"AND($H8<>\"\",$I8<>\"\")","v":false},{"$f":"IF($AJ8,TagUG,\"\")","v":""},{"$f":"IF($AJ8,IF($I8=\"\",IF(AND($L8<>\"\",$L8<$AF8),$L8,IF(AND($M8<>\"\",$M8<$AF8),$M8,TagOG)),$I8),\"\")","v":""},{"$f":"IF($AJ8,IF($H8=\"\",$AB8,$H8),\"\")","v":""},{"$f":"IF($AJ8,IF(AND($L8<>\"\",$L8<$AF8),$L8,IF(AND($M8<>\"\",$M8<$AF8),$M8,TagOG)),\"\")","v":""},{"$f":"MOD($H8*24,0.25)=0","v":true},{"$f":"AND($AJ8,ISNUMBER($H8),$H8>=$AB8,$H8<=$AF8,OR($I8=\"\",$H8<=$I8))","v":false},{"$f":"MOD($I8*24,0.25)=0","v":true},{"$f":"AND($AJ8,ISNUMBER($I8),$I8>=$AB8,$I8<=$AF8,OR($H8=\"\",$I8>=$H8))","v":false},{"$f":"IF(AND(ISBLANK($D8),ISBLANK($H8),ISBLANK($I8)),0,1)","v":0}]
["2024-09-02","Mo"," ",null,{"$f":"IF(AND($R9,$T9<>\"F\"),IF($AC9=$AE9,\"keine NAZ\",TEXT($AC9,\"hh:mm\")&\"-\"&TEXT($AC9+$F9+$G9,\"hh:mm\")),\"\")","v":"08:00-16:00"},"08:00:00","00:00:00",null,null,"",0,null,null,null,null,null,{"$f":" Q8+1","v":"2024-09-02"},true,"","A","A",{"$f":"$I9-$H9","v":0},{"$f":"IF($R9,ROUND($V9-$F9-$AD9,15),\"\")","v":-0.33333333333333298},0,false,false,true,"00:00:00","08:00:00","00:00:00","16:00:00","23:59:00",false,true,false,true,false,"00:00:00","23:59:00",{"$f":"IF($AJ9,IF($H9=\"\",TagUG,$H9),\"\")","v":"00:00:00"},"23:59:00",true,false,true,false,0]
["2024-09-03","Di"," ",null,"08:00-16:00","08:00:00","00:00:00",null,null,"",0,null,null,null,null,null,"2024-09-03",true,"","A","A",0,-0.33333333333333298,0,false,false,true,"00:00:00","08:00:00","00:00:00","16:00:00","23:59:00",false,true,false,true,false,"00:00:00","23:59:00","00:00:00","23:59:00",true,false,true,false,0]
["2024-09-04","Mi"," ",null,"08:00-16:00","08:00:00","00:00:00",null,null,"",0,null,null,null,null,null,"2024-09-04",true,"","A","A",0,-0.33333333333333298,0,false,false,true,"00:00:00","08:00:00","00:00:00","16:00:00","23:59:00",false,true,false,true,false,"00:00:00","23:59:00","00:00:00","23:59:00",true,false,true,false,0]
["2024-09-05","Do"," ",null,"08:00-16:00","08:00:00","00:00:00",null,null,"",0,null,null,null,null,null,"2024-09-05",true,"","A","A",0,-0.33333333333333298,0,false,false,true,"00:00:00","08:00:00","00:00:00","16:00:00","23:59:00",false,true,false,true,false,"00:00:00","23:59:00","00:00:00","23:59:00",true,false,true,false,0]
["2024-09-06","Fr"," ",null,"08:00-16:00","08:00:00","00:00:00",null,null,"",0,null,null,null,null,null,"2024-09-06",true,"","A","A",0,-0.33333333333333298,0,false,false,true,"00:00:00","08:00:00","00:00:00","16:00:00","23:59:00",false,true,false,true,false,"00:00:00","23:59:00","00:00:00","23:59:00",true,false,true,false,0]
["2024-09-07","Sa"," Wochenende",null,"","00:00:00","00:00:00",null,null,"",0,null,null,null,null,null,"2024-09-07",true,"","F","A",0,0,0,true,false,false,"00:00:00","00:00:00","00:00:00","00:00:00","23:59:00",false,false,false,true,false,"00:00:00","23:59:00","00:00:00","23:59:00",true,false,true,false,0]
["2024-09-08","So"," Wochenende",null,"","00:00:00","00:00:00",null,null,"",0,null,null,null,null,null,"2024-09-08",true,"","F","F",0,0,0,true,false,false,"","","00:00:00","","",false,false,false,false,false,"","","","",true,false,true,false,0]
["2024-09-09","Mo"," ",null,"08:00-16:00","08:00:00","00:00:00",null,null,"",0,null,null,null,null,null,"2024-09-09",true,"","A","A",0,-0.33333333333333298,0,false,false,true,"00:00:00","08:00:00","00:00:00","16:00:00","23:59:00",false,true,false,true,false,"00:00:00","23:59:00","00:00:00","23:59:00",true,false,true,false,0]
["2024-09-10","Di"," ",null,"08:00-16:00","08:00:00","00:00:00",null,null,"",0,null,null,null,null,null,"2024-09-10",true,"","A","A",0,-0.33333333333333298,0,false,false,true,"00:00:00","08:00:00","00:00:00","16:00:00","23:59:00",false,true,false,true,false,"00:00:00","23:59:00","00:00:00","23:59:00",true,false,true,false,0]
["2024-09-11","Mi"," ",null,"08:00-16:00","08:00:00","00:00:00",null,null,"",0,null,null,null,null,null,"2024-09-11",true,"","A","A",0,-0.33333333333333298,0,false,false,true,"00:00:00","08:00:00","00:00:00","16:00:00","23:59:00",false,true,false,true,false,"00:00:00","23:59:00","00:00:00","23:59:00",true,false,true,false,0]
["2024-09-12","Do"," ",null,"08:00-16:00","08:00:00","00:00:00",null,null,"",0,null,null,null,null,null,"2024-09-12",true,"","A","A",0,-0.33333333333333298,0,false,false,true,"00:00:00","08:00:00","00:00:00","16:00:00","23:59:00",false,true,false,true,false,"00:00:00","23:59:00","00:00:00","23:59:00",true,false,true,false,0]
["2024-09-13","Fr"," ",null,"08:00-16:00","08:00:00","00:00:00",null,null,"",0,null,null,null,null,null,"2024-09-13",true,"","A","A",0,-0.33333333333333298,0,false,false,true,"00:00:00","08:00:00","00:00:00","16:00:00","23:59:00",false,true,false,true,false,"00:00:00","23:59:00","00:00:00","23:59:00",true,false,true,false,0]
["2024-09-14","Sa"," Wochenende",null,"","00:00:00","00:00:00",null,null,"",0,null,null,null,null,null,"2024-09-14",true,"","F","A",0,0,0,true,false,false,"00:00:00","00:00:00","00:00:00","00:00:00","23:59:00",false,false,false,true,false,"00:00:00","23:59:00","00:00:00","23:59:00",true,false,true,false,0]
["2024-09-15","So"," Wochenende",null,"","00:00:00","00:00:00",null,null,"",0,null,null,null,null,null,"2024-09-15",true,"","F","F",0,0,0,true,false,false,"","","00:00:00","","",false,false,false,false,false,"","","","",true,false,true,false,0]
["2024-09-16","Mo"," ",null,"08:00-16:00","08:00:00","00:00:00",null,null,"",0,null,null,null,null,null,"2024-09-16",true,"","A","A",0,-0.33333333333333298,0,false,false,true,"00:00:00","08:00:00","00:00:00","16:00:00","23:59:00",false,true,false,true,false,"00:00:00","23:59:00","00:00:00","23:59:00",true,false,true,false,0]
["2024-09-17","Di"," ",null,"08:00-16:00","08:00:00","00:00:00",null,null,"",0,null,null,null,null,null,"2024-09-17",true,"","A","A",0,-0.33333333333333298,0,false,false,true,"00:00:00","08:00:00","00:00:00","16:00:00","23:59:00",false,true,false,true,false,"00:00:00","23:59:00","00:00:00","23:59:00",true,false,true,false,0]
["2024-09-18","Mi"," ",null,"08:00-16:00","08:00:00","00:00:00",null,null,"",0,null,null,null,null,null,"2024-09-18",true,"","A","A",0,-0.33333333333333298,0,false,false,true,"00:00:00","08:00:00","00:00:00","16:00:00","23:59:00",false,true,false,true,false,"00:00:00","23:59:00","00:00:00","23:59:00",true,false,true,false,0]
["2024-09-19","Do"," ",null,"08:00-16:00","08:00:00","00:00:00",null,null,"",0,null,null,null,null,null,"2024-09-19",true,"","A","A",0,-0.33333333333333298,0,false,false,true,"00:00:00","08:00:00","00:00:00","16:00:00","23:59:00",false,true,false,true,false,"00:00:00","23:59:00","00:00:00","23:59:00",true,false,true,false,0]
["2024-09-20","Fr"," ",null,"08:00-16:00","08:00:00","00:00:00",null,null,"",0,null,null,null,null,null,"2024-09-20",true,"","A","A",0,-0.33333333333333298,0,false,false,true,"00:00:00","08:00:00","00:00:00","16:00:00","23:59:00",false,true,false,true,false,"00:00:00","23:59:00","00:00:00","23:59:00",true,false,true,false,0]
["2024-09-21","Sa"," Wochenende",null,"","00:00:00","00:00:00",null,null,"",0,null,null,null,null,null,"2024-09-21",true,"","F","A",0,0,0,true,false,false,"00:00:00","00:00:00","00:00:00","00:00:00","23:59:00",false,false,false,true,false,"00:00:00","23:59:00","00:00:00","23:59:00",true,false,true,false,0]
["2024-09-22","So"," Wochenende",null,"","00:00:00","00:00:00",null,null,"",0,null,null,null,null,null,"2024-09-22",true,"","F","F",0,0,0,true,false,false,"","","00:00:00","","",false,false,false,false,false,"","","","",true,false,true,false,0]
["2024-09-23","Mo"," ",null,"08:00-16:00","08:00:00","00:00:00",null,null,"",0,null,null,null,null,null,"2024-09-23",true,"","A","A",0,-0.33333333333333298,0,false,false,true,"00:00:00","08:00:00","00:00:00","16:00:00","23:59:00",false,true,false,true,false,"00:00:00","23:59:00","00:00:00","23:59:00",true,false,true,false,0]
["2024-09-24","Di"," ",null,"08:00-16:00","08:00:00","00:00:00",null,null,"",0,null,null,null,null,null,"2024-09-24",true,"","A","A",0,-0.33333333333333298,0,false,false,true,"00:00:00","08:00:00","00:00:00","16:00:00","23:59:00",false,true,false,true,false,"00:00:00","23:59:00","00:00:00","23:59:00",true,false,true,false,0]
["2024-09-25","Mi"," ",null,"08:00-16:00","08:00:00","00:00:00",null,null,"",0,null,null,null,null,null,"2024-09-25",true,"","A","A",0,-0.33333333333333298,0,false,false,true,"00:00:00","08:00:00","00:00:00","16:00:00","23:59:00",false,true,false,true,false,"00:00:00","23:59:00","00:00:00","23:59:00",true,false,true,false,0]
["2024-09-26","Do"," ",null,"08:00-16:00","08:00:00","00:00:00",null,null,"",0,null,null,null,null,null,"2024-09-26",true,"","A","A",0,-0.33333333333333298,0,false,false,true,"00:00:00","08:00:00","00:00:00","16:00:00","23:59:00",false,true,false,true,false,"00:00:00","23:59:00","00:00:00","23:59:00",true,false,true,false,0]
["2024-09-27","Fr"," ",null,"08:00-16:00","08:00:00","00:00:00",null,null,"",0,null,null,null,null,null,"2024-09-27",true,"","A","A",0,-0.33333333333333298,0,false,false,true,"00:00:00","08:00:00","00:00:00","16:00:00","23:59:00",false,true,false,true,false,"00:00:00","23:59:00","00:00:00","23:59:00",true,false,true,false,0]
["2024-09-28","Sa"," Wochenende",null,"","00:00:00","00:00:00",null,null,"",0,null,null,null,null,null,"2024-09-28",true,"","F","A",0,0,0,true,false,false,"00:00:00","00:00:00","00:00:00","00:00:00","23:59:00",false,false,false,true,false,"00:00:00","23:59:00","00:00:00","23:59:00",true,false,true,false,0]
["2024-09-29","So"," Wochenende",null,"","00:00:00","00:00:00",null,null,"",0,null,null,null,null,null,"2024-09-29",true,"","F","F",0,0,0,true,false,false,"","","00:00:00","","",false,false,false,false,false,"","","","",true,false,true,false,0]
["2024-09-30","Mo"," ",null,"08:00-16:00","08:00:00","00:00:00",null,null,"",0,null,null,null,null,null,"2024-09-30",true,"","A","A",0,-0.33333333333333298,0,false,false,true,"00:00:00","08:00:00","00:00:00","16:00:00","23:59:00",false,true,false,true,false,"00:00:00","23:59:00","00:00:00","23:59:00",true,false,true,false,0]
["","","",null,"","","",null,null,"",0,null,null,null,null,null,"2024-10-01",false,"","","",0,"",0,false,true,false,"00:00:00","00:00:00","00:00:00","00:00:00","23:59:00",false,false,false,false,false,"","","","",true,false,true,false,0]
["Arbeitstage",{"$f":"COUNTIF(T$8:T$38,\"A\")","v":21},null,null,{"$f":"\"Monat Std.-Saldo (~15min) > \"","v":"Monat Std.-Saldo (~15min) > "},null,null,null,null,{"$f":"ROUND(SUM(J8:J38)*4,0)/4","v":0}]
["ZA-Tage",{"$f":"COUNTIF(D$8:D$38,\"Z\")","v":0},null,null," Vormonat Std.Saldo > ",null,null,null,null,{"$f":"$K5","v":0},null,null,null,null,null,null,"Gültigkeit ausbezahlt"]
["Urlaubstage",{"$f":"COUNTIF(D$8:D$38,\"U\")","v":0},null,null," Gesamt Std. Saldo > ",null,null,null,null,{"$f":"$J39+$J40","v":0},null,null,null,null,null,null,{"$f":"AND($K$41>=0,$K$41<=$J$41,MOD($K$41,0.25)=0)","v":true}]
["Krank",{"$f":"COUNTIF(D$8:D$38,\"K\")","v":0},null,null," Übertrag Std. Saldo > ",null,null,null,null,{"$f":"$J41","v":0},{"$f":"\" < Dieser Stunden-Saldo wird in das nächste \"&IF($Q$3=\"Dezember\",\"Jahr\",\"Monat\")&\" übertragen\"","v":" < Dieser Stunden-Saldo wird in das nächste Monat übertragen"}]
[null,null,null,"Z"]
[]
[{"$f":"\"Unterschrift von \"&Vorgesetzter","v":"Unterschrift von Vorname Nachname"},null,null,null,null,null,null,null,null,null,null,null,{"$f":"\"Unterschrift von \"&Name","v":"Unterschrift von Vorname Nachname"}]

{"sheet":"Oktober","index":10,"n_rows":45,"n_cols":46,"rows_kept":45,"cut":false,"hidden":true,"merged":[[42,4,42,8],[43,4,43,8],[44,0,44,3],[44,12,44,15],[36,11,36,15],[37,11,37,15],[38,2,41,3],[38,4,38,8],[38,10,40,15],[39,4,39,8],[40,4,40,8],[41,4,41,8],[41,10,41,15],[30,11,30,15],[31,11,31,15],[32,11,32,15],[33,11,33,15],[34,11,34,15],[35,11,35,15],[24,11,24,15],[25,11,25,15],[26,11,26,15],[27,11,27,15],[28,11,28,15],[29,11,29,15],[18,11,18,15],[19,11,19,15],[20,11,20,15],[21,11,21,15],[22,11,22,15],[23,11,23,15],[12,11,12,15],[13,11,13,15],[14,11,14,15],[15,11,15,15],[16,11,16,15],[17,11,17,15],[5,27,5,31],[7,11,7,15],[8,11,8,15],[9,11,9,15],[10,11,10,15],[11,11,11,15],[4,4,4,6],[4,7,4,9],[5,2,6,2],[5,3,6,3],[5,5,6,5],[5,6,6,6],[5,7,6,7],[5,8,6,8],[0,15,1,15],[1,5,1,8],[2,5,2,8],[3,0,3,3],[3,4,3,6],[3,7,3,9],[3,11,6,15],[4,0,6,0],[4,1,6,1],[4,2,4,3]]}
[{"$f":"Konfig!$A$1","v":" BOKU-Zeiterfassung für Wissenschaftliches Personal"},null,null,null,null,null,null,null,null,null,null,null,null,null,null,null,"Monat","Stunden-Saldo Grenzen","Status Blatteingabe"]
[{"$f":"\" Org.-Einh. : \"&OrgEinheit","v":" Org.-Einh. : Hxxxxx"},null,null,null,null,"Zeitmodell:",null,null,null,{"$f":"\" \"&Zeitmodell","v":" Vollzeit"},null,null,null,null,null,null,{"$f":"IF(ISNA($Q$4),1,$Q$4)","v":10},0,{"$f":"SUM($AT8:$AT38)","v":0}]
[{"$f":" \" Mitarbeiter: \"&Name","v":" Mitarbeiter: Vorname Nachname"},null,null,null,null,"Vorgesetzter:",null,null,null,{"$f":"\" \"&Vorgesetzter","v":" Vorname Nachname"},null,null,null,null,null,null,{"$f":"RIGHT(CELL(\"filename\",A1),LEN(CELL(\"filename\",A1))-SEARCH(\"]\",CELL(\"filename\",A1),1))","v":"Oktober"},null,{"$f":"IF($Q$2=1,$S$2,$S$2+INDIRECT($S$5))","v":0}]
[{"$f":" \" Monat: \"&$Q$3&\" \"&Jahr","v":" Monat: Oktober 2024"},null,null,null,"Dienstplan",null,null,"Normalstunden",null,null,"Übertrag","Anmerkungen ",null,null,null,null,{"$f":"IF(ISNA(VLOOKUP($Q$3,MTab,2,FALSE)),1,VLOOKUP($Q$3,MTab,2,FALSE))","v":10},null,"Übertrags Adresse Blatteingabe"]
[" Datum","Wochentag","Tagesinformation",null,{"$f":"\"Wochen-AZ\"&\" \"&TEXT(WAZ,\"[hh]:mm\")","v":"Wochen-AZ 40:00"},null,null," Stunden 1:1",null,null,{"$f":"IF(ISNA($Q$5),Übertrag,INDIRECT($Q$5))","v":0},null,null,null,null,null,{"$f":"IF(ISNA(VLOOKUP($Q$3,MTab,3,FALSE)),\"Übertrag\",VLOOKUP($Q$3,MTab,3,FALSE))","v":"September!$J$42"},null,{"$f":"IF(ISNA(VLOOKUP($Q$3,MTab,4,FALSE)),$Q$3&\"!$R$2\",VLOOKUP($Q$3,MTab,4,FALSE))","v":"September!$S$3"}]
[null,null," Feiertage\n Wochenende\n Urlaub, ZA, Krank","[U]rlaub\n[Z]A\n[K]rank","Normal-","Soll","MP","Von","Bis","Plus","Saldo",null,null,null,null,null,"Hintergrundberechnungen",null,null,null,null,null,null,"Saldo aktuell",null,null,null,"GAZ-Tabellenabbildung",null,null,null,null,"Eingabebeprüfungen"]
[null,null,null,null,"Arbeitszeit",null,null,null,null,"Minus","akuell",null,null,null,null,null,"Datum","Monat OK","Abwesenh.","Freie Tage","ÜA-Tage","Std.","Soll-Std.",{"$f":"IF(ISNA($Q$5),Übertrag,INDIRECT($Q$5))","v":0},"Std.-Soll = 0","Std.-Soll > 0","Std.-Soll < 0",null,{"$f":"I_GAZNAZVon","v":2},3,{"$f":"I_GAZNAZBis","v":4},null,"Zeiteingabe","UZK-Eing.\nerlaubt","UZK-Eing.\ngültig","Normalst. ein erlaubt","Normalstd.\neingegeben","Normal VON möglich OG","Normal VON möglich UG","Normal BIS möglich OG","Normal BIS möglich UG","Normal VON\n15min","Normal VON richtig","Normal BIS\n15min","Normal BIS richtig","Status Zeilen Eingabe"]
[{"$f":"IF($R8,$Q8,\"\")","v":"2024-10-01"},{"$f":"IF($R8,VLOOKUP(WEEKDAY($Q8,2),WOTA,2,FALSE),\"\")","v":"Di"},{"$f":"IF($R8,\" \"&IF($S8=\"\",VLOOKUP($Q8,FListe,3,FALSE),$S8),\"\")","v":" "},null,{"$f":"IF(AND($R8,$T8<>\"F\"),IF($AC8=$AE8,\"keine NAZ\",TEXT($AC8,\"hh:mm\")&\"-\"&TEXT($AC8+$F8+$G8,\"hh:mm\")),\"\")","v":"08:00-16:00"},{"$f":"IF($R8,IF($T8=\"F\",0,VLOOKUP($B8,GAZ,I_GAZNAZMP,FALSE)),\"\")","v":"08:00:00"},{"$f":"IF($R8,$AD8,\"\")","v":"00:00:00"},null,null,{"$f":"IF(AND($R8,$AK8,NOT($Y8)),ROUND(($V8-$F8-$G8)*24,2),IF($D8=\"Z\",$F8*-24,\"\"))","v":""},{"$f":"$X8","v":0},null,null,null,null,null,{"$f":"DATE(Jahr,$Q2,1)","v":"2024-10-01"},{"$f":"$Q$2=MONTH($Q8)","v":true},{"$f":"IF(OR($D8=\"U\",$D8=\"Z\",$D8=\"ZK\",$D8=\"K\"),VLOOKUP($D8,UZK,2,FALSE),\"\")","v":""},{"$f":"IF($R8,VLOOKUP($Q8,FListe,4,FALSE),\"\")","v":"A"},{"$f":"IF($R8,VLOOKUP($Q8,FListe,5,FALSE),\"\")","v":"A"},{"$f":"$I8-$H8","v":0},{"$f":"IF($R8,ROUND($V8-$F8-$AD8,15),\"\")","v":-0.33333333333333298},{"$f":"IF($J8<>\"\",$X7+$J8,$X7)","v":0},{"$f":"($W8=0)","v":false},{"$f":"($W8>0)","v":false},{"$f":"($W8<0)","v":true},{"$f":"IF($U8=\"F\",\"\",TIME(0,0,0))","v":"00:00:00"},{"$f":"IF($U8=\"F\",\"\",IF(ISNA(VLOOKUP($B8,GAZ,AC$7,FALSE)),0,VLOOKUP($B8,GAZ,AC$7,FALSE)))","v":"08:00:00"},{"$f":"IF(OR($U8=\"F\",$S8<>\"\",ISNA(VLOOKUP($B8,GAZ,AD$7,FALSE))),0,IF(NOT($AK8),VLOOKUP($B8,GAZ,11,FALSE),IF(($I8-$H8)*24>=6,VLOOKUP($B8,GAZ,3,FALSE),0)))","v":"00:00:00"},{"$f":"IF($U8=\"F\",\"\",IF(ISNA(VLOOKUP($B8,GAZ,AE$7,FALSE)),0,VLOOKUP($B8,GAZ,AE$7,FALSE)))","v":"16:00:00"},{"$f":"IF($U8=\"F\",\"\",TIME(23,59,0))","v":"23:59:00"},{"$f":"OR($H8<>\"\",$I8<>\"\")","v":false},{"$f":"AND($T8<>\"F\",NOT($AG8),NOT($AC8=$AE8))","v":true},{"$f":"AND($AH8,OR($D8=\"U\",$D8=\"Z\",$D8=\"K\"))","v":false},{"$f":"AND($U8<>\"F\",$D8<>\"U\",$D8<>\"Z\",$D8<>\"K\",$R8)","v":true},{"$f":"AND($H8<>\"\",$I8<>\"\")","v":false},{"$f":"IF($AJ8,TagUG,\"\")","v":"00:00:00"},{"$f":"IF($AJ8,IF($I8=\"\",IF(AND($L8<>\"\",$L8<$AF8),$L8,IF(AND($M8<>\"\",$M8<$AF8),$M8,TagOG)),$I8),\"\")","v":"23:59:00"},{"$f":"IF($AJ8,IF($H8=\"\",$AB8,$H8),\"\")","v":"00:00:00"},{"$f":"IF($AJ8,IF(AND($L8<>\"\",$L8<$AF8),$L8,IF(AND($M8<>\"\",$M8<$AF8),$M8,TagOG)),\"\")","v":"23:59:00"},{"$f":"MOD($H8*24,0.25)=0","v":true},{"$f":"AND($AJ8,ISNUMBER($H8),$H8>=$AB8,$H8<=$AF8,OR($I8=\"\",$H8<=$I8))","v":false},{"$f":"MOD($I8*24,0.25)=0","v":true},{"$f":"AND($AJ8,ISNUMBER($I8),$I8>=$AB8,$I8<=$AF8,OR($H8=\"\",$I8>=$H8))","v":false},{"$f":"IF(AND(ISBLANK($D8),ISBLANK($H8),ISBLANK($I8)),0,1)","v":0}]
["2024-10-02","Mi"," ",null,{"$f":"IF(AND($R9,$T9<>\"F\"),IF($AC9=$AE9,\"keine NAZ\",TEXT($AC9,\"hh:mm\")&\"-\"&TEXT($AC9+$F9+$G9,\"hh:mm\")),\"\")","v":"08:00-16:00"},"08:00:00","00:00:00",null,null,"",0,null,null,null,null,null,{"$f":" Q8+1","v":"2024-10-02"},true,"","A","A",{"$f":"$I9-$H9","v":0},{"$f":"IF($R9,ROUND($V9-$F9-$AD9,15),\"\")","v":-0.33333333333333298},0,false,false,true,"00:00:00","08:00:00","00:00:00","16:00:00","23:59:00",false,true,false,true,false,"00:00:00","23:59:00",{"$f":"IF($AJ9,IF($H9=\"\",TagUG,$H9),\"\")","v":"00:00:00"},"23:59:00",true,false,true,false,0]
["2024-10-03","Do"," ",null,"08:00-16:00","08:00:00","00:00:00",null,null,"",0,null,null,null,null,null,"2024-10-03",true,"","A","A",0,-0.33333333333333298,0,false,false,true,"00:00:00","08:00:00","00:00:00","16:00:00","23:59:00",false,true,false,true,false,"00:00:00","23:59:00","00:00:00","23:59:00",true,false,true,false,0]
["2024-10-04","Fr"," ",null,"08:00-16:00","08:00:00","00:00:00",null,null,"",0,null,null,null,null,null,"2024-10-04",true,"","A","A",0,-0.33333333333333298,0,false,false,true,"00:00:00","08:00:00","00:00:00","16:00:00","23:59:00",false,true,false,true,false,"00:00:00","23:59:00","00:00:00","23:59:00",true,false,true,false,0]
["2024-10-05","Sa"," Wochenende",null,"","00:00:00","00:00:00",null,null,"",0,null,null,null,null,null,"2024-10-05",true,"","F","A",0,0,0,true,false,false,"00:00:00","00:00:00","00:00:00","00:00:00","23:59:00",false,false,false,true,false,"00:00:00","23:59:00","00:00:00","23:59:00",true,false,true,false,0]
["2024-10-06","So"," Wochenende",null,"","00:00:00","00:00:00",null,null,"",0,null,null,null,null,null,"2024-10-06",true,"","F","F",0,0,0,true,false,false,"","","00:00:00","","",false,false,false,false,false,"","","","",true,false,true,false,0]
["2024-10-07","Mo"," ",null,"08:00-16:00","08:00:00","00:00:00",null,null,"",0,null,null,null,null,null,"2024-10-07",true,"","A","A",0,-0.33333333333333298,0,false,false,true,"00:00:00","08:00:00","00:00:00","16:00:00","23:59:00",false,true,false,true,false,"00:00:00","23:59:00","00:00:00","23:59:00",true,false,true,false,0]
["2024-10-08","Di"," ",null,"08:00-16:00","08:00:00","00:00:00",null,null,"",0,null,null,null,null,null,"2024-10-08",true,"","A","A",0,-0.33333333333333298,0,false,false,true,"00:00:00","08:00:00","00:00:00","16:00:00","23:59:00",false,true,false,true,false,"00:00:00","23:59:00","00:00:00","23:59:00",true,false,true,false,0]
["2024-10-09","Mi"," ",null,"08:00-16:00","08:00:00","00:00:00",null,null,"",0,null,null,null,null,null,"2024-10-09",true,"","A","A",0,-0.33333333333333298,0,false,false,true,"00:00:00","08:00:00","00:00:00","16:00:00","23:59:00",false,true,false,true,false,"00:00:00","23:59:00","00:00:00","23:59:00",true,false,true,false,0]
["2024-10-10","Do"," ",null,"08:00-16:00","08:00:00","00:00:00",null,null,"",0,null,null,null,null,null,"2024-10-10",true,"","A","A",0,-0.33333333333333298,0,false,false,true,"00:00:00","08:00:00","00:00:00","16:00:00","23:59:00",false,true,false,true,false,"00:00:00","23:59:00","00:00:00","23:59:00",true,false,true,false,0]
["2024-10-11","Fr"," ",null,"08:00-16:00","08:00:00","00:00:00",null,null,"",0,null,null,null,null,null,"2024-10-11",true,"","A","A",0,-0.33333333333333298,0,false,false,true,"00:00:00","08:00:00","00:00:00","16:00:00","23:59:00",false,true,false,true,false,"00:00:00","23:59:00","00:00:00","23:59:00",true,false,true,false,0]
["2024-10-12","Sa"," Wochenende",null,"","00:00:00","00:00:00",null,null,"",0,null,null,null,null,null,"2024-10-12",true,"","F","A",0,0,0,true,false,false,"00:00:00","00:00:00","00:00:00","00:00:00","23:59:00",false,false,false,true,false,"00:00:00","23:59:00","00:00:00","23:59:00",true,false,true,false,0]
["2024-10-13","So"," Wochenende",null,"","00:00:00","00:00:00",null,null,"",0,null,null,null,null,null,"2024-10-13",true,"","F","F",0,0,0,true,false,false,"","","00:00:00","","",false,false,false,false,false,"","","","",true,false,true,false,0]
["2024-10-14","Mo"," ",null,"08:00-16:00","08:00:00","00:00:00",null,null,"",0,null,null,null,null,null,"2024-10-14",true,"","A","A",0,-0.33333333333333298,0,false,false,true,"00:00:00","08:00:00","00:00:00","16:00:00","23:59:00",false,true,false,true,false,"00:00:00","23:59:00","00:00:00","23:59:00",true,false,true,false,0]
["2024-10-15","Di"," ",null,"08:00-16:00","08:00:00","00:00:00",null,null,"",0,null,null,null,null,null,"2024-10-15",true,"","A","A",0,-0.33333333333333298,0,false,false,true,"00:00:00","08:00:00","00:00:00","16:00:00","23:59:00",false,true,false,true,false,"00:00:00","23:59:00","00:00:00","23:59:00",true,false,true,false,0]
["2024-10-16","Mi"," ",null,"08:00-16:00","08:00:00","00:00:00",null,null,"",0,null,null,null,null,null,"2024-10-16",true,"","A","A",0,-0.33333333333333298,0,false,false,true,"00:00:00","08:00:00","00:00:00","16:00:00","23:59:00",false,true,false,true,false,"00:00:00","23:59:00","00:00:00","23:59:00",true,false,true,false,0]
["2024-10-17","Do"," ",null,"08:00-16:00","08:00:00","00:00:00",null,null,"",0,null,null,null,null,null,"2024-10-17",true,"","A","A",0,-0.33333333333333298,0,false,false,true,"00:00:00","08:00:00","00:00:00","16:00:00","23:59:00",false,true,false,true,false,"00:00:00","23:59:00","00:00:00","23:59:00",true,false,true,false,0]
["2024-10-18","Fr"," ",null,"08:00-16:00","08:00:00","00:00:00",null,null,"",0,null,null,null,null,null,"2024-10-18",true,"","A","A",0,-0.33333333333333298,0,false,false,true,"00:00:00","08:00:00","00:00:00","16:00:00","23:59:00",false,true,false,true,false,"00:00:00","23:59:00","00:00:00","23:59:00",true,false,true,false,0]
["2024-10-19","Sa"," Wochenende",null,"","00:00:00","00:00:00",null,null,"",0,null,null,null,null,null,"2024-10-19",true,"","F","A",0,0,0,true,false,false,"00:00:00","00:00:00","00:00:00","00:00:00","23:59:00",false,false,false,true,false,"00:00:00","23:59:00","00:00:00","23:59:00",true,false,true,false,0]
["2024-10-20","So"," Wochenende",null,"","00:00:00","00:00:00",null,null,"",0,null,null,null,null,null,"2024-10-20",true,"","F","F",0,0,0,true,false,false,"","","00:00:00","","",false,false,false,false,false,"","","","",true,false,true,false,0]
["2024-10-21","Mo"," ",null,"08:00-16:00","08:00:00","00:00:00",null,null,"",0,null,null,null,null,null,"2024-10-21",true,"","A","A",0,-0.33333333333333298,0,false,false,true,"00:00:00","08:00:00","00:00:00","16:00:00","23:59:00",false,true,false,true,false,"00:00:00","23:59:00","00:00:00","23:59:00",true,false,true,false,0]
["2024-10-22","Di"," ",null,"08:00-16:00","08:00:00","00:00:00",null,null,"",0,null,null,null,null,null,"2024-10-22",true,"","A","A",0,-0.33333333333333298,0,false,false,true,"00:00:00","08:00:00","00:00:00","16:00:00","23:59:00",false,true,false,true,false,"00:00:00","23:59:00","00:00:00","23:59:00",true,false,true,false,0]
["2024-10-23","Mi"," ",null,"08:00-16:00","08:00:00","00:00:00",null,null,"",0,null,null,null,null,null,"2024-10-23",true,"","A","A",0,-0.33333333333333298,0,false,false,true,"00:00:00","08:00:00","00:00:00","16:00:00","23:59:00",false,true,false,true,false,"00:00:00","23:59:00","00:00:00","23:59:00",true,false,true,false,0]
["2024-10-24","Do"," ",null,"08:00-16:00","08:00:00","00:00:00",null,null,"",0,null,null,null,null,null,"2024-10-24",true,"","A","A",0,-0.33333333333333298,0,false,false,true,"00:00:00","08:00:00","00:00:00","16:00:00","23:59:00",false,true,false,true,false,"00:00:00","23:59:00","00:00:00","23:59:00",true,false,true,false,0]
["2024-10-25","Fr"," ",null,"08:00-16:00","08:00:00","00:00:00",null,null,"",0,null,null,null,null,null,"2024-10-25",true,"","A","A",0,-0.33333333333333298,0,false,false,true,"00:00:00","08:00:00","00:00:00","16:00:00","23:59:00",false,true,false,true,false,"00:00:00","23:59:00","00:00:00","23:59:00",true,false,true,false,0]
["2024-10-26","Sa"," Nationalfeiertag",null,"","00:00:00","00:00:00",null,null,"",0,null,null,null,null,null,"2024-10-26",true,"","F","F",0,0,0,true,false,false,"","","00:00:00","","",false,false,false,false,false,"","","","",true,false,true,false,0]
["2024-10-27","So"," Wochenende",null,"","00:00:00","00:00:00",null,null,"",0,null,null,null,null,null,"2024-10-27",true,"","F","F",0,0,0,true,false,false,"","","00:00:00","","",false,false,false,false,false,"","","","",true,false,true,false,0]
["2024-10-28","Mo"," ",null,"08:00-16:00","08:00:00","00:00:00",null,null,"",0,null,null,null,null,null,"2024-10-28",true,"","A","A",0,-0.33333333333333298,0,false,false,true,"00:00:00","08:00:00","00:00:00","16:00:00","23:59:00",false,true,false,true,false,"00:00:00","23:59:00","00:00:00","23:59:00",true,false,true,false,0]
["2024-10-29","Di"," ",null,"08:00-16:00","08:00:00","00:00:00",null,null,"",0,null,null,null,null,null,"2024-10-29",true,"","A","A",0,-0.33333333333333298,0,false,false,true,"00:00:00","08:00:00","00:00:00","16:00:00","23:59:00",false,true,false,true,false,"00:00:00","23:59:00","00:00:00","23:59:00",true,false,true,false,0]
["2024-10-30","Mi"," ",null,"08:00-16:00","08:00:00","00:00:00",null,null,"",0,null,null,null,null,null,"2024-10-30",true,"","A","A",0,-0.33333333333333298,0,false,false,true,"00:00:00","08:00:00","00:00:00","16:00:00","23:59:00",false,true,false,true,false,"00:00:00","23:59:00","00:00:00","23:59:00",true,false,true,false,0]
["2024-10-31","Do"," ",null,"08:00-16:00","08:00:00","00:00:00",null,null,"",0,null,null,null,null,null,"2024-10-31",true,"","A","A",0,-0.33333333333333298,0,false,false,true,"00:00:00","08:00:00","00:00:00","16:00:00","23:59:00",false,true,false,true,false,"00:00:00","23:59:00","00:00:00","23:59:00",true,false,true,false,0]
["Arbeitstage",{"$f":"COUNTIF(T$8:T$38,\"A\")","v":23},null,null,{"$f":"\"Monat Std.-Saldo (~15min) > \"","v":"Monat Std.-Saldo (~15min) > "},null,null,null,null,{"$f":"ROUND(SUM(J8:J38)*4,0)/4","v":0}]
["ZA-Tage",{"$f":"COUNTIF(D$8:D$38,\"Z\")","v":0},null,null," Vormonat Std.Saldo > ",null,null,null,null,{"$f":"$K5","v":0},null,null,null,null,null,null,"Gültigkeit ausbezahlt"]
["Urlaubstage",{"$f":"COUNTIF(D$8:D$38,\"U\")","v":0},null,null," Gesamt Std. Saldo > ",null,null,null,null,{"$f":"$J39+$J40","v":0},null,null,null,null,null,null,{"$f":"AND($K$41>=0,$K$41<=$J$41,MOD($K$41,0.25)=0)","v":true}]
["Krank",{"$f":"COUNTIF(D$8:D$38,\"K\")","v":0},null,null," Übertrag Std. Saldo > ",null,null,null,null,{"$f":"$J41","v":0},{"$f":"\" < Dieser Stunden-Saldo wird in das nächste \"&IF($Q$3=\"Dezember\",\"Jahr\",\"Monat\")&\" übertragen\"","v":" < Dieser Stunden-Saldo wird in das nächste Monat übertragen"}]
[null,null,null,"Z"]
[]
[{"$f":"\"Unterschrift von \"&Vorgesetzter","v":"Unterschrift von Vorname Nachname"},null,null,null,null,null,null,null,null,null,null,null,{"$f":"\"Unterschrift von \"&Name","v":"Unterschrift von Vorname Nachname"}]

{"sheet":"November","index":11,"n_rows":45,"n_cols":46,"rows_kept":45,"cut":false,"hidden":true,"merged":[[42,4,42,8],[43,4,43,8],[44,0,44,3],[44,12,44,15],[36,11,36,15],[37,11,37,15],[38,2,41,3],[38,4,38,8],[38,10,40,15],[39,4,39,8],[40,4,40,8],[41,4,41,8],[41,10,41,15],[30,11,30,15],[31,11,31,15],[32,11,32,15],[33,11,33,15],[34,11,34,15],[35,11,35,15],[24,11,24,15],[25,11,25,15],[26,11,26,15],[27,11,27,15],[28,11,28,15],[29,11,29,15],[18,11,18,15],[19,11,19,15],[20,11,20,15],[21,11,21,15],[22,11,22,15],[23,11,23,15],[12,11,12,15],[13,11,13,15],[14,11,14,15],[15,11,15,15],[16,11,16,15],[17,11,17,15],[5,27,5,31],[7,11,7,15],[8,11,8,15],[9,11,9,15],[10,11,10,15],[11,11,11,15],[4,4,4,6],[4,7,4,9],[5,2,6,2],[5,3,6,3],[5,5,6,5],[5,6,6,6],[5,7,6,7],[5,8,6,8],[0,15,1,15],[1,5,1,8],[2,5,2,8],[3,0,3,3],[3,4,3,6],[3,7,3,9],[3,11,6,15],[4,0,6,0],[4,1,6,1],[4,2,4,3]]}
[{"$f":"Konfig!$A$1","v":" BOKU-Zeiterfassung für Wissenschaftliches Personal"},null,null,null,null,null,null,null,null,null,null,null,null,null,null,null,"Monat","Stunden-Saldo Grenzen","Status Blatteingabe"]
[{"$f":"\" Org.-Einh. : \"&OrgEinheit","v":" Org.-Einh. : Hxxxxx"},null,null,null,null,"Zeitmodell:",null,null,null,{"$f":"\" \"&Zeitmodell","v":" Vollzeit"},null,null,null,null,null,null,{"$f":"IF(ISNA($Q$4),1,$Q$4)","v":11},0,{"$f":"SUM($AT8:$AT38)","v":0}]
[{"$f":" \" Mitarbeiter: \"&Name","v":" Mitarbeiter: Vorname Nachname"},null,null,null,null,"Vorgesetzter:",null,null,null,{"$f":"\" \"&Vorgesetzter","v":" Vorname Nachname"},null,null,null,null,null,null,{"$f":"RIGHT(CELL(\"filename\",A1),LEN(CELL(\"filename\",A1))-SEARCH(\"]\",CELL(\"filename\",A1),1))","v":"November"},null,{"$f":"IF($Q$2=1,$S$2,$S$2+INDIRECT($S$5))","v":0}]
[{"$f":" \" Monat: \"&$Q$3&\" \"&Jahr","v":" Monat: November 2024"},null,null,null,"Dienstplan",null,null,"Normalstunden",null,null,"Übertrag","Anmerkungen ",null,null,null,null,{"$f":"IF(ISNA(VLOOKUP($Q$3,MTab,2,FALSE)),1,VLOOKUP($Q$3,MTab,2,FALSE))","v":11},null,"Übertrags Adresse Blatteingabe"]
[" Datum","Wochentag","Tagesinformation",null,{"$f":"\"Wochen-AZ\"&\" \"&TEXT(WAZ,\"[hh]:mm\")","v":"Wochen-AZ 40:00"},null,null," Stunden 1:1",null,null,{"$f":"IF(ISNA($Q$5),Übertrag,INDIRECT($Q$5))","v":0},null,null,null,null,null,{"$f":"IF(ISNA(VLOOKUP($Q$3,MTab,3,FALSE)),\"Übertrag\",VLOOKUP($Q$3,MTab,3,FALSE))","v":"Oktober!$J$42"},null,{"$f":"IF(ISNA(VLOOKUP($Q$3,MTab,4,FALSE)),$Q$3&\"!$R$2\",VLOOKUP($Q$3,MTab,4,FALSE))","v":"Oktober!$S$3"}]
[null,null," Feiertage\n Wochenende\n Urlaub, ZA, Krank","[U]rlaub\n[Z]A\n[K]rank","Normal-","Soll","MP","Von","Bis","Plus","Saldo",null,null,null,null,null,"Hintergrundberechnungen",null,null,null,null,null,null,"Saldo aktuell",null,null,null,"GAZ-Tabellenabbildung",null,null,null,null,"Eingabebeprüfungen"]
[null,null,null,null,"Arbeitszeit",null,null,null,null,"Minus","akuell",null,null,null,null,null,"Datum","Monat OK","Abwesenh.","Freie Tage","ÜA-Tage","Std.","Soll-Std.",{"$f":"IF(ISNA($Q$5),Übertrag,INDIRECT($Q$5))","v":0},"Std.-Soll = 0","Std.-Soll > 0","Std.-Soll < 0",null,{"$f":"I_GAZNAZVon","v":2},3,{"$f":"I_GAZNAZBis","v":4},null,"Zeiteingabe","UZK-Eing.\nerlaubt","UZK-Eing.\ngültig","Normalst. ein erlaubt","Normalstd.\neingegeben","Normal VON möglich OG","Normal VON möglich UG","Normal BIS möglich OG","Normal BIS möglich UG","Normal VON\n15min","Normal VON richtig","Normal BIS\n15min","Normal BIS richtig","Status Zeilen Eingabe"]
[{"$f":"IF($R8,$Q8,\"\")","v":"2024-11-01"},{"$f":"IF($R8,VLOOKUP(WEEKDAY($Q8,2),WOTA,2,FALSE),\"\")","v":"Fr"},{"$f":"IF($R8,\" \"&IF($S8=\"\",VLOOKUP($Q8,FListe,3,FALSE),$S8),\"\")","v":" Allerheiligen"},null,{"$f":"IF(AND($R8,$T8<>\"F\"),IF($AC8=$AE8,\"keine NAZ\",TEXT($AC8,\"hh:mm\")&\"-\"&TEXT($AC8+$F8+$G8,\"hh:mm\")),\"\")","v":""},{"$f":"IF($R8,IF($T8=\"F\",0,VLOOKUP($B8,GAZ,I_GAZNAZMP,FALSE)),\"\")","v":"00:00:00"},{"$f":"IF($R8,$AD8,\"\")","v":"00:00:00"},null,null,{"$f":"IF(AND($R8,$AK8,NOT($Y8)),ROUND(($V8-$F8-$G8)*24,2),IF($D8=\"Z\",$F8*-24,\"\"))","v":""},{"$f":"$X8","v":0},null,null,null,null,null,{"$f":"DATE(Jahr,$Q2,1)","v":"2024-11-01"},{"$f":"$Q$2=MONTH($Q8)","v":true},{"$f":"IF(OR($D8=\"U\",$D8=\"Z\",$D8=\"ZK\",$D8=\"K\"),VLOOKUP($D8,UZK,2,FALSE),\"\")","v":""},{"$f":"IF($R8,VLOOKUP($Q8,FListe,4,FALSE),\"\")","v":"F"},{"$f":"IF($R8,VLOOKUP($Q8,FListe,5,FALSE),\"\")","v":"F"},{"$f":"$I8-$H8","v":0},{"$f":"IF($R8,ROUND($V8-$F8-$AD8,15),\"\")","v":0},{"$f":"IF($J8<>\"\",$X7+$J8,$X7)","v":0},{"$f":"($W8=0)","v":true},{"$f":"($W8>0)","v":false},{"$f":"($W8<0)","v":false},{"$f":"IF($U8=\"F\",\"\",TIME(0,0,0))","v":""},{"$f":"IF($U8=\"F\",\"\",IF(ISNA(VLOOKUP($B8,GAZ,AC$7,FALSE)),0,VLOOKUP($B8,GAZ,AC$7,FALSE)))","v":""},{"$f":"IF(OR($U8=\"F\",$S8<>\"\",ISNA(VLOOKUP($B8,GAZ,AD$7,FALSE))),0,IF(NOT($AK8),VLOOKUP($B8,GAZ,11,FALSE),IF(($I8-$H8)*24>=6,VLOOKUP($B8,GAZ,3,FALSE),0)))","v":"00:00:00"},{"$f":"IF($U8=\"F\",\"\",IF(ISNA(VLOOKUP($B8,GAZ,AE$7,FALSE)),0,VLOOKUP($B8,GAZ,AE$7,FALSE)))","v":""},{"$f":"IF($U8=\"F\",\"\",TIME(23,59,0))","v":""},{"$f":"OR($H8<>\"\",$I8<>\"\")","v":false},{"$f":"AND($T8<>\"F\",NOT($AG8),NOT($AC8=$AE8))","v":false},{"$f":"AND($AH8,OR($D8=\"U\",$D8=\"Z\",$D8=\"K\"))","v":false},{"$f":"AND($U8<>\"F\",$D8<>\"U\",$D8<>\"Z\",$D8<>\"K\",$R8)","v":false},{"$f":"AND($H8<>\"\",$I8<>\"\")","v":false},{"$f":"IF($AJ8,TagUG,\"\")","v":""},{"$f":"IF($AJ8,IF($I8=\"\",IF(AND($L8<>\"\",$L8<$AF8),$L8,IF(AND($M8<>\"\",$M8<$AF8),$M8,TagOG)),$I8),\"\")","v":""},{"$f":"IF($AJ8,IF($H8=\"\",$AB8,$H8),\"\")","v":""},{"$f":"IF($AJ8,IF(AND($L8<>\"\",$L8<$AF8),$L8,IF(AND($M8<>\"\",$M8<$AF8),$M8,TagOG)),\"\")","v":""},{"$f":"MOD($H8*24,0.25)=0","v":true},{"$f":"AND($AJ8,ISNUMBER($H8),$H8>=$AB8,$H8<=$AF8,OR($I8=\"\",$H8<=$I8))","v":false},{"$f":"MOD($I8*24,0.25)=0","v":true},{"$f":"AND($AJ8,ISNUMBER($I8),$I8>=$AB8,$I8<=$AF8,OR($H8=\"\",$I8>=$H8))","v":false},{"$f":"IF(AND(ISBLANK($D8),ISBLANK($H8),ISBLANK($I8)),0,1)","v":0}]
["2024-11-02","Sa"," Allerseelen",null,{"$f":"IF(AND($R9,$T9<>\"F\"),IF($AC9=$AE9,\"keine NAZ\",TEXT($AC9,\"hh:mm\")&\"-\"&TEXT($AC9+$F9+$G9,\"hh:mm\")),\"\")","v":""},"00:00:00","00:00:00",null,null,"",0,null,null,null,null,null,{"$f":" Q8+1","v":"2024-11-02"},true,"","F","A",{"$f":"$I9-$H9","v":0},{"$f":"IF($R9,ROUND($V9-$F9-$AD9,15),\"\")","v":0},0,true,false,false,"00:00:00","00:00:00","00:00:00","00:00:00","23:59:00",false,false,false,true,false,"00:00:00","23:59:00",{"$f":"IF($AJ9,IF($H9=\"\",TagUG,$H9),\"\")","v":"00:00:00"},"23:59:00",true,false,true,false,0]
["2024-11-03","So"," Wochenende",null,"","00:00:00","00:00:00",null,null,"",0,null,null,null,null,null,"2024-11-03",true,"","F","F",0,0,0,true,false,false,"","","00:00:00","","",false,false,false,false,false,"","","","",true,false,true,false,0]
["2024-11-04","Mo"," ",null,"08:00-16:00","08:00:00","00:00:00",null,null,"",0,null,null,null,null,null,"2024-11-04",true,"","A","A",0,-0.33333333333333298,0,false,false,true,"00:00:00","08:00:00","00:00:00","16:00:00","23:59:00",false,true,false,true,false,"00:00:00","23:59:00","00:00:00","23:59:00",true,false,true,false,0]
["2024-11-05","Di"," ",null,"08:00-16:00","08:00:00","00:00:00",null,null,"",0,null,null,null,null,null,"2024-11-05",true,"","A","A",0,-0.33333333333333298,0,false,false,true,"00:00:00","08:00:00","00:00:00","16:00:00","23:59:00",false,true,false,true,false,"00:00:00","23:59:00","00:00:00","23:59:00",true,false,true,false,0]
["2024-11-06","Mi"," ",null,"08:00-16:00","08:00:00","00:00:00",null,null,"",0,null,null,null,null,null,"2024-11-06",true,"","A","A",0,-0.33333333333333298,0,false,false,true,"00:00:00","08:00:00","00:00:00","16:00:00","23:59:00",false,true,false,true,false,"00:00:00","23:59:00","00:00:00","23:59:00",true,false,true,false,0]
["2024-11-07","Do"," ",null,"08:00-16:00","08:00:00","00:00:00",null,null,"",0,null,null,null,null,null,"2024-11-07",true,"","A","A",0,-0.33333333333333298,0,false,false,true,"00:00:00","08:00:00","00:00:00","16:00:00","23:59:00",false,true,false,true,false,"00:00:00","23:59:00","00:00:00","23:59:00",true,false,true,false,0]
["2024-11-08","Fr"," ",null,"08:00-16:00","08:00:00","00:00:00",null,null,"",0,null,null,null,null,null,"2024-11-08",true,"","A","A",0,-0.33333333333333298,0,false,false,true,"00:00:00","08:00:00","00:00:00","16:00:00","23:59:00",false,true,false,true,false,"00:00:00","23:59:00","00:00:00","23:59:00",true,false,true,false,0]
["2024-11-09","Sa"," Wochenende",null,"","00:00:00","00:00:00",null,null,"",0,null,null,null,null,null,"2024-11-09",true,"","F","A",0,0,0,true,false,false,"00:00:00","00:00:00","00:00:00","00:00:00","23:59:00",false,false,false,true,false,"00:00:00","23:59:00","00:00:00","23:59:00",true,false,true,false,0]
["2024-11-10","So"," Wochenende",null,"","00:00:00","00:00:00",null,null,"",0,null,null,null,null,null,"2024-11-10",true,"","F","F",0,0,0,true,false,false,"","","00:00:00","","",false,false,false,false,false,"","","","",true,false,true,false,0]
["2024-11-11","Mo"," ",null,"08:00-16:00","08:00:00","00:00:00",null,null,"",0,null,null,null,null,null,"2024-11-11",true,"","A","A",0,-0.33333333333333298,0,false,false,true,"00:00:00","08:00:00","00:00:00","16:00:00","23:59:00",false,true,false,true,false,"00:00:00","23:59:00","00:00:00","23:59:00",true,false,true,false,0]
["2024-11-12","Di"," ",null,"08:00-16:00","08:00:00","00:00:00",null,null,"",0,null,null,null,null,null,"2024-11-12",true,"","A","A",0,-0.33333333333333298,0,false,false,true,"00:00:00","08:00:00","00:00:00","16:00:00","23:59:00",false,true,false,true,false,"00:00:00","23:59:00","00:00:00","23:59:00",true,false,true,false,0]
["2024-11-13","Mi"," ",null,"08:00-16:00","08:00:00","00:00:00",null,null,"",0,null,null,null,null,null,"2024-11-13",true,"","A","A",0,-0.33333333333333298,0,false,false,true,"00:00:00","08:00:00","00:00:00","16:00:00","23:59:00",false,true,false,true,false,"00:00:00","23:59:00","00:00:00","23:59:00",true,false,true,false,0]
["2024-11-14","Do"," ",null,"08:00-16:00","08:00:00","00:00:00",null,null,"",0,null,null,null,null,null,"2024-11-14",true,"","A","A",0,-0.33333333333333298,0,false,false,true,"00:00:00","08:00:00","00:00:00","16:00:00","23:59:00",false,true,false,true,false,"00:00:00","23:59:00","00:00:00","23:59:00",true,false,true,false,0]
["2024-11-15","Fr"," St. Leopold",null,"08:00-16:00","08:00:00","00:00:00",null,null,"",0,null,null,null,null,null,"2024-11-15",true,"","A","A",0,-0.33333333333333298,0,false,false,true,"00:00:00","08:00:00","00:00:00","16:00:00","23:59:00",false,true,false,true,false,"00:00:00","23:59:00","00:00:00","23:59:00",true,false,true,false,0]
["2024-11-16","Sa"," Wochenende",null,"","00:00:00","00:00:00",null,null,"",0,null,null,null,null,null,"2024-11-16",true,"","F","A",0,0,0,true,false,false,"00:00:00","00:00:00","00:00:00","00:00:00","23:59:00",false,false,false,true,false,"00:00:00","23:59:00","00:00:00","23:59:00",true,false,true,false,0]
["2024-11-17","So"," Wochenende",null,"","00:00:00","00:00:00",null,null,"",0,null,null,null,null,null,"2024-11-17",true,"","F","F",0,0,0,true,false,false,"","","00:00:00","","",false,false,false,false,false,"","","","",true,false,true,false,0]
["2024-11-18","Mo"," ",null,"08:00-16:00","08:00:00","00:00:00",null,null,"",0,null,null,null,null,null,"2024-11-18",true,"","A","A",0,-0.33333333333333298,0,false,false,true,"00:00:00","08:00:00","00:00:00","16:00:00","23:59:00",false,true,false,true,false,"00:00:00","23:59:00","00:00:00","23:59:00",true,false,true,false,0]
["2024-11-19","Di"," ",null,"08:00-16:00","08:00:00","00:00:00",null,null,"",0,null,null,null,null,null,"2024-11-19",true,"","A","A",0,-0.33333333333333298,0,false,false,true,"00:00:00","08:00:00","00:00:00","16:00:00","23:59:00",false,true,false,true,false,"00:00:00","23:59:00","00:00:00","23:59:00",true,false,true,false,0]
["2024-11-20","Mi"," ",null,"08:00-16:00","08:00:00","00:00:00",null,null,"",0,null,null,null,null,null,"2024-11-20",true,"","A","A",0,-0.33333333333333298,0,false,false,true,"00:00:00","08:00:00","00:00:00","16:00:00","23:59:00",false,true,false,true,false,"00:00:00","23:59:00","00:00:00","23:59:00",true,false,true,false,0]
["2024-11-21","Do"," ",null,"08:00-16:00","08:00:00","00:00:00",null,null,"",0,null,null,null,null,null,"2024-11-21",true,"","A","A",0,-0.33333333333333298,0,false,false,true,"00:00:00","08:00:00","00:00:00","16:00:00","23:59:00",false,true,false,true,false,"00:00:00","23:59:00","00:00:00","23:59:00",true,false,true,false,0]
["2024-11-22","Fr"," ",null,"08:00-16:00","08:00:00","00:00:00",null,null,"",0,null,null,null,null,null,"2024-11-22",true,"","A","A",0,-0.33333333333333298,0,false,false,true,"00:00:00","08:00:00","00:00:00","16:00:00","23:59:00",false,true,false,true,false,"00:00:00","23:59:00","00:00:00","23:59:00",true,false,true,false,0]
["2024-11-23","Sa"," Wochenende",null,"","00:00:00","00:00:00",null,null,"",0,null,null,null,null,null,"2024-11-23",true,"","F","A",0,0,0,true,false,false,"00:00:00","00:00:00","00:00:00","00:00:00","23:59:00",false,false,false,true,false,"00:00:00","23:59:00","00:00:00","23:59:00",true,false,true,false,0]
["2024-11-24","So"," Wochenende",null,"","00:00:00","00:00:00",null,null,"",0,null,null,null,null,null,"2024-11-24",true,"","F","F",0,0,0,true,false,false,"","","00:00:00","","",false,false,false,false,false,"","","","",true,false,true,false,0]
["2024-11-25","Mo"," ",null,"08:00-16:00","08:00:00","00:00:00",null,null,"",0,null,null,null,null,null,"2024-11-25",true,"","A","A",0,-0.33333333333333298,0,false,false,true,"00:00:00","08:00:00","00:00:00","16:00:00","23:59:00",false,true,false,true,false,"00:00:00","23:59:00","00:00:00","23:59:00",true,false,true,false,0]
["2024-11-26","Di"," ",null,"08:00-16:00","08:00:00","00:00:00",null,null,"",0,null,null,null,null,null,"2024-11-26",true,"","A","A",0,-0.33333333333333298,0,false,false,true,"00:00:00","08:00:00","00:00:00","16:00:00","23:59:00",false,true,false,true,false,"00:00:00","23:59:00","00:00:00","23:59:00",true,false,true,false,0]
["2024-11-27","Mi"," ",null,"08:00-16:00","08:00:00","00:00:00",null,null,"",0,null,null,null,null,null,"2024-11-27",true,"","A","A",0,-0.33333333333333298,0,false,false,true,"00:00:00","08:00:00","00:00:00","16:00:00","23:59:00",false,true,false,true,false,"00:00:00","23:59:00","00:00:00","23:59:00",true,false,true,false,0]
["2024-11-28","Do"," ",null,"08:00-16:00","08:00:00","00:00:00",null,null,"",0,null,null,null,null,null,"2024-11-28",true,"","A","A",0,-0.33333333333333298,0,false,false,true,"00:00:00","08:00:00","00:00:00","16:00:00","23:59:00",false,true,false,true,false,"00:00:00","23:59:00","00:00:00","23:59:00",true,false,true,false,0]
["2024-11-29","Fr"," ",null,"08:00-16:00","08:00:00","00:00:00",null,null,"",0,null,null,null,null,null,"2024-11-29",true,"","A","A",0,-0.33333333333333298,0,false,false,true,"00:00:00","08:00:00","00:00:00","16:00:00","23:59:00",false,true,false,true,false,"00:00:00","23:59:00","00:00:00","23:59:00",true,false,true,false,0]
["2024-11-30","Sa"," Wochenende",null,"","00:00:00","00:00:00",null,null,"",0,null,null,null,null,null,"2024-11-30",true,"","F","A",0,0,0,true,false,false,"00:00:00","00:00:00","00:00:00","00:00:00","23:59:00",false,false,false,true,false,"00:00:00","23:59:00","00:00:00","23:59:00",true,false,true,false,0]
["","","",null,"","","",null,null,"",0,null,null,null,null,null,"2024-12-01",false,"","","",0,"",0,false,true,false,"00:00:00","00:00:00","00:00:00","00:00:00","23:59:00",false,false,false,false,false,"","","","",true,false,true,false,0]
["Arbeitstage",{"$f":"COUNTIF(T$8:T$38,\"A\")","v":20},null,null,{"$f":"\"Monat Std.-Saldo (~15min) > \"","v":"Monat Std.-Saldo (~15min) > "},null,null,null,null,{"$f":"ROUND(SUM(J8:J38)*4,0)/4","v":0}]
["ZA-Tage",{"$f":"COUNTIF(D$8:D$38,\"Z\")","v":0},null,null," Vormonat Std.Saldo > ",null,null,null,null,{"$f":"$K5","v":0},null,null,null,null,null,null,"Gültigkeit ausbezahlt"]
["Urlaubstage",{"$f":"COUNTIF(D$8:D$38,\"U\")","v":0},null,null," Gesamt Std. Saldo > ",null,null,null,null,{"$f":"$J39+$J40","v":0},null,null,null,null,null,null,{"$f":"AND($K$41>=0,$K$41<=$J$41,MOD($K$41,0.25)=0)","v":true}]
["Krank",{"$f":"COUNTIF(D$8:D$38,\"K\")","v":0},null,null," Übertrag Std. Saldo > ",null,null,null,null,{"$f":"$J41","v":0},{"$f":"\" < Dieser Stunden-Saldo wird in das nächste \"&IF($Q$3=\"Dezember\",\"Jahr\",\"Monat\")&\" übertragen\"","v":" < Dieser Stunden-Saldo wird in das nächste Monat übertragen"}]
[null,null,null,"Z"]
[]
[{"$f":"\"Unterschrift von \"&Vorgesetzter","v":"Unterschrift von Vorname Nachname"},null,null,null,null,null,null,null,null,null,null,null,{"$f":"\"Unterschrift von \"&Name","v":"Unterschrift von Vorname Nachname"}]

{"sheet":"Dezember","index":12,"n_rows":45,"n_cols":46,"rows_kept":45,"cut":false,"hidden":true,"merged":[[42,4,42,8],[43,4,43,8],[44,0,44,3],[44,12,44,15],[36,11,36,15],[37,11,37,15],[38,2,41,3],[38,4,38,8],[38,10,40,15],[39,4,39,8],[40,4,40,8],[41,4,41,8],[41,10,41,15],[30,11,30,15],[31,11,31,15],[32,11,32,15],[33,11,33,15],[34,11,34,15],[35,11,35,15],[24,11,24,15],[25,11,25,15],[26,11,26,15],[27,11,27,15],[28,11,28,15],[29,11,29,15],[18,11,18,15],[19,11,19,15],[20,11,20,15],[21,11,21,15],[22,11,22,15],[23,11,23,15],[12,11,12,15],[13,11,13,15],[14,11,14,15],[15,11,15,15],[16,11,16,15],[17,11,17,15],[5,27,5,31],[7,11,7,15],[8,11,8,15],[9,11,9,15],[10,11,10,15],[11,11,11,15],[4,4,4,6],[4,7,4,9],[5,2,6,2],[5,3,6,3],[5,5,6,5],[5,6,6,6],[5,7,6,7],[5,8,6,8],[0,15,1,15],[1,5,1,8],[2,5,2,8],[3,0,3,3],[3,4,3,6],[3,7,3,9],[3,11,6,15],[4,0,6,0],[4,1,6,1],[4,2,4,3]]}
[{"$f":"Konfig!$A$1","v":" BOKU-Zeiterfassung für Wissenschaftliches Personal"},null,null,null,null,null,null,null,null,null,null,null,null,null,null,null,"Monat","Stunden-Saldo Grenzen","Status Blatteingabe"]
[{"$f":"\" Org.-Einh. : \"&OrgEinheit","v":" Org.-Einh. : Hxxxxx"},null,null,null,null,"Zeitmodell:",null,null,null,{"$f":"\" \"&Zeitmodell","v":" Vollzeit"},null,null,null,null,null,null,{"$f":"IF(ISNA($Q$4),1,$Q$4)","v":12},0,{"$f":"SUM($AT8:$AT38)","v":0}]
[{"$f":" \" Mitarbeiter: \"&Name","v":" Mitarbeiter: Vorname Nachname"},null,null,null,null,"Vorgesetzter:",null,null,null,{"$f":"\" \"&Vorgesetzter","v":" Vorname Nachname"},null,null,null,null,null,null,{"$f":"RIGHT(CELL(\"filename\",A1),LEN(CELL(\"filename\",A1))-SEARCH(\"]\",CELL(\"filename\",A1),1))","v":"Dezember"},null,{"$f":"IF($Q$2=1,$S$2,$S$2+INDIRECT($S$5))","v":0}]
[{"$f":" \" Monat: \"&$Q$3&\" \"&Jahr","v":" Monat: Dezember 2024"},null,null,null,"Dienstplan",null,null,"Normalstunden",null,null,"Übertrag","Anmerkungen ",null,null,null,null,{"$f":"IF(ISNA(VLOOKUP($Q$3,MTab,2,FALSE)),1,VLOOKUP($Q$3,MTab,2,FALSE))","v":12},null,"Übertrags Adresse Blatteingabe"]
[" Datum","Wochentag","Tagesinformation",null,{"$f":"\"Wochen-AZ\"&\" \"&TEXT(WAZ,\"[hh]:mm\")","v":"Wochen-AZ 40:00"},null,null," Stunden 1:1",null,null,{"$f":"IF(ISNA($Q$5),Übertrag,INDIRECT($Q$5))","v":0},null,null,null,null,null,{"$f":"IF(ISNA(VLOOKUP($Q$3,MTab,3,FALSE)),\"Übertrag\",VLOOKUP($Q$3,MTab,3,FALSE))","v":"November!$J$42"},null,{"$f":"IF(ISNA(VLOOKUP($Q$3,MTab,4,FALSE)),$Q$3&\"!$R$2\",VLOOKUP($Q$3,MTab,4,FALSE))","v":"November!$S$3"}]
[null,null," Feiertage\n Wochenende\n Urlaub, ZA, Krank","[U]rlaub\n[Z]A\n[K]rank","Normal-","Soll","MP","Von","Bis","Plus","Saldo",null,null,null,null,null,"Hintergrundberechnungen",null,null,null,null,null,null,"Saldo aktuell",null,null,null,"GAZ-Tabellenabbildung",null,null,null,null,"Eingabebeprüfungen"]
[null,null,null,null,"Arbeitszeit",null,null,null,null,"Minus","akuell",null,null,null,null,null,"Datum","Monat OK","Abwesenh.","Freie Tage","ÜA-Tage","Std.","Soll-Std.",{"$f":"IF(ISNA($Q$5),Übertrag,INDIRECT($Q$5))","v":0},"Std.-Soll = 0","Std.-Soll > 0","Std.-Soll < 0",null,{"$f":"I_GAZNAZVon","v":2},3,{"$f":"I_GAZNAZBis","v":4},null,"Zeiteingabe","UZK-Eing.\nerlaubt","UZK-Eing.\ngültig","Normalst. ein erlaubt","Normalstd.\neingegeben","Normal VON möglich OG","Normal VON möglich UG","Normal BIS möglich OG","Normal BIS möglich UG","Normal VON\n15min","Normal VON richtig","Normal BIS\n15min","Normal BIS richtig","Status Zeilen Eingabe"]
[{"$f":"IF($R8,$Q8,\"\")","v":"2024-12-01"},{"$f":"IF($R8,VLOOKUP(WEEKDAY($Q8,2),WOTA,2,FALSE),\"\")","v":"So"},{"$f":"IF($R8,\" \"&IF($S8=\"\",VLOOKUP($Q8,FListe,3,FALSE),$S8),\"\")","v":" 1. Advent"},null,{"$f":"IF(AND($R8,$T8<>\"F\"),IF($AC8=$AE8,\"keine NAZ\",TEXT($AC8,\"hh:mm\")&\"-\"&TEXT($AC8+$F8+$G8,\"hh:mm\")),\"\")","v":""},{"$f":"IF($R8,IF($T8=\"F\",0,VLOOKUP($B8,GAZ,I_GAZNAZMP,FALSE)),\"\")","v":"00:00:00"},{"$f":"IF($R8,$AD8,\"\")","v":"00:00:00"},null,null,{"$f":"IF(AND($R8,$AK8,NOT($Y8)),ROUND(($V8-$F8-$G8)*24,2),IF($D8=\"Z\",$F8*-24,\"\"))","v":""},{"$f":"$X8","v":0},null,null,null,null,null,{"$f":"DATE(Jahr,$Q2,1)","v":"2024-12-01"},{"$f":"$Q$2=MONTH($Q8)","v":true},{"$f":"IF(OR($D8=\"U\",$D8=\"Z\",$D8=\"ZK\",$D8=\"K\"),VLOOKUP($D8,UZK,2,FALSE),\"\")","v":""},{"$f":"IF($R8,VLOOKUP($Q8,FListe,4,FALSE),\"\")","v":"F"},{"$f":"IF($R8,VLOOKUP($Q8,FListe,5,FALSE),\"\")","v":"F"},{"$f":"$I8-$H8","v":0},{"$f":"IF($R8,ROUND($V8-$F8-$AD8,15),\"\")","v":0},{"$f":"IF($J8<>\"\",$X7+$J8,$X7)","v":0},{"$f":"($W8=0)","v":true},{"$f":"($W8>0)","v":false},{"$f":"($W8<0)","v":false},{"$f":"IF($U8=\"F\",\"\",TIME(0,0,0))","v":""},{"$f":"IF($U8=\"F\",\"\",IF(ISNA(VLOOKUP($B8,GAZ,AC$7,FALSE)),0,VLOOKUP($B8,GAZ,AC$7,FALSE)))","v":""},{"$f":"IF(OR($U8=\"F\",$S8<>\"\",ISNA(VLOOKUP($B8,GAZ,AD$7,FALSE))),0,IF(NOT($AK8),VLOOKUP($B8,GAZ,11,FALSE),IF(($I8-$H8)*24>=6,VLOOKUP($B8,GAZ,3,FALSE),0)))","v":"00:00:00"},{"$f":"IF($U8=\"F\",\"\",IF(ISNA(VLOOKUP($B8,GAZ,AE$7,FALSE)),0,VLOOKUP($B8,GAZ,AE$7,FALSE)))","v":""},{"$f":"IF($U8=\"F\",\"\",TIME(23,59,0))","v":""},{"$f":"OR($H8<>\"\",$I8<>\"\")","v":false},{"$f":"AND($T8<>\"F\",NOT($AG8),NOT($AC8=$AE8))","v":false},{"$f":"AND($AH8,OR($D8=\"U\",$D8=\"Z\",$D8=\"K\"))","v":false},{"$f":"AND($U8<>\"F\",$D8<>\"U\",$D8<>\"Z\",$D8<>\"K\",$R8)","v":false},{"$f":"AND($H8<>\"\",$I8<>\"\")","v":false},{"$f":"IF($AJ8,TagUG,\"\")","v":""},{"$f":"IF($AJ8,IF($I8=\"\",IF(AND($L8<>\"\",$L8<$AF8),$L8,IF(AND($M8<>\"\",$M8<$AF8),$M8,TagOG)),$I8),\"\")","v":""},{"$f":"IF($AJ8,IF($H8=\"\",$AB8,$H8),\"\")","v":""},{"$f":"IF($AJ8,IF(AND($L8<>\"\",$L8<$AF8),$L8,IF(AND($M8<>\"\",$M8<$AF8),$M8,TagOG)),\"\")","v":""},{"$f":"MOD($H8*24,0.25)=0","v":true},{"$f":"AND($AJ8,ISNUMBER($H8),$H8>=$AB8,$H8<=$AF8,OR($I8=\"\",$H8<=$I8))","v":false},{"$f":"MOD($I8*24,0.25)=0","v":true},{"$f":"AND($AJ8,ISNUMBER($I8),$I8>=$AB8,$I8<=$AF8,OR($H8=\"\",$I8>=$H8))","v":false},{"$f":"IF(AND(ISBLANK($D8),ISBLANK($H8),ISBLANK($I8)),0,1)","v":0}]
["2024-12-02","Mo"," ",null,{"$f":"IF(AND($R9,$T9<>\"F\"),IF($AC9=$AE9,\"keine NAZ\",TEXT($AC9,\"hh:mm\")&\"-\"&TEXT($AC9+$F9+$G9,\"hh:mm\")),\"\")","v":"08:00-16:00"},"08:00:00","00:00:00",null,null,"",0,null,null,null,null,null,{"$f":" Q8+1","v":"2024-12-02"},true,"","A","A",{"$f":"$I9-$H9","v":0},{"$f":"IF($R9,ROUND($V9-$F9-$AD9,15),\"\")","v":-0.33333333333333298},0,false,false,true,"00:00:00","08:00:00","00:00:00","16:00:00","23:59:00",false,true,false,true,false,"00:00:00","23:59:00",{"$f":"IF($AJ9,IF($H9=\"\",TagUG,$H9),\"\")","v":"00:00:00"},"23:59:00",true,false,true,false,0]
["2024-12-03","Di"," ",null,"08:00-16:00","08:00:00","00:00:00",null,null,"",0,null,null,null,null,null,"2024-12-03",true,"","A","A",0,-0.33333333333333298,0,false,false,true,"00:00:00","08:00:00","00:00:00","16:00:00","23:59:00",false,true,false,true,false,"00:00:00","23:59:00","00:00:00","23:59:00",true,false,true,false,0]
["2024-12-04","Mi"," ",null,"08:00-16:00","08:00:00","00:00:00",null,null,"",0,null,null,null,null,null,"2024-12-04",true,"","A","A",0,-0.33333333333333298,0,false,false,true,"00:00:00","08:00:00","00:00:00","16:00:00","23:59:00",false,true,false,true,false,"00:00:00","23:59:00","00:00:00","23:59:00",true,false,true,false,0]
["2024-12-05","Do"," ",null,"08:00-16:00","08:00:00","00:00:00",null,null,"",0,null,null,null,null,null,"2024-12-05",true,"","A","A",0,-0.33333333333333298,0,false,false,true,"00:00:00","08:00:00","00:00:00","16:00:00","23:59:00",false,true,false,true,false,"00:00:00","23:59:00","00:00:00","23:59:00",true,false,true,false,0]
["2024-12-06","Fr"," St. Nikolaus",null,"08:00-16:00","08:00:00","00:00:00",null,null,"",0,null,null,null,null,null,"2024-12-06",true,"","A","A",0,-0.33333333333333298,0,false,false,true,"00:00:00","08:00:00","00:00:00","16:00:00","23:59:00",false,true,false,true,false,"00:00:00","23:59:00","00:00:00","23:59:00",true,false,true,false,0]
["2024-12-07","Sa"," Wochenende",null,"","00:00:00","00:00:00",null,null,"",0,null,null,null,null,null,"2024-12-07",true,"","F","A",0,0,0,true,false,false,"00:00:00","00:00:00","00:00:00","00:00:00","23:59:00",false,false,false,true,false,"00:00:00","23:59:00","00:00:00","23:59:00",true,false,true,false,0]
["2024-12-08","So"," Maria Empfängnis",null,"","00:00:00","00:00:00",null,null,"",0,null,null,null,null,null,"2024-12-08",true,"","F","F",0,0,0,true,false,false,"","","00:00:00","","",false,false,false,false,false,"","","","",true,false,true,false,0]
["2024-12-09","Mo"," ",null,"08:00-16:00","08:00:00","00:00:00",null,null,"",0,null,null,null,null,null,"2024-12-09",true,"","A","A",0,-0.33333333333333298,0,false,false,true,"00:00:00","08:00:00","00:00:00","16:00:00","23:59:00",false,true,false,true,false,"00:00:00","23:59:00","00:00:00","23:59:00",true,false,true,false,0]
["2024-12-10","Di"," ",null,"08:00-16:00","08:00:00","00:00:00",null,null,"",0,null,null,null,null,null,"2024-12-10",true,"","A","A",0,-0.33333333333333298,0,false,false,true,"00:00:00","08:00:00","00:00:00","16:00:00","23:59:00",false,true,false,true,false,"00:00:00","23:59:00","00:00:00","23:59:00",true,false,true,false,0]
["2024-12-11","Mi"," ",null,"08:00-16:00","08:00:00","00:00:00",null,null,"",0,null,null,null,null,null,"2024-12-11",true,"","A","A",0,-0.33333333333333298,0,false,false,true,"00:00:00","08:00:00","00:00:00","16:00:00","23:59:00",false,true,false,true,false,"00:00:00","23:59:00","00:00:00","23:59:00",true,false,true,false,0]
["2024-12-12","Do"," ",null,"08:00-16:00","08:00:00","00:00:00",null,null,"",0,null,null,null,null,null,"2024-12-12",true,"","A","A",0,-0.33333333333333298,0,false,false,true,"00:00:00","08:00:00","00:00:00","16:00:00","23:59:00",false,true,false,true,false,"00:00:00","23:59:00","00:00:00","23:59:00",true,false,true,false,0]
["2024-12-13","Fr"," ",null,"08:00-16:00","08:00:00","00:00:00",null,null,"",0,null,null,null,null,null,"2024-12-13",true,"","A","A",0,-0.33333333333333298,0,false,false,true,"00:00:00","08:00:00","00:00:00","16:00:00","23:59:00",false,true,false,true,false,"00:00:00","23:59:00","00:00:00","23:59:00",true,false,true,false,0]
["2024-12-14","Sa"," Wochenende",null,"","00:00:00","00:00:00",null,null,"",0,null,null,null,null,null,"2024-12-14",true,"","F","A",0,0,0,true,false,false,"00:00:00","00:00:00","00:00:00","00:00:00","23:59:00",false,false,false,true,false,"00:00:00","23:59:00","00:00:00","23:59:00",true,false,true,false,0]
["2024-12-15","So"," 3. Advent",null,"","00:00:00","00:00:00",null,null,"",0,null,null,null,null,null,"2024-12-15",true,"","F","F",0,0,0,true,false,false,"","","00:00:00","","",false,false,false,false,false,"","","","",true,false,true,false,0]
["2024-12-16","Mo"," ",null,"08:00-16:00","08:00:00","00:00:00",null,null,"",0,null,null,null,null,null,"2024-12-16",true,"","A","A",0,-0.33333333333333298,0,false,false,true,"00:00:00","08:00:00","00:00:00","16:00:00","23:59:00",false,true,false,true,false,"00:00:00","23:59:00","00:00:00","23:59:00",true,false,true,false,0]
["2024-12-17","Di"," ",null,"08:00-16:00","08:00:00","00:00:00",null,null,"",0,null,null,null,null,null,"2024-12-17",true,"","A","A",0,-0.33333333333333298,0,false,false,true,"00:00:00","08:00:00","00:00:00","16:00:00","23:59:00",false,true,false,true,false,"00:00:00","23:59:00","00:00:00","23:59:00",true,false,true,false,0]
["2024-12-18","Mi"," ",null,"08:00-16:00","08:00:00","00:00:00",null,null,"",0,null,null,null,null,null,"2024-12-18",true,"","A","A",0,-0.33333333333333298,0,false,false,true,"00:00:00","08:00:00","00:00:00","16:00:00","23:59:00",false,true,false,true,false,"00:00:00","23:59:00","00:00:00","23:59:00",true,false,true,false,0]
["2024-12-19","Do"," ",null,"08:00-16:00","08:00:00","00:00:00",null,null,"",0,null,null,null,null,null,"2024-12-19",true,"","A","A",0,-0.33333333333333298,0,false,false,true,"00:00:00","08:00:00","00:00:00","16:00:00","23:59:00",false,true,false,true,false,"00:00:00","23:59:00","00:00:00","23:59:00",true,false,true,false,0]
["2024-12-20","Fr"," ",null,"08:00-16:00","08:00:00","00:00:00",null,null,"",0,null,null,null,null,null,"2024-12-20",true,"","A","A",0,-0.33333333333333298,0,false,false,true,"00:00:00","08:00:00","00:00:00","16:00:00","23:59:00",false,true,false,true,false,"00:00:00","23:59:00","00:00:00","23:59:00",true,false,true,false,0]
["2024-12-21","Sa"," Wochenende",null,"","00:00:00","00:00:00",null,null,"",0,null,null,null,null,null,"2024-12-21",true,"","F","A",0,0,0,true,false,false,"00:00:00","00:00:00","00:00:00","00:00:00","23:59:00",false,false,false,true,false,"00:00:00","23:59:00","00:00:00","23:59:00",true,false,true,false,0]
["2024-12-22","So"," 4. Advent",null,"","00:00:00","00:00:00",null,null,"",0,null,null,null,null,null,"2024-12-22",true,"","F","F",0,0,0,true,false,false,"","","00:00:00","","",false,false,false,false,false,"","","","",true,false,true,false,0]
["2024-12-23","Mo"," ",null,"08:00-16:00","08:00:00","00:00:00",null,null,"",0,null,null,null,null,null,"2024-12-23",true,"","A","A",0,-0.33333333333333298,0,false,false,true,"00:00:00","08:00:00","00:00:00","16:00:00","23:59:00",false,true,false,true,false,"00:00:00","23:59:00","00:00:00","23:59:00",true,false,true,false,0]
["2024-12-24","Di"," Hl. Abend",null,"08:00-16:00","08:00:00","00:00:00",null,null,"",0,null,null,null,null,null,"2024-12-24",true,"","A","A",0,-0.33333333333333298,0,false,false,true,"00:00:00","08:00:00","00:00:00","16:00:00","23:59:00",false,true,false,true,false,"00:00:00","23:59:00","00:00:00","23:59:00",true,false,true,false,0]
["2024-12-25","Mi"," Christtag",null,"","00:00:00","00:00:00",null,null,"",0,null,null,null,null,null,"2024-12-25",true,"","F","F",0,0,0,true,false,false,"","","00:00:00","","",false,false,false,false,false,"","","","",true,false,true,false,0]
["2024-12-26","Do"," Stefanitag",null,"","00:00:00","00:00:00",null,null,"",0,null,null,null,null,null,"2024-12-26",true,"","F","F",0,0,0,true,false,false,"","","00:00:00","","",false,false,false,false,false,"","","","",true,false,true,false,0]
["2024-12-27","Fr"," ",null,"08:00-16:00","08:00:00","00:00:00",null,null,"",0,null,null,null,null,null,"2024-12-27",true,"","A","A",0,-0.33333333333333298,0,false,false,true,"00:00:00","08:00:00","00:00:00","16:00:00","23:59:00",false,true,false,true,false,"00:00:00","23:59:00","00:00:00","23:59:00",true,false,true,false,0]
["2024-12-28","Sa"," Wochenende",null,"","00:00:00","00:00:00",null,null,"",0,null,null,null,null,null,"2024-12-28",true,"","F","A",0,0,0,true,false,false,"00:00:00","00:00:00","00:00:00","00:00:00","23:59:00",false,false,false,true,false,"00:00:00","23:59:00","00:00:00","23:59:00",true,false,true,false,0]
["2024-12-29","So"," Wochenende",null,"","00:00:00","00:00:00",null,null,"",0,null,null,null,null,null,"2024-12-29",true,"","F","F",0,0,0,true,false,false,"","","00:00:00","","",false,false,false,false,false,"","","","",true,false,true,false,0]
["2024-12-30","Mo"," ",null,"08:00-16:00","08:00:00","00:00:00",null,null,"",0,null,null,null,null,null,"2024-12-30",true,"","A","A",0,-0.33333333333333298,0,false,false,true,"00:00:00","08:00:00","00:00:00","16:00:00","23:59:00",false,true,false,true,false,"00:00:00","23:59:00","00:00:00","23:59:00",true,false,true,false,0]
["2024-12-31","Di"," Silvester",null,"08:00-16:00","08:00:00","00:00:00",null,null,"",0,null,null,null,null,null,"2024-12-31",true,"","A","A",0,-0.33333333333333298,0,false,false,true,"00:00:00","08:00:00","00:00:00","16:00:00","23:59:00",false,true,false,true,false,"00:00:00","23:59:00","00:00:00","23:59:00",true,false,true,false,0]
["Arbeitstage",{"$f":"COUNTIF(T$8:T$38,\"A\")","v":20},null,null,{"$f":"\"Monat Std.-Saldo (~15min) > \"","v":"Monat Std.-Saldo (~15min) > "},null,null,null,null,{"$f":"ROUND(SUM(J8:J38)*4,0)/4","v":0}]
["ZA-Tage",{"$f":"COUNTIF(D$8:D$38,\"Z\")","v":0},null,null," Vormonat Std.Saldo > ",null,null,null,null,{"$f":"$K5","v":0},null,null,null,null,null,null,"Gültigkeit ausbezahlt"]
["Urlaubstage",{"$f":"COUNTIF(D$8:D$38,\"U\")","v":0},null,null," Gesamt Std. Saldo > ",null,null,null,null,{"$f":"$J39+$J40","v":0},null,null,null,null,null,null,{"$f":"AND($K$41>=0,$K$41<=$J$41,MOD($K$41,0.25)=0)","v":true}]
["Krank",{"$f":"COUNTIF(D$8:D$38,\"K\")","v":0},null,null," Übertrag Std. Saldo > ",null,null,null,null,{"$f":"$J41","v":0},{"$f":"\" < Dieser Stunden-Saldo wird in das nächste \"&IF($Q$3=\"Dezember\",\"Jahr\",\"Monat\")&\" übertragen\"","v":" < Dieser Stunden-Saldo wird in das nächste Jahr übertragen"}]
[null,null,null,"Z"]
[]
[{"$f":"\"Unterschrift von \"&Vorgesetzter","v":"Unterschrift von Vorname Nachname"},null,null,null,null,null,null,null,null,null,null,null,{"$f":"\"Unterschrift von \"&Name","v":"Unterschrift von Vorname Nachname"}]

{"sheet":"Monat","index":13,"n_rows":45,"n_cols":46,"rows_kept":45,"cut":false,"hidden":true,"merged":[[30,11,30,15],[31,11,31,15],[36,11,36,15],[37,11,37,15],[32,11,32,15],[33,11,33,15],[34,11,34,15],[35,11,35,15],[25,11,25,15],[26,11,26,15],[27,11,27,15],[28,11,28,15],[29,11,29,15],[5,27,5,31],[40,4,40,8],[38,4,38,8],[5,6,6,6],[8,11,8,15],[9,11,9,15],[10,11,10,15],[11,11,11,15],[5,7,6,7],[5,5,6,5],[38,10,40,15],[3,11,6,15],[7,11,7,15],[14,11,14,15],[15,11,15,15],[16,11,16,15],[44,0,44,3],[3,0,3,3],[12,11,12,15],[13,11,13,15],[4,1,6,1],[4,0,6,0],[5,3,6,3],[5,2,6,2],[4,2,4,3],[4,7,4,9],[38,2,41,3],[41,10,41,15],[41,4,41,8],[17,11,17,15],[18,11,18,15],[19,11,19,15],[44,12,44,15],[1,5,1,8],[2,5,2,8],[43,4,43,8],[0,15,1,15],[42,4,42,8],[39,4,39,8],[5,8,6,8],[3,7,3,9],[3,4,3,6],[4,4,4,6],[20,11,20,15],[21,11,21,15],[22,11,22,15],[23,11,23,15],[24,11,24,15]]}
[{"$f":"Konfig!$A$1","v":" BOKU-Zeiterfassung für Wissenschaftliches Personal"},null,null,null,null,null,null,null,null,null,null,null,null,null,null,null,"Monat","Stunden-Saldo Grenzen","Status Blatteingabe"]
[{"$f":"\" Org.-Einh. : \"&OrgEinheit","v":" Org.-Einh. : Hxxxxx"},null,null,null,null,"Zeitmodell:",null,null,null,{"$f":"\" \"&Zeitmodell","v":" Vollzeit"},null,null,null,null,null,null,{"$f":"IF(ISNA($Q$4),1,$Q$4)","v":1},0,{"$f":"SUM($AT8:$AT38)","v":0}]
[{"$f":" \" Mitarbeiter: \"&Name","v":" Mitarbeiter: Vorname Nachname"},null,null,null,null,"Vorgesetzter:",null,null,null,{"$f":"\" \"&Vorgesetzter","v":" Vorname Nachname"},null,null,null,null,null,null,{"$f":"RIGHT(CELL(\"filename\",A1),LEN(CELL(\"filename\",A1))-SEARCH(\"]\",CELL(\"filename\",A1),1))","v":"Monat"},null,{"$f":"IF($Q$2=1,$S$2,$S$2+INDIRECT($S$5))","v":0}]
[{"$f":" \" Monat: \"&$Q$3&\" \"&Jahr","v":" Monat: Monat 2024"},null,null,null,"Dienstplan",null,null,"Normalstunden",null,null,"Übertrag","Anmerkungen ",null,null,null,null,{"$f":"IF(ISNA(VLOOKUP($Q$3,MTab,2,FALSE)),1,VLOOKUP($Q$3,MTab,2,FALSE))","v":1},null,"Übertrags Adresse Blatteingabe"]
[" Datum","Wochentag","Tagesinformation",null,{"$f":"\"Wochen-AZ\"&\" \"&TEXT(WAZ,\"[hh]:mm\")","v":"Wochen-AZ 40:00"},null,null," Stunden 1:1",null,null,{"$f":"IF(ISNA($Q$5),Übertrag,INDIRECT($Q$5))","v":0},null,null,null,null,null,{"$f":"IF(ISNA(VLOOKUP($Q$3,MTab,3,FALSE)),\"Übertrag\",VLOOKUP($Q$3,MTab,3,FALSE))","v":"Übertrag"},null,{"$f":"IF(ISNA(VLOOKUP($Q$3,MTab,4,FALSE)),$Q$3&\"!$R$2\",VLOOKUP($Q$3,MTab,4,FALSE))","v":"Monat!$R$2"}]
[null,null," Feiertage\n Wochenende\n Urlaub, ZA, Krank","[U]rlaub\n[Z]A\n[K]rank","Normal-","Soll","MP","Von","Bis","Plus","Saldo",null,null,null,null,null,"Hintergrundberechnungen",null,null,null,null,null,null,"Saldo aktuell",null,null,null,"GAZ-Tabellenabbildung",null,null,null,null,"Eingabebeprüfungen"]
[null,null,null,null,"Arbeitszeit",null,null,null,null,"Minus","akuell",null,null,null,null,null,"Datum","Monat OK","Abwesenh.","Freie Tage","ÜA-Tage","Std.","Soll-Std.",{"$f":"IF(ISNA($Q$5),Übertrag,INDIRECT($Q$5))","v":0},"Std.-Soll = 0","Std.-Soll > 0","Std.-Soll < 0",null,{"$f":"I_GAZNAZVon","v":2},3,{"$f":"I_GAZNAZBis","v":4},null,"Zeiteingabe","UZK-Eing.\nerlaubt","UZK-Eing.\ngültig","Normalst. ein erlaubt","Normalstd.\neingegeben","Normal VON möglich OG","Normal VON möglich UG","Normal BIS möglich OG","Normal BIS möglich UG","Normal VON\n15min","Normal VON richtig","Normal BIS\n15min","Normal BIS richtig","Status Zeilen Eingabe"]
[{"$f":"IF($R8,$Q8,\"\")","v":"2024-01-01"},{"$f":"IF($R8,VLOOKUP(WEEKDAY($Q8,2),WOTA,2,FALSE),\"\")","v":"Mo"},{"$f":"IF($R8,\" \"&IF($S8=\"\",VLOOKUP($Q8,FListe,3,FALSE),$S8),\"\")","v":" Neujahrstag"},null,{"$f":"IF(AND($R8,$T8<>\"F\"),IF($AC8=$AE8,\"keine NAZ\",TEXT($AC8,\"hh:mm\")&\"-\"&TEXT($AC8+$F8+$G8,\"hh:mm\")),\"\")","v":""},{"$f":"IF($R8,IF($T8=\"F\",0,VLOOKUP($B8,GAZ,I_GAZNAZMP,FALSE)),\"\")","v":"00:00:00"},{"$f":"IF($R8,$AD8,\"\")","v":"00:00:00"},null,null,{"$f":"IF(AND($R8,$AK8,NOT($Y8)),ROUND(($V8-$F8-$G8)*24,2),IF($D8=\"Z\",$F8*-24,\"\"))","v":""},{"$f":"$X8","v":0},null,null,null,null,null,{"$f":"DATE(Jahr,$Q2,1)","v":"2024-01-01"},{"$f":"$Q$2=MONTH($Q8)","v":true},{"$f":"IF(OR($D8=\"U\",$D8=\"Z\",$D8=\"ZK\",$D8=\"K\"),VLOOKUP($D8,UZK,2,FALSE),\"\")","v":""},{"$f":"IF($R8,VLOOKUP($Q8,FListe,4,FALSE),\"\")","v":"F"},{"$f":"IF($R8,VLOOKUP($Q8,FListe,5,FALSE),\"\")","v":"F"},{"$f":"$I8-$H8","v":0},{"$f":"IF($R8,ROUND($V8-$F8-$AD8,15),\"\")","v":0},{"$f":"IF($J8<>\"\",$X7+$J8,$X7)","v":0},{"$f":"($W8=0)","v":true},{"$f":"($W8>0)","v":false},{"$f":"($W8<0)","v":false},{"$f":"IF($U8=\"F\",\"\",TIME(0,0,0))","v":""},{"$f":"IF($U8=\"F\",\"\",IF(ISNA(VLOOKUP($B8,GAZ,AC$7,FALSE)),0,VLOOKUP($B8,GAZ,AC$7,FALSE)))","v":""},{"$f":"IF(OR($U8=\"F\",$S8<>\"\",ISNA(VLOOKUP($B8,GAZ,AD$7,FALSE))),0,IF(NOT($AK8),VLOOKUP($B8,GAZ,11,FALSE),IF(($I8-$H8)*24>=6,VLOOKUP($B8,GAZ,3,FALSE),0)))","v":"00:00:00"},{"$f":"IF($U8=\"F\",\"\",IF(ISNA(VLOOKUP($B8,GAZ,AE$7,FALSE)),0,VLOOKUP($B8,GAZ,AE$7,FALSE)))","v":""},{"$f":"IF($U8=\"F\",\"\",TIME(23,59,0))","v":""},{"$f":"OR($H8<>\"\",$I8<>\"\")","v":false},{"$f":"AND($T8<>\"F\",NOT($AG8),NOT($AC8=$AE8))","v":false},{"$f":"AND($AH8,OR($D8=\"U\",$D8=\"Z\",$D8=\"K\"))","v":false},{"$f":"AND($U8<>\"F\",$D8<>\"U\",$D8<>\"Z\",$D8<>\"K\",$R8)","v":false},{"$f":"AND($H8<>\"\",$I8<>\"\")","v":false},{"$f":"IF($AJ8,TagUG,\"\")","v":""},{"$f":"IF($AJ8,IF($I8=\"\",IF(AND($L8<>\"\",$L8<$AF8),$L8,IF(AND($M8<>\"\",$M8<$AF8),$M8,TagOG)),$I8),\"\")","v":""},{"$f":"IF($AJ8,IF($H8=\"\",$AB8,$H8),\"\")","v":""},{"$f":"IF($AJ8,IF(AND($L8<>\"\",$L8<$AF8),$L8,IF(AND($M8<>\"\",$M8<$AF8),$M8,TagOG)),\"\")","v":""},{"$f":"MOD($H8*24,0.25)=0","v":true},{"$f":"AND($AJ8,ISNUMBER($H8),$H8>=$AB8,$H8<=$AF8,OR($I8=\"\",$H8<=$I8))","v":false},{"$f":"MOD($I8*24,0.25)=0","v":true},{"$f":"AND($AJ8,ISNUMBER($I8),$I8>=$AB8,$I8<=$AF8,OR($H8=\"\",$I8>=$H8))","v":false},{"$f":"IF(AND(ISBLANK($D8),ISBLANK($H8),ISBLANK($I8)),0,1)","v":0}]
["2024-01-02","Di"," ",null,{"$f":"IF(AND($R9,$T9<>\"F\"),IF($AC9=$AE9,\"keine NAZ\",TEXT($AC9,\"hh:mm\")&\"-\"&TEXT($AC9+$F9+$G9,\"hh:mm\")),\"\")","v":"08:00-16:00"},"08:00:00","00:00:00",null,null,"",0,null,null,null,null,null,{"$f":" Q8+1","v":"2024-01-02"},true,"","A","A",{"$f":"$I9-$H9","v":0},{"$f":"IF($R9,ROUND($V9-$F9-$AD9,15),\"\")","v":-0.33333333333333298},0,false,false,true,"00:00:00","08:00:00","00:00:00","16:00:00","23:59:00",false,true,false,true,false,"00:00:00","23:59:00",{"$f":"IF($AJ9,IF($H9=\"\",TagUG,$H9),\"\")","v":"00:00:00"},"23:59:00",true,false,true,false,0]
["2024-01-03","Mi"," ",null,"08:00-16:00","08:00:00","00:00:00",null,null,"",0,null,null,null,null,null,"2024-01-03",true,"","A","A",0,-0.33333333333333298,0,false,false,true,"00:00:00","08:00:00","00:00:00","16:00:00","23:59:00",false,true,false,true,false,"00:00:00","23:59:00","00:00:00","23:59:00",true,false,true,false,0]
["2024-01-04","Do"," ",null,"08:00-16:00","08:00:00","00:00:00",null,null,"",0,null,null,null,null,null,"2024-01-04",true,"","A","A",0,-0.33333333333333298,0,false,false,true,"00:00:00","08:00:00","00:00:00","16:00:00","23:59:00",false,true,false,true,false,"00:00:00","23:59:00","00:00:00","23:59:00",true,false,true,false,0]
["2024-01-05","Fr"," ",null,"08:00-16:00","08:00:00","00:00:00",null,null,"",0,null,null,null,null,null,"2024-01-05",true,"","A","A",0,-0.33333333333333298,0,false,false,true,"00:00:00","08:00:00","00:00:00","16:00:00","23:59:00",false,true,false,true,false,"00:00:00","23:59:00","00:00:00","23:59:00",true,false,true,false,0]
["2024-01-06","Sa"," Hl. drei Könige",null,"","00:00:00","00:00:00",null,null,"",0,null,null,null,null,null,"2024-01-06",true,"","F","F",0,0,0,true,false,false,"","","00:00:00","","",false,false,false,false,false,"","","","",true,false,true,false,0]
["2024-01-07","So"," Wochenende",null,"","00:00:00","00:00:00",null,null,"",0,null,null,null,null,null,"2024-01-07",true,"","F","F",0,0,0,true,false,false,"","","00:00:00","","",false,false,false,false,false,"","","","",true,false,true,false,0]
["2024-01-08","Mo"," ",null,"08:00-16:00","08:00:00","00:00:00",null,null,"",0,null,null,null,null,null,"2024-01-08",true,"","A","A",0,-0.33333333333333298,0,false,false,true,"00:00:00","08:00:00","00:00:00","16:00:00","23:59:00",false,true,false,true,false,"00:00:00","23:59:00","00:00:00","23:59:00",true,false,true,false,0]
["2024-01-09","Di"," ",null,"08:00-16:00","08:00:00","00:00:00",null,null,"",0,null,null,null,null,null,"2024-01-09",true,"","A","A",0,-0.33333333333333298,0,false,false,true,"00:00:00","08:00:00","00:00:00","16:00:00","23:59:00",false,true,false,true,false,"00:00:00","23:59:00","00:00:00","23:59:00",true,false,true,false,0]
["2024-01-10","Mi"," ",null,"08:00-16:00","08:00:00","00:00:00",null,null,"",0,null,null,null,null,null,"2024-01-10",true,"","A","A",0,-0.33333333333333298,0,false,false,true,"00:00:00","08:00:00","00:00:00","16:00:00","23:59:00",false,true,false,true,false,"00:00:00","23:59:00","00:00:00","23:59:00",true,false,true,false,0]
["2024-01-11","Do"," ",null,"08:00-16:00","08:00:00","00:00:00",null,null,"",0,null,null,null,null,null,"2024-01-11",true,"","A","A",0,-0.33333333333333298,0,false,false,true,"00:00:00","08:00:00","00:00:00","16:00:00","23:59:00",false,true,false,true,false,"00:00:00","23:59:00","00:00:00","23:59:00",true,false,true,false,0]
["2024-01-12","Fr"," ",null,"08:00-16:00","08:00:00","00:00:00",null,null,"",0,null,null,null,null,null,"2024-01-12",true,"","A","A",0,-0.33333333333333298,0,false,false,true,"00:00:00","08:00:00","00:00:00","16:00:00","23:59:00",false,true,false,true,false,"00:00:00","23:59:00","00:00:00","23:59:00",true,false,true,false,0]
["2024-01-13","Sa"," Wochenende",null,"","00:00:00","00:00:00",null,null,"",0,null,null,null,null,null,"2024-01-13",true,"","F","A",0,0,0,true,false,false,"00:00:00","00:00:00","00:00:00","00:00:00","23:59:00",false,false,false,true,false,"00:00:00","23:59:00","00:00:00","23:59:00",true,false,true,false,0]
["2024-01-14","So"," Wochenende",null,"","00:00:00","00:00:00",null,null,"",0,null,null,null,null,null,"2024-01-14",true,"","F","F",0,0,0,true,false,false,"","","00:00:00","","",false,false,false,false,false,"","","","",true,false,true,false,0]
["2024-01-15","Mo"," ",null,"08:00-16:00","08:00:00","00:00:00",null,null,"",0,null,null,null,null,null,"2024-01-15",true,"","A","A",0,-0.33333333333333298,0,false,false,true,"00:00:00","08:00:00","00:00:00","16:00:00","23:59:00",false,true,false,true,false,"00:00:00","23:59:00","00:00:00","23:59:00",true,false,true,false,0]
["2024-01-16","Di"," ",null,"08:00-16:00","08:00:00","00:00:00",null,null,"",0,null,null,null,null,null,"2024-01-16",true,"","A","A",0,-0.33333333333333298,0,false,false,true,"00:00:00","08:00:00","00:00:00","16:00:00","23:59:00",false,true,false,true,false,"00:00:00","23:59:00","00:00:00","23:59:00",true,false,true,false,0]
["2024-01-17","Mi"," ",null,"08:00-16:00","08:00:00","00:00:00",null,null,"",0,null,null,null,null,null,"2024-01-17",true,"","A","A",0,-0.33333333333333298,0,false,false,true,"00:00:00","08:00:00","00:00:00","16:00:00","23:59:00",false,true,false,true,false,"00:00:00","23:59:00","00:00:00","23:59:00",true,false,true,false,0]
["2024-01-18","Do"," ",null,"08:00-16:00","08:00:00","00:00:00",null,null,"",0,null,null,null,null,null,"2024-01-18",true,"","A","A",0,-0.33333333333333298,0,false,false,true,"00:00:00","08:00:00","00:00:00","16:00:00","23:59:00",false,true,false,true,false,"00:00:00","23:59:00","00:00:00","23:59:00",true,false,true,false,0]
["2024-01-19","Fr"," ",null,"08:00-16:00","08:00:00","00:00:00",null,null,"",0,null,null,null,null,null,"2024-01-19",true,"","A","A",0,-0.33333333333333298,0,false,false,true,"00:00:00","08:00:00","00:00:00","16:00:00","23:59:00",false,true,false,true,false,"00:00:00","23:59:00","00:00:00","23:59:00",true,false,true,false,0]
["2024-01-20","Sa"," Wochenende",null,"","00:00:00","00:00:00",null,null,"",0,null,null,null,null,null,"2024-01-20",true,"","F","A",0,0,0,true,false,false,"00:00:00","00:00:00","00:00:00","00:00:00","23:59:00",false,false,false,true,false,"00:00:00","23:59:00","00:00:00","23:59:00",true,false,true,false,0]
["2024-01-21","So"," Wochenende",null,"","00:00:00","00:00:00",null,null,"",0,null,null,null,null,null,"2024-01-21",true,"","F","F",0,0,0,true,false,false,"","","00:00:00","","",false,false,false,false,false,"","","","",true,false,true,false,0]
["2024-01-22","Mo"," ",null,"08:00-16:00","08:00:00","00:00:00",null,null,"",0,null,null,null,null,null,"2024-01-22",true,"","A","A",0,-0.33333333333333298,0,false,false,true,"00:00:00","08:00:00","00:00:00","16:00:00","23:59:00",false,true,false,true,false,"00:00:00","23:59:00","00:00:00","23:59:00",true,false,true,false,0]
["2024-01-23","Di"," ",null,"08:00-16:00","08:00:00","00:00:00",null,null,"",0,null,null,null,null,null,"2024-01-23",true,"","A","A",0,-0.33333333333333298,0,false,false,true,"00:00:00","08:00:00","00:00:00","16:00:00","23:59:00",false,true,false,true,false,"00:00:00","23:59:00","00:00:00","23:59:00",true,false,true,false,0]
["2024-01-24","Mi"," ",null,"08:00-16:00","08:00:00","00:00:00",null,null,"",0,null,null,null,null,null,"2024-01-24",true,"","A","A",0,-0.33333333333333298,0,false,false,true,"00:00:00","08:00:00","00:00:00","16:00:00","23:59:00",false,true,false,true,false,"00:00:00","23:59:00","00:00:00","23:59:00",true,false,true,false,0]
["2024-01-25","Do"," ",null,"08:00-16:00","08:00:00","00:00:00",null,null,"",0,null,null,null,null,null,"2024-01-25",true,"","A","A",0,-0.33333333333333298,0,false,false,true,"00:00:00","08:00:00","00:00:00","16:00:00","23:59:00",false,true,false,true,false,"00:00:00","23:59:00","00:00:00","23:59:00",true,false,true,false,0]
["2024-01-26","Fr"," ",null,"08:00-16:00","08:00:00","00:00:00",null,null,"",0,null,null,null,null,null,"2024-01-26",true,"","A","A",0,-0.33333333333333298,0,false,false,true,"00:00:00","08:00:00","00:00:00","16:00:00","23:59:00",false,true,false,true,false,"00:00:00","23:59:00","00:00:00","23:59:00",true,false,true,false,0]
["2024-01-27","Sa"," Wochenende",null,"","00:00:00","00:00:00",null,null,"",0,null,null,null,null,null,"2024-01-27",true,"","F","A",0,0,0,true,false,false,"00:00:00","00:00:00","00:00:00","00:00:00","23:59:00",false,false,false,true,false,"00:00:00","23:59:00","00:00:00","23:59:00",true,false,true,false,0]
["2024-01-28","So"," Wochenende",null,"","00:00:00","00:00:00",null,null,"",0,null,null,null,null,null,"2024-01-28",true,"","F","F",0,0,0,true,false,false,"","","00:00:00","","",false,false,false,false,false,"","","","",true,false,true,false,0]
["2024-01-29","Mo"," ",null,"08:00-16:00","08:00:00","00:00:00",null,null,"",0,null,null,null,null,null,"2024-01-29",true,"","A","A",0,-0.33333333333333298,0,false,false,true,"00:00:00","08:00:00","00:00:00","16:00:00","23:59:00",false,true,false,true,false,"00:00:00","23:59:00","00:00:00","23:59:00",true,false,true,false,0]
["2024-01-30","Di"," ",null,"08:00-16:00","08:00:00","00:00:00",null,null,"",0,null,null,null,null,null,"2024-01-30",true,"","A","A",0,-0.33333333333333298,0,false,false,true,"00:00:00","08:00:00","00:00:00","16:00:00","23:59:00",false,true,false,true,false,"00:00:00","23:59:00","00:00:00","23:59:00",true,false,true,false,0]
["2024-01-31","Mi"," ",null,"08:00-16:00","08:00:00","00:00:00",null,null,"",0,null,null,null,null,null,"2024-01-31",true,"","A","A",0,-0.33333333333333298,0,false,false,true,"00:00:00","08:00:00","00:00:00","16:00:00","23:59:00",false,true,false,true,false,"00:00:00","23:59:00","00:00:00","23:59:00",true,false,true,false,0]
["Arbeitstage",{"$f":"COUNTIF(T$8:T$38,\"A\")","v":22},null,null,{"$f":"\"Monat Std.-Saldo (~15min) > \"","v":"Monat Std.-Saldo (~15min) > "},null,null,null,null,{"$f":"ROUND(SUM(J8:J38)*4,0)/4","v":0}]
["ZA-Tage",{"$f":"COUNTIF(D$8:D$38,\"Z\")","v":0},null,null," Vormonat Std.Saldo > ",null,null,null,null,{"$f":"$K5","v":0},null,null,null,null,null,null,"Gültigkeit ausbezahlt"]
["Urlaubstage",{"$f":"COUNTIF(D$8:D$38,\"U\")","v":0},null,null," Gesamt Std. Saldo > ",null,null,null,null,{"$f":"$J39+$J40","v":0},null,null,null,null,null,null,{"$f":"AND($K$41>=0,$K$41<=$J$41,MOD($K$41,0.25)=0)","v":true}]
["Krank",{"$f":"COUNTIF(D$8:D$38,\"K\")","v":0},null,null," Übertrag Std. Saldo > ",null,null,null,null,{"$f":"$J41","v":0},{"$f":"\" < Dieser Stunden-Saldo wird in das nächste \"&IF($Q$3=\"Dezember\",\"Jahr\",\"Monat\")&\" übertragen\"","v":" < Dieser Stunden-Saldo wird in das nächste Monat übertragen"}]
[null,null,null,"Z"]
[]
[{"$f":"\"Unterschrift von \"&Vorgesetzter","v":"Unterschrift von Vorname Nachname"},null,null,null,null,null,null,null,null,null,null,null,{"$f":"\"Unterschrift von \"&Name","v":"Unterschrift von Vorname Nachname"}]

{"sheet":"Hilfskonfig","index":14,"n_rows":14,"n_cols":14,"rows_kept":14,"cut":false,"hidden":true,"merged":[[0,0,0,1],[0,4,0,7],[0,2,0,3],[0,8,0,11]]}
["GAZ-Zuordnung",null,"Stundengrenzen",null,"NAZ-Definiton Standard",null,null,null,"Monats-Setup",null,null,null,"Übertrag Adresse","Blatteintrag Adresse"]
["Spaltenname","Spalte","NormalOG",{"$f":"72*WAZ*24/40","v":71.999999999999986},"NAZVon","KZVon","KZBis","NAZBis","Name","Nr.","Vorgänger Übertrag","Vorgänger Blatteingabe",{"$f":"\"!$J$42\"","v":"!$J$42"},{"$f":"\"!$S$3\"","v":"!$S$3"}]
["GAZ Wochentage, I_GAZWT",1,"NormalUG",{"$f":"-24*WAZ*24/40","v":-24},{"$f":"IF(Zeitmodell=\"Vollzeit\",TIME(8,0,0),TIME(9,0,0))","v":0.33333333333333331},0.375,0.58333333333333337,{"$f":"IF(Zeitmodell=\"Vollzeit\",TIME(16,0,0),TIME(13,0,0))","v":0.66666666666666663},"Jänner",1,"Übertrag","Jänner!$S$2"]
["GAZ Normalarbeitszeit Von, I_GAZNAZVon",2,"NormalOGDez",{"$f":"24*WAZ*24/40","v":24},{"$f":"IF(Zeitmodell=\"Vollzeit\",TIME(8,0,0),TIME(9,0,0))","v":0.33333333333333331},0.375,0.58333333333333337,{"$f":"IF(Zeitmodell=\"Vollzeit\",TIME(16,0,0),TIME(13,0,0))","v":0.66666666666666663},"Februar",2,{"$f":"$I3&$M$2","v":"Jänner!$J$42"},{"$f":"$I3&$N$2","v":"Jänner!$S$3"}]
["GAZ Mittagspause, I_GAZMP",{"$f":"B4+1","v":3},"NormalUGDez",{"$f":"-8*WAZ*24/40","v":-8},{"$f":"IF(Zeitmodell=\"Vollzeit\",TIME(8,0,0),TIME(9,0,0))","v":0.33333333333333331},0.375,0.58333333333333337,{"$f":"IF(Zeitmodell=\"Vollzeit\",TIME(16,0,0),TIME(13,0,0))","v":0.66666666666666663},"März",3,"Februar!$J$42",{"$f":"$I4&$N$2","v":"Februar!$S$3"}]
["GAZ Normalarbeitszeit Bis, I_GAZNAZBis",{"$f":"B5+1","v":4},"TagOG",{"$f":"TIME(23,59,0)","v":"23:59:00"},{"$f":"IF(Zeitmodell=\"Vollzeit\",TIME(8,0,0),TIME(9,0,0))","v":0.33333333333333331},0.375,0.58333333333333337,{"$f":"IF(Zeitmodell=\"Vollzeit\",TIME(16,0,0),TIME(13,0,0))","v":0.66666666666666663},"April",4,"März!$J$42","März!$S$3"]
["GAZ Normalarbeitszeitstunden, I_GAZNAZ",{"$f":"B6+1","v":5},"TagUG",{"$f":"TIME(0,0,0)","v":"00:00:00"},{"$f":"IF(Zeitmodell=\"Vollzeit\",TIME(8,0,0),TIME(9,0,0))","v":0.33333333333333331},0.375,0.5,{"$f":"IF(Zeitmodell=\"Vollzeit\",TIME(16,0,0),TIME(13,0,0))","v":0.66666666666666663},"Mai",5,"April!$J$42","April!$S$3"]
["GAZ NAZMP, I_GAZNAZMP",6,null,null,null,null,null,null,"Juni",6,"Mai!$J$42","Mai!$S$3"]
[null,null,null,null,null,null,null,null,"Juli",7,"Juni!$J$42","Juni!$S$3"]
[null,null,null,null,null,null,null,null,"August",8,"Juli!$J$42","Juli!$S$3"]
[null,null,null,null,null,null,null,null,"September",9,"August!$J$42","August!$S$3"]
[null,null,null,null,null,null,null,null,"Oktober",10,"September!$J$42","September!$S$3"]
[null,null,null,null,null,null,null,null,"November",11,"Oktober!$J$42","Oktober!$S$3"]
[null,null,null,null,null,null,null,null,"Dezember",12,"November!$J$42","November!$S$3"]

{"sheet":"Format","index":15,"n_rows":45,"n_cols":46,"rows_kept":45,"cut":false,"hidden":true,"merged":[[0,15,1,15],[1,5,1,8],[2,5,2,8],[3,0,3,3],[3,4,3,6],[3,7,3,9],[3,11,6,15],[4,0,6,0],[4,1,6,1],[4,2,4,3],[11,11,11,15],[4,4,4,6],[4,7,4,9],[5,2,6,2],[5,3,6,3],[5,5,6,5],[5,6,6,6],[5,7,6,7],[5,8,6,8],[5,27,5,31],[7,11,7,15],[8,11,8,15],[9,11,9,15],[10,11,10,15],[23,11,23,15],[12,11,12,15],[13,11,13,15],[14,11,14,15],[15,11,15,15],[16,11,16,15],[17,11,17,15],[18,11,18,15],[19,11,19,15],[20,11,20,15],[21,11,21,15],[22,11,22,15],[35,11,35,15],[24,11,24,15],[25,11,25,15],[26,11,26,15],[27,11,27,15],[28,11,28,15],[29,11,29,15],[30,11,30,15],[31,11,31,15],[32,11,32,15],[33,11,33,15],[34,11,34,15],[42,4,42,8],[43,4,43,8],[44,0,44,3],[44,12,44,15],[36,11,36,15],[37,11,37,15],[38,2,41,3],[38,4,38,8],[38,10,40,15],[39,4,39,8],[40,4,40,8],[41,4,41,8],[41,10,41,15]]}
[{"$f":"Konfig!$A$1","v":" BOKU-Zeiterfassung für Wissenschaftliches Personal"},null,null,null,null,null,null,null,null,null,null,null,null,null,null,null,"Monat","Stunden-Saldo Grenzen","Status Blatteingabe"]
[{"$f":"\" Org.-Einh. : \"&OrgEinheit","v":" Org.-Einh. : Hxxxxx"},null,null,null,null,"Zeitmodell:",null,null,null,{"$f":"\" \"&Zeitmodell","v":" Vollzeit"},null,null,null,null,null,null,{"$f":"IF(ISNA($Q$4),1,$Q$4)","v":1},0,{"$f":"SUM($AT8:$AT38)","v":0}]
[{"$f":" \" Mitarbeiter: \"&Name","v":" Mitarbeiter: Vorname Nachname"},null,null,null,null,"Vorgesetzter:",null,null,null,{"$f":"\" \"&Vorgesetzter","v":" Vorname Nachname"},null,null,null,null,null,null,{"$f":"RIGHT(CELL(\"filename\",A1),LEN(CELL(\"filename\",A1))-SEARCH(\"]\",CELL(\"filename\",A1),1))","v":"Format"},null,{"$f":"IF($Q$2=1,$S$2,$S$2+INDIRECT($S$5))","v":0}]
[{"$f":" \" Monat: \"&$Q$3&\" \"&Jahr","v":" Monat: Format 2024"},null,null,null,"Dienstplan",null,null,"Normalstunden",null,null,"Übertrag","Anmerkungen ",null,null,null,null,{"$f":"IF(ISNA(VLOOKUP($Q$3,MTab,2,FALSE)),1,VLOOKUP($Q$3,MTab,2,FALSE))","v":1},null,"Übertrags Adresse Blatteingabe"]
[" Datum","Wochentag","Tagesinformation",null,{"$f":"\"Wochen-AZ\"&\" \"&TEXT(WAZ,\"[hh]:mm\")","v":"Wochen-AZ 40:00"},null,null," Stunden 1:1",null,null,{"$f":"IF(ISNA($Q$5),Übertrag,INDIRECT($Q$5))","v":0},null,null,null,null,null,{"$f":"IF(ISNA(VLOOKUP($Q$3,MTab,3,FALSE)),\"Übertrag\",VLOOKUP($Q$3,MTab,3,FALSE))","v":"Übertrag"},null,{"$f":"IF(ISNA(VLOOKUP($Q$3,MTab,4,FALSE)),$Q$3&\"!$R$2\",VLOOKUP($Q$3,MTab,4,FALSE))","v":"Format!$R$2"}]
[null,null," Feiertage\n Wochenende\n Urlaub, ZA, Krank","[U]rlaub\n[Z]A\n[K]rank","Normal-","Soll","MP","Von","Bis","Plus","Saldo",null,null,null,null,null,"Hintergrundberechnungen",null,null,null,null,null,null,"Saldo aktuell",null,null,null,"GAZ-Tabellenabbildung",null,null,null,null,"Eingabebeprüfungen"]
[null,null,null,null,"Arbeitszeit",null,null,null,null,"Minus","akuell",null,null,null,null,null,"Datum","Monat OK","Abwesenh.","Freie Tage","ÜA-Tage","Std.","Soll-Std.",{"$f":"IF(ISNA($Q$5),Übertrag,INDIRECT($Q$5))","v":0},"Std.-Soll = 0","Std.-Soll > 0","Std.-Soll < 0",null,{"$f":"I_GAZNAZVon","v":2},3,{"$f":"I_GAZNAZBis","v":4},null,"Zeiteingabe","UZK-Eing.\nerlaubt","UZK-Eing.\ngültig","Normalst. ein erlaubt","Normalstd.\neingegeben","Normal VON möglich OG","Normal VON möglich UG","Normal BIS möglich OG","Normal BIS möglich UG","Normal VON\n15min","Normal VON richtig","Normal BIS\n15min","Normal BIS richtig","Status Zeilen Eingabe"]
[{"$f":"IF($R8,$Q8,\"\")","v":"2024-01-01"},{"$f":"IF($R8,VLOOKUP(WEEKDAY($Q8,2),WOTA,2,FALSE),\"\")","v":"Mo"},{"$f":"IF($R8,\" \"&IF($S8=\"\",VLOOKUP($Q8,FListe,3,FALSE),$S8),\"\")","v":" Neujahrstag"},null,{"$f":"IF(AND($R8,$T8<>\"F\"),IF($AC8=$AE8,\"keine NAZ\",TEXT($AC8,\"hh:mm\")&\"-\"&TEXT($AC8+$F8+$G8,\"hh:mm\")),\"\")","v":""},{"$f":"IF($R8,IF($T8=\"F\",0,VLOOKUP($B8,GAZ,I_GAZNAZMP,FALSE)),\"\")","v":"00:00:00"},{"$f":"IF($R8,$AD8,\"\")","v":"00:00:00"},null,null,{"$f":"IF(AND($R8,$AK8,NOT($Y8)),ROUND(($V8-$F8-$G8)*24,2),IF($D8=\"Z\",$F8*-24,\"\"))","v":""},{"$f":"$X8","v":0},null,null,null,null,null,{"$f":"DATE(Jahr,$Q2,1)","v":"2024-01-01"},{"$f":"$Q$2=MONTH($Q8)","v":true},{"$f":"IF(OR($D8=\"U\",$D8=\"Z\",$D8=\"ZK\",$D8=\"K\"),VLOOKUP($D8,UZK,2,FALSE),\"\")","v":""},{"$f":"IF($R8,VLOOKUP($Q8,FListe,4,FALSE),\"\")","v":"F"},{"$f":"IF($R8,VLOOKUP($Q8,FListe,5,FALSE),\"\")","v":"F"},{"$f":"$I8-$H8","v":0},{"$f":"IF($R8,ROUND($V8-$F8-$AD8,15),\"\")","v":0},{"$f":"IF($J8<>\"\",$X7+$J8,$X7)","v":0},{"$f":"($W8=0)","v":true},{"$f":"($W8>0)","v":false},{"$f":"($W8<0)","v":false},{"$f":"IF($U8=\"F\",\"\",TIME(0,0,0))","v":""},{"$f":"IF($U8=\"F\",\"\",IF(ISNA(VLOOKUP($B8,GAZ,AC$7,FALSE)),0,VLOOKUP($B8,GAZ,AC$7,FALSE)))","v":""},{"$f":"IF(OR($U8=\"F\",$S8<>\"\",ISNA(VLOOKUP($B8,GAZ,AD$7,FALSE))),0,IF(NOT($AK8),VLOOKUP($B8,GAZ,11,FALSE),IF(($I8-$H8)*24>=6,VLOOKUP($B8,GAZ,3,FALSE),0)))","v":"00:00:00"},{"$f":"IF($U8=\"F\",\"\",IF(ISNA(VLOOKUP($B8,GAZ,AE$7,FALSE)),0,VLOOKUP($B8,GAZ,AE$7,FALSE)))","v":""},{"$f":"IF($U8=\"F\",\"\",TIME(23,59,0))","v":""},{"$f":"OR($H8<>\"\",$I8<>\"\")","v":false},{"$f":"AND($T8<>\"F\",NOT($AG8),NOT($AC8=$AE8))","v":false},{"$f":"AND($AH8,OR($D8=\"U\",$D8=\"Z\",$D8=\"K\"))","v":false},{"$f":"AND($U8<>\"F\",$D8<>\"U\",$D8<>\"Z\",$D8<>\"K\",$R8)","v":false},{"$f":"AND($H8<>\"\",$I8<>\"\")","v":false},{"$f":"IF($AJ8,TagUG,\"\")","v":""},{"$f":"IF($AJ8,IF($I8=\"\",IF(AND($L8<>\"\",$L8<$AF8),$L8,IF(AND($M8<>\"\",$M8<$AF8),$M8,TagOG)),$I8),\"\")","v":""},{"$f":"IF($AJ8,IF($H8=\"\",$AB8,$H8),\"\")","v":""},{"$f":"IF($AJ8,IF(AND($L8<>\"\",$L8<$AF8),$L8,IF(AND($M8<>\"\",$M8<$AF8),$M8,TagOG)),\"\")","v":""},{"$f":"MOD($H8*24,0.25)=0","v":true},{"$f":"AND($AJ8,ISNUMBER($H8),$H8>=$AB8,$H8<=$AF8,OR($I8=\"\",$H8<=$I8))","v":false},{"$f":"MOD($I8*24,0.25)=0","v":true},{"$f":"AND($AJ8,ISNUMBER($I8),$I8>=$AB8,$I8<=$AF8,OR($H8=\"\",$I8>=$H8))","v":false},{"$f":"IF(AND(ISBLANK($D8),ISBLANK($H8),ISBLANK($I8)),0,1)","v":0}]
["2024-01-02","Di"," ",null,{"$f":"IF(AND($R9,$T9<>\"F\"),IF($AC9=$AE9,\"keine NAZ\",TEXT($AC9,\"hh:mm\")&\"-\"&TEXT($AC9+$F9+$G9,\"hh:mm\")),\"\")","v":"08:00-16:00"},"08:00:00","00:00:00",null,null,"",0,null,null,null,null,null,{"$f":" Q8+1","v":"2024-01-02"},true,"","A","A",{"$f":"$I9-$H9","v":0},{"$f":"IF($R9,ROUND($V9-$F9-$AD9,15),\"\")","v":-0.33333333333333298},0,false,false,true,"00:00:00","08:00:00","00:00:00","16:00:00","23:59:00",false,true,false,true,false,"00:00:00","23:59:00",{"$f":"IF($AJ9,IF($H9=\"\",TagUG,$H9),\"\")","v":"00:00:00"},"23:59:00",true,false,true,false,0]
["2024-01-03","Mi"," ",null,"08:00-16:00","08:00:00","00:00:00",null,null,"",0,null,null,null,null,null,"2024-01-03",true,"","A","A",0,-0.33333333333333298,0,false,false,true,"00:00:00","08:00:00","00:00:00","16:00:00","23:59:00",false,true,false,true,false,"00:00:00","23:59:00","00:00:00","23:59:00",true,false,true,false,0]
["2024-01-04","Do"," ",null,"08:00-16:00","08:00:00","00:00:00",null,null,"",0,null,null,null,null,null,"2024-01-04",true,"","A","A",0,-0.33333333333333298,0,false,false,true,"00:00:00","08:00:00","00:00:00","16:00:00","23:59:00",false,true,false,true,false,"00:00:00","23:59:00","00:00:00","23:59:00",true,false,true,false,0]
["2024-01-05","Fr"," ",null,"08:00-16:00","08:00:00","00:00:00",null,null,"",0,null,null,null,null,null,"2024-01-05",true,"","A","A",0,-0.33333333333333298,0,false,false,true,"00:00:00","08:00:00","00:00:00","16:00:00","23:59:00",false,true,false,true,false,"00:00:00","23:59:00","00:00:00","23:59:00",true,false,true,false,0]
["2024-01-06","Sa"," Hl. drei Könige",null,"","00:00:00","00:00:00",null,null,"",0,null,null,null,null,null,"2024-01-06",true,"","F","F",0,0,0,true,false,false,"","","00:00:00","","",false,false,false,false,false,"","","","",true,false,true,false,0]
["2024-01-07","So"," Wochenende",null,"","00:00:00","00:00:00",null,null,"",0,null,null,null,null,null,"2024-01-07",true,"","F","F",0,0,0,true,false,false,"","","00:00:00","","",false,false,false,false,false,"","","","",true,false,true,false,0]
["2024-01-08","Mo"," ",null,"08:00-16:00","08:00:00","00:00:00",null,null,"",0,null,null,null,null,null,"2024-01-08",true,"","A","A",0,-0.33333333333333298,0,false,false,true,"00:00:00","08:00:00","00:00:00","16:00:00","23:59:00",false,true,false,true,false,"00:00:00","23:59:00","00:00:00","23:59:00",true,false,true,false,0]
["2024-01-09","Di"," ",null,"08:00-16:00","08:00:00","00:00:00",null,null,"",0,null,null,null,null,null,"2024-01-09",true,"","A","A",0,-0.33333333333333298,0,false,false,true,"00:00:00","08:00:00","00:00:00","16:00:00","23:59:00",false,true,false,true,false,"00:00:00","23:59:00","00:00:00","23:59:00",true,false,true,false,0]
["2024-01-10","Mi"," ",null,"08:00-16:00","08:00:00","00:00:00",null,null,"",0,null,null,null,null,null,"2024-01-10",true,"","A","A",0,-0.33333333333333298,0,false,false,true,"00:00:00","08:00:00","00:00:00","16:00:00","23:59:00",false,true,false,true,false,"00:00:00","23:59:00","00:00:00","23:59:00",true,false,true,false,0]
["2024-01-11","Do"," ",null,"08:00-16:00","08:00:00","00:00:00",null,null,"",0,null,null,null,null,null,"2024-01-11",true,"","A","A",0,-0.33333333333333298,0,false,false,true,"00:00:00","08:00:00","00:00:00","16:00:00","23:59:00",false,true,false,true,false,"00:00:00","23:59:00","00:00:00","23:59:00",true,false,true,false,0]
["2024-01-12","Fr"," ",null,"08:00-16:00","08:00:00","00:00:00",null,null,"",0,null,null,null,null,null,"2024-01-12",true,"","A","A",0,-0.33333333333333298,0,false,false,true,"00:00:00","08:00:00","00:00:00","16:00:00","23:59:00",false,true,false,true,false,"00:00:00","23:59:00","00:00:00","23:59:00",true,false,true,false,0]
["2024-01-13","Sa"," Wochenende",null,"","00:00:00","00:00:00",null,null,"",0,null,null,null,null,null,"2024-01-13",true,"","F","A",0,0,0,true,false,false,"00:00:00","00:00:00","00:00:00","00:00:00","23:59:00",false,false,false,true,false,"00:00:00","23:59:00","00:00:00","23:59:00",true,false,true,false,0]
["2024-01-14","So"," Wochenende",null,"","00:00:00","00:00:00",null,null,"",0,null,null,null,null,null,"2024-01-14",true,"","F","F",0,0,0,true,false,false,"","","00:00:00","","",false,false,false,false,false,"","","","",true,false,true,false,0]
["2024-01-15","Mo"," ",null,"08:00-16:00","08:00:00","00:00:00",null,null,"",0,null,null,null,null,null,"2024-01-15",true,"","A","A",0,-0.33333333333333298,0,false,false,true,"00:00:00","08:00:00","00:00:00","16:00:00","23:59:00",false,true,false,true,false,"00:00:00","23:59:00","00:00:00","23:59:00",true,false,true,false,0]
["2024-01-16","Di"," ",null,"08:00-16:00","08:00:00","00:00:00",null,null,"",0,null,null,null,null,null,"2024-01-16",true,"","A","A",0,-0.33333333333333298,0,false,false,true,"00:00:00","08:00:00","00:00:00","16:00:00","23:59:00",false,true,false,true,false,"00:00:00","23:59:00","00:00:00","23:59:00",true,false,true,false,0]
["2024-01-17","Mi"," ",null,"08:00-16:00","08:00:00","00:00:00",null,null,"",0,null,null,null,null,null,"2024-01-17",true,"","A","A",0,-0.33333333333333298,0,false,false,true,"00:00:00","08:00:00","00:00:00","16:00:00","23:59:00",false,true,false,true,false,"00:00:00","23:59:00","00:00:00","23:59:00",true,false,true,false,0]
["2024-01-18","Do"," ",null,"08:00-16:00","08:00:00","00:00:00",null,null,"",0,null,null,null,null,null,"2024-01-18",true,"","A","A",0,-0.33333333333333298,0,false,false,true,"00:00:00","08:00:00","00:00:00","16:00:00","23:59:00",false,true,false,true,false,"00:00:00","23:59:00","00:00:00","23:59:00",true,false,true,false,0]
["2024-01-19","Fr"," ",null,"08:00-16:00","08:00:00","00:00:00",null,null,"",0,null,null,null,null,null,"2024-01-19",true,"","A","A",0,-0.33333333333333298,0,false,false,true,"00:00:00","08:00:00","00:00:00","16:00:00","23:59:00",false,true,false,true,false,"00:00:00","23:59:00","00:00:00","23:59:00",true,false,true,false,0]
["2024-01-20","Sa"," Wochenende",null,"","00:00:00","00:00:00",null,null,"",0,null,null,null,null,null,"2024-01-20",true,"","F","A",0,0,0,true,false,false,"00:00:00","00:00:00","00:00:00","00:00:00","23:59:00",false,false,false,true,false,"00:00:00","23:59:00","00:00:00","23:59:00",true,false,true,false,0]
["2024-01-21","So"," Wochenende",null,"","00:00:00","00:00:00",null,null,"",0,null,null,null,null,null,"2024-01-21",true,"","F","F",0,0,0,true,false,false,"","","00:00:00","","",false,false,false,false,false,"","","","",true,false,true,false,0]
["2024-01-22","Mo"," ",null,"08:00-16:00","08:00:00","00:00:00",null,null,"",0,null,null,null,null,null,"2024-01-22",true,"","A","A",0,-0.33333333333333298,0,false,false,true,"00:00:00","08:00:00","00:00:00","16:00:00","23:59:00",false,true,false,true,false,"00:00:00","23:59:00","00:00:00","23:59:00",true,false,true,false,0]
["2024-01-23","Di"," ",null,"08:00-16:00","08:00:00","00:00:00",null,null,"",0,null,null,null,null,null,"2024-01-23",true,"","A","A",0,-0.33333333333333298,0,false,false,true,"00:00:00","08:00:00","00:00:00","16:00:00","23:59:00",false,true,false,true,false,"00:00:00","23:59:00","00:00:00","23:59:00",true,false,true,false,0]
["2024-01-24","Mi"," ",null,"08:00-16:00","08:00:00","00:00:00",null,null,"",0,null,null,null,null,null,"2024-01-24",true,"","A","A",0,-0.33333333333333298,0,false,false,true,"00:00:00","08:00:00","00:00:00","16:00:00","23:59:00",false,true,false,true,false,"00:00:00","23:59:00","00:00:00","23:59:00",true,false,true,false,0]
["2024-01-25","Do"," ",null,"08:00-16:00","08:00:00","00:00:00",null,null,"",0,null,null,null,null,null,"2024-01-25",true,"","A","A",0,-0.33333333333333298,0,false,false,true,"00:00:00","08:00:00","00:00:00","16:00:00","23:59:00",false,true,false,true,false,"00:00:00","23:59:00","00:00:00","23:59:00",true,false,true,false,0]
["2024-01-26","Fr"," ",null,"08:00-16:00","08:00:00","00:00:00",null,null,"",0,null,null,null,null,null,"2024-01-26",true,"","A","A",0,-0.33333333333333298,0,false,false,true,"00:00:00","08:00:00","00:00:00","16:00:00","23:59:00",false,true,false,true,false,"00:00:00","23:59:00","00:00:00","23:59:00",true,false,true,false,0]
["2024-01-27","Sa"," Wochenende",null,"","00:00:00","00:00:00",null,null,"",0,null,null,null,null,null,"2024-01-27",true,"","F","A",0,0,0,true,false,false,"00:00:00","00:00:00","00:00:00","00:00:00","23:59:00",false,false,false,true,false,"00:00:00","23:59:00","00:00:00","23:59:00",true,false,true,false,0]
["2024-01-28","So"," Wochenende",null,"","00:00:00","00:00:00",null,null,"",0,null,null,null,null,null,"2024-01-28",true,"","F","F",0,0,0,true,false,false,"","","00:00:00","","",false,false,false,false,false,"","","","",true,false,true,false,0]
["2024-01-29","Mo"," ",null,"08:00-16:00","08:00:00","00:00:00",null,null,"",0,null,null,null,null,null,"2024-01-29",true,"","A","A",0,-0.33333333333333298,0,false,false,true,"00:00:00","08:00:00","00:00:00","16:00:00","23:59:00",false,true,false,true,false,"00:00:00","23:59:00","00:00:00","23:59:00",true,false,true,false,0]
["2024-01-30","Di"," ",null,"08:00-16:00","08:00:00","00:00:00",null,null,"",0,null,null,null,null,null,"2024-01-30",true,"","A","A",0,-0.33333333333333298,0,false,false,true,"00:00:00","08:00:00","00:00:00","16:00:00","23:59:00",false,true,false,true,false,"00:00:00","23:59:00","00:00:00","23:59:00",true,false,true,false,0]
["2024-01-31","Mi"," ",null,"08:00-16:00","08:00:00","00:00:00",null,null,"",0,null,null,null,null,null,"2024-01-31",true,"","A","A",0,-0.33333333333333298,0,false,false,true,"00:00:00","08:00:00","00:00:00","16:00:00","23:59:00",false,true,false,true,false,"00:00:00","23:59:00","00:00:00","23:59:00",true,false,true,false,0]
["Arbeitstage",{"$f":"COUNTIF(T$8:T$38,\"A\")","v":22},null,null,{"$f":"\"Monat Std.-Saldo (~15min) > \"","v":"Monat Std.-Saldo (~15min) > "},null,null,null,null,{"$f":"ROUND(SUM(J8:J38)*4,0)/4","v":0}]
["ZA-Tage",{"$f":"COUNTIF(D$8:D$38,\"Z\")","v":0},null,null," Vormonat Std.Saldo > ",null,null,null,null,{"$f":"$K5","v":0},null,null,null,null,null,null,"Gültigkeit ausbezahlt"]
["Urlaubstage",{"$f":"COUNTIF(D$8:D$38,\"U\")","v":0},null,null," Gesamt Std. Saldo > ",null,null,null,null,{"$f":"$J39+$J40","v":0},null,null,null,null,null,null,{"$f":"AND($K$41>=0,$K$41<=$J$41,MOD($K$41,0.25)=0)","v":true}]
["Krank",{"$f":"COUNTIF(D$8:D$38,\"K\")","v":0},null,null," Übertrag Std. Saldo > ",null,null,null,null,{"$f":"$J41","v":0},{"$f":"\" < Dieser Stunden-Saldo wird in das nächste \"&IF($Q$3=\"Dezember\",\"Jahr\",\"Monat\")&\" übertragen\"","v":" < Dieser Stunden-Saldo wird in das nächste Monat übertragen"}]
[null,null,null,"Z"]
[]
[{"$f":"\"Unterschrift von \"&Vorgesetzter","v":"Unterschrift von Vorname Nachname"},null,null,null,null,null,null,null,null,null,null,null,{"$f":"\"Unterschrift von \"&Name","v":"Unterschrift von Vorname Nachname"}]

{"sheet":"Feiertage","index":16,"n_rows":367,"n_cols":15,"rows_kept":367,"cut":false,"hidden":true,"merged":[[0,0,0,1],[0,11,0,12],[0,13,0,14]]}
["Feiertagsberechnung",null,"Datum","WT","Freie Feiertage","Frei","Datum","WT","Feiertage","Frei/\nnicht Frei","Ü-AT","Abwesenheiten",null,"Wochentage"]
["Jahr",{"$f":"Jahr","v":2024},{"$f":"DATE(FJ,1,1)","v":"2024-01-01"},{"$f":"VLOOKUP(WEEKDAY($C2,2),WOTA,2,FALSE)","v":"Mo"},"Neujahrstag","FF",{"$f":"DATE(FJ,1,1)","v":"2024-01-01"},{"$f":"VLOOKUP(WEEKDAY($G2,2),WOTA,2,FALSE)","v":"Mo"},{"$f":"IF(ISNA(VLOOKUP(G2,Feiertage,3,FALSE)),IF(OR($H2=\"Sa\",$H2=\"So\"),\"Wochenende\",\"\"),VLOOKUP(G2,Feiertage,3,FALSE))","v":"Neujahrstag"},{"$f":"IF(ISNA(VLOOKUP($G2,Feiertage,3,FALSE)),IF(AND($H2<>\"So\",$H2<>\"Sa\"),\"A\",\"F\"),IF(OR(VLOOKUP($G2,Feiertage,4,FALSE)=\"FF\",$H2=\"Sa\",$H2=\"So\"),\"F\",\"A\"))","v":"F"},{"$f":"IF(ISNA(VLOOKUP($G2,Feiertage,3,FALSE)),IF($H2=\"So\",\"F\",\"A\"),IF(VLOOKUP($G2,Feiertage,4,FALSE)=\"FF\",\"F\",\"A\"))","v":"F"},"U","Urlaub",1,"Mo"]
["OS",{"$f":"DOLLAR(DATE(Jahr,4,DAY(MINUTE(Jahr/38)/2+55))/7,)*7-IF(YEAR(1)=1904,5,6)","v":"2024-03-31"},{"$f":"DATE(FJ,1,6)","v":"2024-01-06"},"Sa","Hl. drei Könige","FF",{"$f":"G2+1","v":"2024-01-02"},"Di","","A","A","Z","Zeitausgleich",2,"Di"]
[null,null,{"$f":"OS+1","v":"2024-04-01"},"Mo","Ostermontag","FF",{"$f":"G3+1","v":"2024-01-03"},"Mi","","A","A","ZK","ZA-Kernzeit",3,"Mi"]
[null,null,{"$f":"DATE(FJ,5,1)","v":"2024-05-01"},"Mi","Staatsfeiertag","FF","2024-01-04","Do","","A","A","K","Krank",4,"Do"]
[null,null,{"$f":"OS+39","v":"2024-05-09"},"Do","Christi Himmelfahrt","FF","2024-01-05","Fr","","A","A",null,null,5,"Fr"]
[null,null,{"$f":"OS+50","v":"2024-05-20"},"Mo","Pfingstmontag","FF","2024-01-06","Sa","Hl. drei Könige","F","F",null,null,6,"Sa"]
[null,null,{"$f":"OS+60","v":"2024-05-30"},"Do","Fronleichnam","FF","2024-01-07","So","Wochenende","F","F",null,null,7,"So"]
[null,null,{"$f":"DATE(FJ,8,15)","v":"2024-08-15"},"Do","Maria Himmelfahrt","FF","2024-01-08","Mo","","A","A"]
[null,null,{"$f":"DATE(FJ,10,26)","v":"2024-10-26"},"Sa","Nationalfeiertag","FF","2024-01-09","Di","","A","A"]
[null,null,{"$f":"DATE(FJ,11,1)","v":"2024-11-01"},"Fr","Allerheiligen","FF","2024-01-10","Mi","","A","A"]
[null,null,{"$f":"DATE(FJ,12,8)","v":"2024-12-08"},"So","Maria Empfängnis","FF","2024-01-11","Do","","A","A"]
[null,null,{"$f":"DATE(FJ,12,25)","v":"2024-12-25"},"Mi","Christtag","FF","2024-01-12","Fr","","A","A"]
[null,null,{"$f":"DATE(FJ,12,26)","v":"2024-12-26"},"Do","Stefanitag","FF","2024-01-13","Sa","Wochenende","F","A"]
[null,null,"Datum","WT","Nichtfreie Feiertage","Frei","2024-01-14","So","Wochenende","F","F"]
[null,null,{"$f":"OS-46","v":"2024-02-14"},{"$f":"VLOOKUP(WEEKDAY($C16,2),WOTA,2,FALSE)","v":"Mi"},"Aschermittwoch",{"$f":"IF(D16<>\"So\",\"FA\",\"FF\")","v":"FA"},"2024-01-15","Mo","","A","A"]
[null,null,{"$f":"DATE(FJ,2,14)","v":"2024-02-14"},"Mi","Valentinstag",{"$f":"IF(D17<>\"So\",\"FA\",\"FF\")","v":"FA"},"2024-01-16","Di","","A","A"]
[null,null,{"$f":"OS-7","v":"2024-03-24"},"So","Palmsonntag","FF","2024-01-17","Mi","","A","A"]
[null,null,{"$f":"OS-3","v":"2024-03-28"},"Do","Gründonnerstag","FA","2024-01-18","Do","","A","A"]
[null,null,{"$f":"OS-2","v":"2024-03-29"},"Fr","Karfreitag","FA","2024-01-19","Fr","","A","A"]
[null,null,{"$f":"OS","v":"2024-03-31"},"So","Ostersonntag","FF","2024-01-20","Sa","Wochenende","F","A"]
[null,null,{"$f":"OS+2","v":"2024-04-02"},"Di","Osterdienstag",{"$f":"IF(D22<>\"So\",\"FA\",\"FF\")","v":"FA"},"2024-01-21","So","Wochenende","F","F"]
[null,null,{"$f":"DATE(FJ,5,1)-WEEKDAY(DATE(FJ,5,1),2)+14-(7*(DATE(FJ,5,1)-WEEKDAY(DATE(FJ,5,1),2)+14=ROUND((DAY(MINUTE(FJ/38)/2+55)&\".4.\"&FJ)/7,)*7-6+49))","v":"2024-05-12"},"So","Muttertag","FF","2024-01-22","Mo","","A","A"]
[null,null,{"$f":"OS+49","v":"2024-05-19"},"So","Pfingsten","FF","2024-01-23","Di","","A","A"]
[null,null,{"$f":"DATE(Jahr,6,1)+15-WEEKDAY(DATE(Jahr,6,1)+14)","v":"2024-06-09"},"So","Vatertag","FF","2024-01-24","Mi","","A","A"]
[null,null,{"$f":"DATE(FJ,11,2)","v":"2024-11-02"},"Sa","Allerseelen","FA","2024-01-25","Do","","A","A"]
[null,null,{"$f":"DATE(FJ,11,15)","v":"2024-11-15"},"Fr","St. Leopold","FA","2024-01-26","Fr","","A","A"]
[null,null,{"$f":"DATE(FJ,12,6)","v":"2024-12-06"},"Fr","St. Nikolaus","FA","2024-01-27","Sa","Wochenende","F","A"]
[null,null,{"$f":"C30-7","v":"2024-12-01"},"So","1. Advent","FF","2024-01-28","So","Wochenende","F","F"]
[null,null,{"$f":"C31-7","v":"2024-12-08"},"So","2. Advent","FF","2024-01-29","Mo","","A","A"]
[null,null,{"$f":"C32-7","v":"2024-12-15"},"So","3. Advent","FF","2024-01-30","Di","","A","A"]
[null,null,{"$f":"DATE(FJ,12,24)-WEEKDAY(DATE(FJ,12,24))+1","v":"2024-12-22"},"So","4. Advent","FF","2024-01-31","Mi","","A","A"]
[null,null,{"$f":"DATE(FJ,12,24)","v":"2024-12-24"},"Di","Hl. Abend","FA","2024-02-01","Do","","A","A"]
[null,null,{"$f":"DATE(FJ,12,31)","v":"2024-12-31"},"Di","Silvester","FA","2024-02-02","Fr","","A","A"]
[null,null,null,null,null,null,"2024-02-03","Sa","Wochenende","F","A"]
[null,null,null,null,null,null,"2024-02-04","So","Wochenende","F","F"]
[null,null,null,null,null,null,"2024-02-05","Mo","","A","A"]
[null,null,null,null,null,null,"2024-02-06","Di","","A","A"]
[null,null,null,null,null,null,"2024-02-07","Mi","","A","A"]
[null,null,null,null,null,null,"2024-02-08","Do","","A","A"]
[null,null,null,null,null,null,"2024-02-09","Fr","","A","A"]
[null,null,null,null,null,null,"2024-02-10","Sa","Wochenende","F","A"]
[null,null,null,null,null,null,"2024-02-11","So","Wochenende","F","F"]
[null,null,null,null,null,null,"2024-02-12","Mo","","A","A"]
[null,null,null,null,null,null,"2024-02-13","Di","","A","A"]
[null,null,null,null,null,null,"2024-02-14","Mi","Aschermittwoch","A","A"]
[null,null,null,null,null,null,"2024-02-15","Do","","A","A"]
[null,null,null,null,null,null,"2024-02-16","Fr","","A","A"]
[null,null,null,null,null,null,"2024-02-17","Sa","Wochenende","F","A"]
[null,null,null,null,null,null,"2024-02-18","So","Wochenende","F","F"]
[null,null,null,null,null,null,"2024-02-19","Mo","","A","A"]
[null,null,null,null,null,null,"2024-02-20","Di","","A","A"]
[null,null,null,null,null,null,"2024-02-21","Mi","","A","A"]
[null,null,null,null,null,null,"2024-02-22","Do","","A","A"]
[null,null,null,null,null,null,"2024-02-23","Fr","","A","A"]
[null,null,null,null,null,null,"2024-02-24","Sa","Wochenende","F","A"]
[null,null,null,null,null,null,"2024-02-25","So","Wochenende","F","F"]
[null,null,null,null,null,null,"2024-02-26","Mo","","A","A"]
[null,null,null,null,null,null,"2024-02-27","Di","","A","A"]
[null,null,null,null,null,null,"2024-02-28","Mi","","A","A"]
[null,null,null,null,null,null,"2024-02-29","Do","","A","A"]
[null,null,null,null,null,null,"2024-03-01","Fr","","A","A"]
[null,null,null,null,null,null,"2024-03-02","Sa","Wochenende","F","A"]
[null,null,null,null,null,null,"2024-03-03","So","Wochenende","F","F"]
[null,null,null,null,null,null,"2024-03-04","Mo","","A","A"]
[null,null,null,null,null,null,"2024-03-05",{"$f":"VLOOKUP(WEEKDAY($G66,2),WOTA,2,FALSE)","v":"Di"},{"$f":"IF(ISNA(VLOOKUP(G66,Feiertage,3,FALSE)),IF(OR($H66=\"Sa\",$H66=\"So\"),\"Wochenende\",\"\"),VLOOKUP(G66,Feiertage,3,FALSE))","v":""},{"$f":"IF(ISNA(VLOOKUP($G66,Feiertage,3,FALSE)),IF(AND($H66<>\"So\",$H66<>\"Sa\"),\"A\",\"F\"),IF(OR(VLOOKUP($G66,Feiertage,4,FALSE)=\"FF\",$H66=\"Sa\",$H66=\"So\"),\"F\",\"A\"))","v":"A"},{"$f":"IF(ISNA(VLOOKUP($G66,Feiertage,3,FALSE)),IF($H66=\"So\",\"F\",\"A\"),IF(VLOOKUP($G66,Feiertage,4,FALSE)=\"FF\",\"F\",\"A\"))","v":"A"}]
[null,null,null,null,null,null,"2024-03-06","Mi","","A","A"]
[null,null,null,null,null,null,{"$f":"G67+1","v":"2024-03-07"},"Do","","A","A"]
[null,null,null,null,null,null,"2024-03-08","Fr","","A","A"]
[null,null,null,null,null,null,"2024-03-09","Sa","Wochenende","F","A"]
[null,null,null,null,null,null,"2024-03-10","So","Wochenende","F","F"]
[null,null,null,null,null,null,"2024-03-11","Mo","","A","A"]
[null,null,null,null,null,null,"2024-03-12","Di","","A","A"]
[null,null,null,null,null,null,"2024-03-13","Mi","","A","A"]
[null,null,null,null,null,null,"2024-03-14","Do","","A","A"]
[null,null,null,null,null,null,"2024-03-15","Fr","","A","A"]
[null,null,null,null,null,null,"2024-03-16","Sa","Wochenende","F","A"]
[null,null,null,null,null,null,"2024-03-17","So","Wochenende","F","F"]
[null,null,null,null,null,null,"2024-03-18","Mo","","A","A"]
[null,null,null,null,null,null,"2024-03-19","Di","","A","A"]
[null,null,null,null,null,null,"2024-03-20","Mi","","A","A"]
[null,null,null,null,null,null,"2024-03-21","Do","","A","A"]
[null,null,null,null,null,null,"2024-03-22","Fr","","A","A"]
[null,null,null,null,null,null,"2024-03-23","Sa","Wochenende","F","A"]
[null,null,null,null,null,null,"2024-03-24","So","Palmsonntag","F","F"]
[null,null,null,null,null,null,"2024-03-25","Mo","","A","A"]
[null,null,null,null,null,null,"2024-03-26","Di","","A","A"]
[null,null,null,null,null,null,"2024-03-27","Mi","","A","A"]
[null,null,null,null,null,null,"2024-03-28","Do","Gründonnerstag","A","A"]
[null,null,null,null,null,null,"2024-03-29","Fr","Karfreitag","A","A"]
[null,null,null,null,null,null,"2024-03-30","Sa","Wochenende","F","A"]
[null,null,null,null,null,null,"2024-03-31","So","Ostersonntag","F","F"]
[null,null,null,null,null,null,"2024-04-01","Mo","Ostermontag","F","F"]
[null,null,null,null,null,null,"2024-04-02","Di","Osterdienstag","A","A"]
[null,null,null,null,null,null,"2024-04-03","Mi","","A","A"]
[null,null,null,null,null,null,"2024-04-04","Do","","A","A"]
[null,null,null,null,null,null,"2024-04-05","Fr","","A","A"]
[null,null,null,null,null,null,"2024-04-06","Sa","Wochenende","F","A"]
[null,null,null,null,null,null,"2024-04-07","So","Wochenende","F","F"]
[null,null,null,null,null,null,"2024-04-08","Mo","","A","A"]
[null,null,null,null,null,null,"2024-04-09","Di","","A","A"]
[null,null,null,null,null,null,"2024-04-10","Mi","","A","A"]
[null,null,null,null,null,null,"2024-04-11","Do","","A","A"]
[null,null,null,null,null,null,"2024-04-12","Fr","","A","A"]
[null,null,null,null,null,null,"2024-04-13","Sa","Wochenende","F","A"]
[null,null,null,null,null,null,"2024-04-14","So","Wochenende","F","F"]
[null,null,null,null,null,null,"2024-04-15","Mo","","A","A"]
[null,null,null,null,null,null,"2024-04-16","Di","","A","A"]
[null,null,null,null,null,null,"2024-04-17","Mi","","A","A"]
[null,null,null,null,null,null,"2024-04-18","Do","","A","A"]
[null,null,null,null,null,null,"2024-04-19","Fr","","A","A"]
[null,null,null,null,null,null,"2024-04-20","Sa","Wochenende","F","A"]
[null,null,null,null,null,null,"2024-04-21","So","Wochenende","F","F"]
[null,null,null,null,null,null,"2024-04-22","Mo","","A","A"]
[null,null,null,null,null,null,"2024-04-23","Di","","A","A"]
[null,null,null,null,null,null,"2024-04-24","Mi","","A","A"]
[null,null,null,null,null,null,"2024-04-25","Do","","A","A"]
[null,null,null,null,null,null,"2024-04-26","Fr","","A","A"]
[null,null,null,null,null,null,"2024-04-27","Sa","Wochenende","F","A"]
[null,null,null,null,null,null,"2024-04-28","So","Wochenende","F","F"]
[null,null,null,null,null,null,"2024-04-29","Mo","","A","A"]
[null,null,null,null,null,null,"2024-04-30","Di","","A","A"]
[null,null,null,null,null,null,"2024-05-01","Mi","Staatsfeiertag","F","F"]
[null,null,null,null,null,null,"2024-05-02","Do","","A","A"]
[null,null,null,null,null,null,"2024-05-03","Fr","","A","A"]
[null,null,null,null,null,null,"2024-05-04","Sa","Wochenende","F","A"]
[null,null,null,null,null,null,"2024-05-05","So","Wochenende","F","F"]
[null,null,null,null,null,null,"2024-05-06","Mo","","A","A"]
[null,null,null,null,null,null,"2024-05-07","Di","","A","A"]
[null,null,null,null,null,null,"2024-05-08",{"$f":"VLOOKUP(WEEKDAY($G130,2),WOTA,2,FALSE)","v":"Mi"},{"$f":"IF(ISNA(VLOOKUP(G130,Feiertage,3,FALSE)),IF(OR($H130=\"Sa\",$H130=\"So\"),\"Wochenende\",\"\"),VLOOKUP(G130,Feiertage,3,FALSE))","v":""},{"$f":"IF(ISNA(VLOOKUP($G130,Feiertage,3,FALSE)),IF(AND($H130<>\"So\",$H130<>\"Sa\"),\"A\",\"F\"),IF(OR(VLOOKUP($G130,Feiertage,4,FALSE)=\"FF\",$H130=\"Sa\",$H130=\"So\"),\"F\",\"A\"))","v":"A"},{"$f":"IF(ISNA(VLOOKUP($G130,Feiertage,3,FALSE)),IF($H130=\"So\",\"F\",\"A\"),IF(VLOOKUP($G130,Feiertage,4,FALSE)=\"FF\",\"F\",\"A\"))","v":"A"}]
[null,null,null,null,null,null,"2024-05-09","Do","Christi Himmelfahrt","F","F"]
[null,null,null,null,null,null,{"$f":"G131+1","v":"2024-05-10"},"Fr","","A","A"]
[null,null,null,null,null,null,"2024-05-11","Sa","Wochenende","F","A"]
[null,null,null,null,null,null,"2024-05-12","So","Muttertag","F","F"]
[null,null,null,null,null,null,"2024-05-13","Mo","","A","A"]
[null,null,null,null,null,null,"2024-05-14","Di","","A","A"]
[null,null,null,null,null,null,"2024-05-15","Mi","","A","A"]
[null,null,null,null,null,null,"2024-05-16","Do","","A","A"]
[null,null,null,null,null,null,"2024-05-17","Fr","","A","A"]
[null,null,null,null,null,null,"2024-05-18","Sa","Wochenende","F","A"]
[null,null,null,null,null,null,"2024-05-19","So","Pfingsten","F","F"]
[null,null,null,null,null,null,"2024-05-20","Mo","Pfingstmontag","F","F"]
[null,null,null,null,null,null,"2024-05-21","Di","","A","A"]
[null,null,null,null,null,null,"2024-05-22","Mi","","A","A"]
[null,null,null,null,null,null,"2024-05-23","Do","","A","A"]
[null,null,null,null,null,null,"2024-05-24","Fr","","A","A"]
[null,null,null,null,null,null,"2024-05-25","Sa","Wochenende","F","A"]
[null,null,null,null,null,null,"2024-05-26","So","Wochenende","F","F"]
[null,null,null,null,null,null,"2024-05-27","Mo","","A","A"]
[null,null,null,null,null,null,"2024-05-28","Di","","A","A"]
[null,null,null,null,null,null,"2024-05-29","Mi","","A","A"]
[null,null,null,null,null,null,"2024-05-30","Do","Fronleichnam","F","F"]
[null,null,null,null,null,null,"2024-05-31","Fr","","A","A"]
[null,null,null,null,null,null,"2024-06-01","Sa","Wochenende","F","A"]
[null,null,null,null,null,null,"2024-06-02","So","Wochenende","F","F"]
[null,null,null,null,null,null,"2024-06-03","Mo","","A","A"]
[null,null,null,null,null,null,"2024-06-04","Di","","A","A"]
[null,null,null,null,null,null,"2024-06-05","Mi","","A","A"]
[null,null,null,null,null,null,"2024-06-06","Do","","A","A"]
[null,null,null,null,null,null,"2024-06-07","Fr","","A","A"]
[null,null,null,null,null,null,"2024-06-08","Sa","Wochenende","F","A"]
[null,null,null,null,null,null,"2024-06-09","So","Vatertag","F","F"]
[null,null,null,null,null,null,"2024-06-10","Mo","","A","A"]
[null,null,null,null,null,null,"2024-06-11","Di","","A","A"]
[null,null,null,null,null,null,"2024-06-12","Mi","","A","A"]
[null,null,null,null,null,null,"2024-06-13","Do","","A","A"]
[null,null,null,null,null,null,"2024-06-14","Fr","","A","A"]
[null,null,null,null,null,null,"2024-06-15","Sa","Wochenende","F","A"]
[null,null,null,null,null,null,"2024-06-16","So","Wochenende","F","F"]
[null,null,null,null,null,null,"2024-06-17","Mo","","A","A"]
[null,null,null,null,null,null,"2024-06-18","Di","","A","A"]
[null,null,null,null,null,null,"2024-06-19","Mi","","A","A"]
[null,null,null,null,null,null,"2024-06-20","Do","","A","A"]
[null,null,null,null,null,null,"2024-06-21","Fr","","A","A"]
[null,null,null,null,null,null,"2024-06-22","Sa","Wochenende","F","A"]
[null,null,null,null,null,null,"2024-06-23","So","Wochenende","F","F"]
[null,null,null,null,null,null,"2024-06-24","Mo","","A","A"]
[null,null,null,null,null,null,"2024-06-25","Di","","A","A"]
[null,null,null,null,null,null,"2024-06-26","Mi","","A","A"]
[null,null,null,null,null,null,"2024-06-27","Do","","A","A"]
[null,null,null,null,null,null,"2024-06-28","Fr","","A","A"]
[null,null,null,null,null,null,"2024-06-29","Sa","Wochenende","F","A"]
[null,null,null,null,null,null,"2024-06-30","So","Wochenende","F","F"]
[null,null,null,null,null,null,"2024-07-01","Mo","","A","A"]
[null,null,null,null,null,null,"2024-07-02","Di","","A","A"]
[null,null,null,null,null,null,"2024-07-03","Mi","","A","A"]
[null,null,null,null,null,null,"2024-07-04","Do","","A","A"]
[null,null,null,null,null,null,"2024-07-05","Fr","","A","A"]
[null,null,null,null,null,null,"2024-07-06","Sa","Wochenende","F","A"]
[null,null,null,null,null,null,"2024-07-07","So","Wochenende","F","F"]
[null,null,null,null,null,null,"2024-07-08","Mo","","A","A"]
[null,null,null,null,null,null,"2024-07-09","Di","","A","A"]
[null,null,null,null,null,null,"2024-07-10","Mi","","A","A"]
[null,null,null,null,null,null,"2024-07-11",{"$f":"VLOOKUP(WEEKDAY($G194,2),WOTA,2,FALSE)","v":"Do"},{"$f":"IF(ISNA(VLOOKUP(G194,Feiertage,3,FALSE)),IF(OR($H194=\"Sa\",$H194=\"So\"),\"Wochenende\",\"\"),VLOOKUP(G194,Feiertage,3,FALSE))","v":""},{"$f":"IF(ISNA(VLOOKUP($G194,Feiertage,3,FALSE)),IF(AND($H194<>\"So\",$H194<>\"Sa\"),\"A\",\"F\"),IF(OR(VLOOKUP($G194,Feiertage,4,FALSE)=\"FF\",$H194=\"Sa\",$H194=\"So\"),\"F\",\"A\"))","v":"A"},{"$f":"IF(ISNA(VLOOKUP($G194,Feiertage,3,FALSE)),IF($H194=\"So\",\"F\",\"A\"),IF(VLOOKUP($G194,Feiertage,4,FALSE)=\"FF\",\"F\",\"A\"))","v":"A"}]
[null,null,null,null,null,null,"2024-07-12","Fr","","A","A"]
[null,null,null,null,null,null,{"$f":"G195+1","v":"2024-07-13"},"Sa","Wochenende","F","A"]
[null,null,null,null,null,null,"2024-07-14","So","Wochenende","F","F"]
[null,null,null,null,null,null,"2024-07-15","Mo","","A","A"]
[null,null,null,null,null,null,"2024-07-16","Di","","A","A"]
[null,null,null,null,null,null,"2024-07-17","Mi","","A","A"]
[null,null,null,null,null,null,"2024-07-18","Do","","A","A"]
[null,null,null,null,null,null,"2024-07-19","Fr","","A","A"]
[null,null,null,null,null,null,"2024-07-20","Sa","Wochenende","F","A"]
[null,null,null,null,null,null,"2024-07-21","So","Wochenende","F","F"]
[null,null,null,null,null,null,"2024-07-22","Mo","","A","A"]
[null,null,null,null,null,null,"2024-07-23","Di","","A","A"]
[null,null,null,null,null,null,"2024-07-24","Mi","","A","A"]
[null,null,null,null,null,null,"2024-07-25","Do","","A","A"]
[null,null,null,null,null,null,"2024-07-26","Fr","","A","A"]
[null,null,null,null,null,null,"2024-07-27","Sa","Wochenende","F","A"]
[null,null,null,null,null,null,"2024-07-28","So","Wochenende","F","F"]
[null,null,null,null,null,null,"2024-07-29","Mo","","A","A"]
[null,null,null,null,null,null,"2024-07-30","Di","","A","A"]
[null,null,null,null,null,null,"2024-07-31","Mi","","A","A"]
[null,null,null,null,null,null,"2024-08-01","Do","","A","A"]
[null,null,null,null,null,null,"2024-08-02","Fr","","A","A"]
[null,null,null,null,null,null,"2024-08-03","Sa","Wochenende","F","A"]
[null,null,null,null,null,null,"2024-08-04","So","Wochenende","F","F"]
[null,null,null,null,null,null,"2024-08-05","Mo","","A","A"]
[null,null,null,null,null,null,"2024-08-06","Di","","A","A"]
[null,null,null,null,null,null,"2024-08-07","Mi","","A","A"]
[null,null,null,null,null,null,"2024-08-08","Do","","A","A"]
[null,null,null,null,null,null,"2024-08-09","Fr","","A","A"]
[null,null,null,null,null,null,"2024-08-10","Sa","Wochenende","F","A"]
[null,null,null,null,null,null,"2024-08-11","So","Wochenende","F","F"]
[null,null,null,null,null,null,"2024-08-12","Mo","","A","A"]
[null,null,null,null,null,null,"2024-08-13","Di","","A","A"]
[null,null,null,null,null,null,"2024-08-14","Mi","","A","A"]
[null,null,null,null,null,null,"2024-08-15","Do","Maria Himmelfahrt","F","F"]
[null,null,null,null,null,null,"2024-08-16","Fr","","A","A"]
[null,null,null,null,null,null,"2024-08-17","Sa","Wochenende","F","A"]
[null,null,null,null,null,null,"2024-08-18","So","Wochenende","F","F"]
[null,null,null,null,null,null,"2024-08-19","Mo","","A","A"]
[null,null,null,null,null,null,"2024-08-20","Di","","A","A"]
[null,null,null,null,null,null,"2024-08-21","Mi","","A","A"]
[null,null,null,null,null,null,"2024-08-22","Do","","A","A"]
[null,null,null,null,null,null,"2024-08-23","Fr","","A","A"]
[null,null,null,null,null,null,"2024-08-24","Sa","Wochenende","F","A"]
[null,null,null,null,null,null,"2024-08-25","So","Wochenende","F","F"]
[null,null,null,null,null,null,"2024-08-26","Mo","","A","A"]
[null,null,null,null,null,null,"2024-08-27","Di","","A","A"]
[null,null,null,null,null,null,"2024-08-28","Mi","","A","A"]
[null,null,null,null,null,null,"2024-08-29","Do","","A","A"]
[null,null,null,null,null,null,"2024-08-30","Fr","","A","A"]
[null,null,null,null,null,null,"2024-08-31","Sa","Wochenende","F","A"]
[null,null,null,null,null,null,"2024-09-01","So","Wochenende","F","F"]
[null,null,null,null,null,null,"2024-09-02","Mo","","A","A"]
[null,null,null,null,null,null,"2024-09-03","Di","","A","A"]
[null,null,null,null,null,null,"2024-09-04","Mi","","A","A"]
[null,null,null,null,null,null,"2024-09-05","Do","","A","A"]
[null,null,null,null,null,null,"2024-09-06","Fr","","A","A"]
[null,null,null,null,null,null,"2024-09-07","Sa","Wochenende","F","A"]
[null,null,null,null,null,null,"2024-09-08","So","Wochenende","F","F"]
[null,null,null,null,null,null,"2024-09-09","Mo","","A","A"]
[null,null,null,null,null,null,"2024-09-10","Di","","A","A"]
[null,null,null,null,null,null,"2024-09-11","Mi","","A","A"]
[null,null,null,null,null,null,"2024-09-12","Do","","A","A"]
[null,null,null,null,null,null,"2024-09-13",{"$f":"VLOOKUP(WEEKDAY($G258,2),WOTA,2,FALSE)","v":"Fr"},{"$f":"IF(ISNA(VLOOKUP(G258,Feiertage,3,FALSE)),IF(OR($H258=\"Sa\",$H258=\"So\"),\"Wochenende\",\"\"),VLOOKUP(G258,Feiertage,3,FALSE))","v":""},{"$f":"IF(ISNA(VLOOKUP($G258,Feiertage,3,FALSE)),IF(AND($H258<>\"So\",$H258<>\"Sa\"),\"A\",\"F\"),IF(OR(VLOOKUP($G258,Feiertage,4,FALSE)=\"FF\",$H258=\"Sa\",$H258=\"So\"),\"F\",\"A\"))","v":"A"},{"$f":"IF(ISNA(VLOOKUP($G258,Feiertage,3,FALSE)),IF($H258=\"So\",\"F\",\"A\"),IF(VLOOKUP($G258,Feiertage,4,FALSE)=\"FF\",\"F\",\"A\"))","v":"A"}]
[null,null,null,null,null,null,"2024-09-14","Sa","Wochenende","F","A"]
[null,null,null,null,null,null,{"$f":"G259+1","v":"2024-09-15"},"So","Wochenende","F","F"]
[null,null,null,null,null,null,"2024-09-16","Mo","","A","A"]
[null,null,null,null,null,null,"2024-09-17","Di","","A","A"]
[null,null,null,null,null,null,"2024-09-18","Mi","","A","A"]
[null,null,null,null,null,null,"2024-09-19","Do","","A","A"]
[null,null,null,null,null,null,"2024-09-20","Fr","","A","A"]
[null,null,null,null,null,null,"2024-09-21","Sa","Wochenende","F","A"]
[null,null,null,null,null,null,"2024-09-22","So","Wochenende","F","F"]
[null,null,null,null,null,null,"2024-09-23","Mo","","A","A"]
[null,null,null,null,null,null,"2024-09-24","Di","","A","A"]
[null,null,null,null,null,null,"2024-09-25","Mi","","A","A"]
[null,null,null,null,null,null,"2024-09-26","Do","","A","A"]
[null,null,null,null,null,null,"2024-09-27","Fr","","A","A"]
[null,null,null,null,null,null,"2024-09-28","Sa","Wochenende","F","A"]
[null,null,null,null,null,null,"2024-09-29","So","Wochenende","F","F"]
[null,null,null,null,null,null,"2024-09-30","Mo","","A","A"]
[null,null,null,null,null,null,"2024-10-01","Di","","A","A"]
[null,null,null,null,null,null,"2024-10-02","Mi","","A","A"]
[null,null,null,null,null,null,"2024-10-03","Do","","A","A"]
[null,null,null,null,null,null,"2024-10-04","Fr","","A","A"]
[null,null,null,null,null,null,"2024-10-05","Sa","Wochenende","F","A"]
[null,null,null,null,null,null,"2024-10-06","So","Wochenende","F","F"]
[null,null,null,null,null,null,"2024-10-07","Mo","","A","A"]
[null,null,null,null,null,null,"2024-10-08","Di","","A","A"]
[null,null,null,null,null,null,"2024-10-09","Mi","","A","A"]
[null,null,null,null,null,null,"2024-10-10","Do","","A","A"]
[null,null,null,null,null,null,"2024-10-11","Fr","","A","A"]
[null,null,null,null,null,null,"2024-10-12","Sa","Wochenende","F","A"]
[null,null,null,null,null,null,"2024-10-13","So","Wochenende","F","F"]
[null,null,null,null,null,null,"2024-10-14","Mo","","A","A"]
[null,null,null,null,null,null,"2024-10-15","Di","","A","A"]
[null,null,null,null,null,null,"2024-10-16","Mi","","A","A"]
[null,null,null,null,null,null,"2024-10-17","Do","","A","A"]
[null,null,null,null,null,null,"2024-10-18","Fr","","A","A"]
[null,null,null,null,null,null,"2024-10-19","Sa","Wochenende","F","A"]
[null,null,null,null,null,null,"2024-10-20","So","Wochenende","F","F"]
[null,null,null,null,null,null,"2024-10-21","Mo","","A","A"]
[null,null,null,null,null,null,"2024-10-22","Di","","A","A"]
[null,null,null,null,null,null,"2024-10-23","Mi","","A","A"]
[null,null,null,null,null,null,"2024-10-24","Do","","A","A"]
[null,null,null,null,null,null,"2024-10-25","Fr","","A","A"]
[null,null,null,null,null,null,"2024-10-26","Sa","Nationalfeiertag","F","F"]
[null,null,null,null,null,null,"2024-10-27","So","Wochenende","F","F"]
[null,null,null,null,null,null,"2024-10-28","Mo","","A","A"]
[null,null,null,null,null,null,"2024-10-29","Di","","A","A"]
[null,null,null,null,null,null,"2024-10-30","Mi","","A","A"]
[null,null,null,null,null,null,"2024-10-31","Do","","A","A"]
[null,null,null,null,null,null,"2024-11-01","Fr","Allerheiligen","F","F"]
[null,null,null,null,null,null,"2024-11-02","Sa","Allerseelen","F","A"]
[null,null,null,null,null,null,"2024-11-03","So","Wochenende","F","F"]
[null,null,null,null,null,null,"2024-11-04","Mo","","A","A"]
[null,null,null,null,null,null,"2024-11-05","Di","","A","A"]
[null,null,null,null,null,null,"2024-11-06","Mi","","A","A"]
[null,null,null,null,null,null,"2024-11-07","Do","","A","A"]
[null,null,null,null,null,null,"2024-11-08","Fr","","A","A"]
[null,null,null,null,null,null,"2024-11-09","Sa","Wochenende","F","A"]
[null,null,null,null,null,null,"2024-11-10","So","Wochenende","F","F"]
[null,null,null,null,null,null,{"$f":"G316+1","v":"2024-11-11"},"Mo","","A","A"]
[null,null,null,null,null,null,{"$f":"G317+1","v":"2024-11-12"},"Di","","A","A"]
[null,null,null,null,null,null,"2024-11-13","Mi","","A","A"]
[null,null,null,null,null,null,"2024-11-14","Do","","A","A"]
[null,null,null,null,null,null,"2024-11-15","Fr","St. Leopold","A","A"]
[null,null,null,null,null,null,"2024-11-16",{"$f":"VLOOKUP(WEEKDAY($G322,2),WOTA,2,FALSE)","v":"Sa"},{"$f":"IF(ISNA(VLOOKUP(G322,Feiertage,3,FALSE)),IF(OR($H322=\"Sa\",$H322=\"So\"),\"Wochenende\",\"\"),VLOOKUP(G322,Feiertage,3,FALSE))","v":"Wochenende"},{"$f":"IF(ISNA(VLOOKUP($G322,Feiertage,3,FALSE)),IF(AND($H322<>\"So\",$H322<>\"Sa\"),\"A\",\"F\"),IF(OR(VLOOKUP($G322,Feiertage,4,FALSE)=\"FF\",$H322=\"Sa\",$H322=\"So\"),\"F\",\"A\"))","v":"F"},{"$f":"IF(ISNA(VLOOKUP($G322,Feiertage,3,FALSE)),IF($H322=\"So\",\"F\",\"A\"),IF(VLOOKUP($G322,Feiertage,4,FALSE)=\"FF\",\"F\",\"A\"))","v":"A"}]
[null,null,null,null,null,null,"2024-11-17","So","Wochenende","F","F"]
[null,null,null,null,null,null,"2024-11-18","Mo","","A","A"]
[null,null,null,null,null,null,"2024-11-19","Di","","A","A"]
[null,null,null,null,null,null,"2024-11-20","Mi","","A","A"]
[null,null,null,null,null,null,"2024-11-21","Do","","A","A"]
[null,null,null,null,null,null,"2024-11-22","Fr","","A","A"]
[null,null,null,null,null,null,"2024-11-23","Sa","Wochenende","F","A"]
[null,null,null,null,null,null,"2024-11-24","So","Wochenende","F","F"]
[null,null,null,null,null,null,{"$f":"G330+1","v":"2024-11-25"},"Mo","","A","A"]
[null,null,null,null,null,null,"2024-11-26","Di","","A","A"]
[null,null,null,null,null,null,"2024-11-27","Mi","","A","A"]
[null,null,null,null,null,null,"2024-11-28","Do","","A","A"]
[null,null,null,null,null,null,"2024-11-29","Fr","","A","A"]
[null,null,null,null,null,null,"2024-11-30","Sa","Wochenende","F","A"]
[null,null,null,null,null,null,{"$f":"G336+1","v":"2024-12-01"},"So","1. Advent","F","F"]
[null,null,null,null,null,null,"2024-12-02","Mo","","A","A"]
[null,null,null,null,null,null,"2024-12-03","Di","","A","A"]
[null,null,null,null,null,null,"2024-12-04","Mi","","A","A"]
[null,null,null,null,null,null,"2024-12-05","Do","","A","A"]
[null,null,null,null,null,null,"2024-12-06","Fr","St. Nikolaus","A","A"]
[null,null,null,null,null,null,"2024-12-07","Sa","Wochenende","F","A"]
[null,null,null,null,null,null,"2024-12-08","So","Maria Empfängnis","F","F"]
[null,null,null,null,null,null,"2024-12-09","Mo","","A","A"]
[null,null,null,null,null,null,"2024-12-10","Di","","A","A"]
[null,null,null,null,null,null,"2024-12-11","Mi","","A","A"]
[null,null,null,null,null,null,"2024-12-12","Do","","A","A"]
[null,null,null,null,null,null,"2024-12-13","Fr","","A","A"]
[null,null,null,null,null,null,"2024-12-14","Sa","Wochenende","F","A"]
[null,null,null,null,null,null,"2024-12-15","So","3. Advent","F","F"]
[null,null,null,null,null,null,"2024-12-16","Mo","","A","A"]
[null,null,null,null,null,null,"2024-12-17","Di","","A","A"]
[null,null,null,null,null,null,"2024-12-18","Mi","","A","A"]
[null,null,null,null,null,null,"2024-12-19","Do","","A","A"]
[null,null,null,null,null,null,"2024-12-20","Fr","","A","A"]
[null,null,null,null,null,null,"2024-12-21","Sa","Wochenende","F","A"]
[null,null,null,null,null,null,"2024-12-22","So","4. Advent","F","F"]
[null,null,null,null,null,null,"2024-12-23","Mo","","A","A"]
[null,null,null,null,null,null,"2024-12-24","Di","Hl. Abend","A","A"]
[null,null,null,null,null,null,"2024-12-25","Mi","Christtag","F","F"]
[null,null,null,null,null,null,"2024-12-26","Do","Stefanitag","F","F"]
[null,null,null,null,null,null,"2024-12-27","Fr","","A","A"]
[null,null,null,null,null,null,"2024-12-28","Sa","Wochenende","F","A"]
[null,null,null,null,null,null,"2024-12-29","So","Wochenende","F","F"]
[null,null,null,null,null,null,{"$f":"G365+1","v":"2024-12-30"},"Mo","","A","A"]
[null,null,null,null,null,null,{"$f":"G366+1","v":"2024-12-31"},"Di","Silvester","A","A"]

{"sheet":"MakroTest","index":17,"n_rows":0,"n_cols":0,"rows_kept":0,"cut":false,"hidden":false,"merged":[]}

{"sheet":"Dummy","index":18,"n_rows":0,"n_cols":0,"rows_kept":0,"cut":false,"hidden":true,"merged":[]}

{"sheet":"Test","index":19,"n_rows":0,"n_cols":0,"rows_kept":0,"cut":false,"hidden":true,"merged":[]}